You are viewing a plain text version of this content. The canonical link for it is here.
Posted to dev@lucene.apache.org by Apache Hudson Server <hu...@hudson.apache.org> on 2011/01/29 16:38:33 UTC

[HUDSON] Lucene-Solr-tests-only-trunk - Build # 4279 - Failure

Build: https://hudson.apache.org/hudson/job/Lucene-Solr-tests-only-trunk/4279/

4 tests failed.
REGRESSION:  org.apache.solr.client.solrj.SolrExampleBinaryTest.testPivotFacet

Error Message:
expected:<1> but was:<2>

Stack Trace:
junit.framework.AssertionFailedError: expected:<1> but was:<2>
	at org.apache.lucene.util.LuceneTestCase$LuceneTestCaseRunner.runChild(LuceneTestCase.java:1127)
	at org.apache.lucene.util.LuceneTestCase$LuceneTestCaseRunner.runChild(LuceneTestCase.java:1059)
	at org.apache.solr.client.solrj.SolrExampleTests.testPivotFacet(SolrExampleTests.java:650)


REGRESSION:  org.apache.solr.client.solrj.embedded.SolrExampleEmbeddedTest.testPivotFacet

Error Message:
expected:<1> but was:<2>

Stack Trace:
junit.framework.AssertionFailedError: expected:<1> but was:<2>
	at org.apache.lucene.util.LuceneTestCase$LuceneTestCaseRunner.runChild(LuceneTestCase.java:1127)
	at org.apache.lucene.util.LuceneTestCase$LuceneTestCaseRunner.runChild(LuceneTestCase.java:1059)
	at org.apache.solr.client.solrj.SolrExampleTests.testPivotFacet(SolrExampleTests.java:650)


REGRESSION:  org.apache.solr.client.solrj.embedded.SolrExampleJettyTest.testPivotFacet

Error Message:
expected:<1> but was:<2>

Stack Trace:
junit.framework.AssertionFailedError: expected:<1> but was:<2>
	at org.apache.lucene.util.LuceneTestCase$LuceneTestCaseRunner.runChild(LuceneTestCase.java:1127)
	at org.apache.lucene.util.LuceneTestCase$LuceneTestCaseRunner.runChild(LuceneTestCase.java:1059)
	at org.apache.solr.client.solrj.SolrExampleTests.testPivotFacet(SolrExampleTests.java:650)


REGRESSION:  org.apache.solr.client.solrj.embedded.SolrExampleStreamingTest.testPivotFacet

Error Message:
expected:<1> but was:<2>

Stack Trace:
junit.framework.AssertionFailedError: expected:<1> but was:<2>
	at org.apache.lucene.util.LuceneTestCase$LuceneTestCaseRunner.runChild(LuceneTestCase.java:1127)
	at org.apache.lucene.util.LuceneTestCase$LuceneTestCaseRunner.runChild(LuceneTestCase.java:1059)
	at org.apache.solr.client.solrj.SolrExampleTests.testPivotFacet(SolrExampleTests.java:650)




Build Log (for compile errors):
[...truncated 8294 lines...]



---------------------------------------------------------------------
To unsubscribe, e-mail: dev-unsubscribe@lucene.apache.org
For additional commands, e-mail: dev-help@lucene.apache.org


[HUDSON] Lucene-Solr-tests-only-trunk - Build # 4281 - Still Failing

Posted by Apache Hudson Server <hu...@hudson.apache.org>.
Build: https://hudson.apache.org/hudson/job/Lucene-Solr-tests-only-trunk/4281/

4 tests failed.
FAILED:  org.apache.solr.client.solrj.SolrExampleBinaryTest.testPivotFacet

Error Message:
expected:<1> but was:<2>

Stack Trace:
junit.framework.AssertionFailedError: expected:<1> but was:<2>
	at org.apache.lucene.util.LuceneTestCase$LuceneTestCaseRunner.runChild(LuceneTestCase.java:1127)
	at org.apache.lucene.util.LuceneTestCase$LuceneTestCaseRunner.runChild(LuceneTestCase.java:1059)
	at org.apache.solr.client.solrj.SolrExampleTests.testPivotFacet(SolrExampleTests.java:650)


FAILED:  org.apache.solr.client.solrj.embedded.SolrExampleEmbeddedTest.testPivotFacet

Error Message:
expected:<1> but was:<2>

Stack Trace:
junit.framework.AssertionFailedError: expected:<1> but was:<2>
	at org.apache.lucene.util.LuceneTestCase$LuceneTestCaseRunner.runChild(LuceneTestCase.java:1127)
	at org.apache.lucene.util.LuceneTestCase$LuceneTestCaseRunner.runChild(LuceneTestCase.java:1059)
	at org.apache.solr.client.solrj.SolrExampleTests.testPivotFacet(SolrExampleTests.java:650)


FAILED:  org.apache.solr.client.solrj.embedded.SolrExampleJettyTest.testPivotFacet

Error Message:
expected:<1> but was:<2>

Stack Trace:
junit.framework.AssertionFailedError: expected:<1> but was:<2>
	at org.apache.lucene.util.LuceneTestCase$LuceneTestCaseRunner.runChild(LuceneTestCase.java:1127)
	at org.apache.lucene.util.LuceneTestCase$LuceneTestCaseRunner.runChild(LuceneTestCase.java:1059)
	at org.apache.solr.client.solrj.SolrExampleTests.testPivotFacet(SolrExampleTests.java:650)


FAILED:  org.apache.solr.client.solrj.embedded.SolrExampleStreamingTest.testPivotFacet

Error Message:
expected:<1> but was:<2>

Stack Trace:
junit.framework.AssertionFailedError: expected:<1> but was:<2>
	at org.apache.lucene.util.LuceneTestCase$LuceneTestCaseRunner.runChild(LuceneTestCase.java:1127)
	at org.apache.lucene.util.LuceneTestCase$LuceneTestCaseRunner.runChild(LuceneTestCase.java:1059)
	at org.apache.solr.client.solrj.SolrExampleTests.testPivotFacet(SolrExampleTests.java:650)




Build Log (for compile errors):
[...truncated 8295 lines...]



---------------------------------------------------------------------
To unsubscribe, e-mail: dev-unsubscribe@lucene.apache.org
For additional commands, e-mail: dev-help@lucene.apache.org


Re: [HUDSON] Lucene-Solr-tests-only-trunk - Build # 4280 - Still Failing

Posted by Koji Sekiguchi <ko...@r.email.ne.jp>.
Uh, sorry. Thanks Yonik!

Koji

(11/01/30 1:20), Yonik Seeley wrote:
> I'm looking at this now - seems due to koji's fix to minCount comparison.
> I'm trying to figure out if the test or the code is in error, but this
> test is hard to understand w/ it's get(0).get(1) type of stuff (w/ no
> comments about what path it is).
>
> -Yonik
> http://lucidimagination.com
>
>
>
> On Sat, Jan 29, 2011 at 11:03 AM, Apache Hudson Server
> <hu...@hudson.apache.org>  wrote:
>> Build: https://hudson.apache.org/hudson/job/Lucene-Solr-tests-only-trunk/4280/
>>
>> 4 tests failed.
>> FAILED:  org.apache.solr.client.solrj.SolrExampleBinaryTest.testPivotFacet
>>
>> Error Message:
>> expected:<1>  but was:<2>
>>
>> Stack Trace:
>> junit.framework.AssertionFailedError: expected:<1>  but was:<2>
>>         at org.apache.lucene.util.LuceneTestCase$LuceneTestCaseRunner.runChild(LuceneTestCase.java:1127)
>>         at org.apache.lucene.util.LuceneTestCase$LuceneTestCaseRunner.runChild(LuceneTestCase.java:1059)
>>         at org.apache.solr.client.solrj.SolrExampleTests.testPivotFacet(SolrExampleTests.java:650)
>>
>>

-- 
http://www.rondhuit.com/en/

---------------------------------------------------------------------
To unsubscribe, e-mail: dev-unsubscribe@lucene.apache.org
For additional commands, e-mail: dev-help@lucene.apache.org


Re: [HUDSON] Lucene-Solr-tests-only-trunk - Build # 4280 - Still Failing

Posted by Yonik Seeley <yo...@lucidimagination.com>.
I'm looking at this now - seems due to koji's fix to minCount comparison.
I'm trying to figure out if the test or the code is in error, but this
test is hard to understand w/ it's get(0).get(1) type of stuff (w/ no
comments about what path it is).

-Yonik
http://lucidimagination.com



On Sat, Jan 29, 2011 at 11:03 AM, Apache Hudson Server
<hu...@hudson.apache.org> wrote:
> Build: https://hudson.apache.org/hudson/job/Lucene-Solr-tests-only-trunk/4280/
>
> 4 tests failed.
> FAILED:  org.apache.solr.client.solrj.SolrExampleBinaryTest.testPivotFacet
>
> Error Message:
> expected:<1> but was:<2>
>
> Stack Trace:
> junit.framework.AssertionFailedError: expected:<1> but was:<2>
>        at org.apache.lucene.util.LuceneTestCase$LuceneTestCaseRunner.runChild(LuceneTestCase.java:1127)
>        at org.apache.lucene.util.LuceneTestCase$LuceneTestCaseRunner.runChild(LuceneTestCase.java:1059)
>        at org.apache.solr.client.solrj.SolrExampleTests.testPivotFacet(SolrExampleTests.java:650)
>
>
> FAILED:  org.apache.solr.client.solrj.embedded.SolrExampleEmbeddedTest.testPivotFacet
>
> Error Message:
> expected:<1> but was:<2>
>
> Stack Trace:
> junit.framework.AssertionFailedError: expected:<1> but was:<2>
>        at org.apache.lucene.util.LuceneTestCase$LuceneTestCaseRunner.runChild(LuceneTestCase.java:1127)
>        at org.apache.lucene.util.LuceneTestCase$LuceneTestCaseRunner.runChild(LuceneTestCase.java:1059)
>        at org.apache.solr.client.solrj.SolrExampleTests.testPivotFacet(SolrExampleTests.java:650)
>
>
> FAILED:  org.apache.solr.client.solrj.embedded.SolrExampleJettyTest.testPivotFacet
>
> Error Message:
> expected:<1> but was:<2>
>
> Stack Trace:
> junit.framework.AssertionFailedError: expected:<1> but was:<2>
>        at org.apache.lucene.util.LuceneTestCase$LuceneTestCaseRunner.runChild(LuceneTestCase.java:1127)
>        at org.apache.lucene.util.LuceneTestCase$LuceneTestCaseRunner.runChild(LuceneTestCase.java:1059)
>        at org.apache.solr.client.solrj.SolrExampleTests.testPivotFacet(SolrExampleTests.java:650)
>
>
> FAILED:  org.apache.solr.client.solrj.embedded.SolrExampleStreamingTest.testPivotFacet
>
> Error Message:
> expected:<1> but was:<2>
>
> Stack Trace:
> junit.framework.AssertionFailedError: expected:<1> but was:<2>
>        at org.apache.lucene.util.LuceneTestCase$LuceneTestCaseRunner.runChild(LuceneTestCase.java:1127)
>        at org.apache.lucene.util.LuceneTestCase$LuceneTestCaseRunner.runChild(LuceneTestCase.java:1059)
>        at org.apache.solr.client.solrj.SolrExampleTests.testPivotFacet(SolrExampleTests.java:650)
>
>
>
>
> Build Log (for compile errors):
> [...truncated 8279 lines...]
>
>
>
> ---------------------------------------------------------------------
> To unsubscribe, e-mail: dev-unsubscribe@lucene.apache.org
> For additional commands, e-mail: dev-help@lucene.apache.org
>
>

---------------------------------------------------------------------
To unsubscribe, e-mail: dev-unsubscribe@lucene.apache.org
For additional commands, e-mail: dev-help@lucene.apache.org


[HUDSON] Lucene-Solr-tests-only-trunk - Build # 4280 - Still Failing

Posted by Apache Hudson Server <hu...@hudson.apache.org>.
Build: https://hudson.apache.org/hudson/job/Lucene-Solr-tests-only-trunk/4280/

4 tests failed.
FAILED:  org.apache.solr.client.solrj.SolrExampleBinaryTest.testPivotFacet

Error Message:
expected:<1> but was:<2>

Stack Trace:
junit.framework.AssertionFailedError: expected:<1> but was:<2>
	at org.apache.lucene.util.LuceneTestCase$LuceneTestCaseRunner.runChild(LuceneTestCase.java:1127)
	at org.apache.lucene.util.LuceneTestCase$LuceneTestCaseRunner.runChild(LuceneTestCase.java:1059)
	at org.apache.solr.client.solrj.SolrExampleTests.testPivotFacet(SolrExampleTests.java:650)


FAILED:  org.apache.solr.client.solrj.embedded.SolrExampleEmbeddedTest.testPivotFacet

Error Message:
expected:<1> but was:<2>

Stack Trace:
junit.framework.AssertionFailedError: expected:<1> but was:<2>
	at org.apache.lucene.util.LuceneTestCase$LuceneTestCaseRunner.runChild(LuceneTestCase.java:1127)
	at org.apache.lucene.util.LuceneTestCase$LuceneTestCaseRunner.runChild(LuceneTestCase.java:1059)
	at org.apache.solr.client.solrj.SolrExampleTests.testPivotFacet(SolrExampleTests.java:650)


FAILED:  org.apache.solr.client.solrj.embedded.SolrExampleJettyTest.testPivotFacet

Error Message:
expected:<1> but was:<2>

Stack Trace:
junit.framework.AssertionFailedError: expected:<1> but was:<2>
	at org.apache.lucene.util.LuceneTestCase$LuceneTestCaseRunner.runChild(LuceneTestCase.java:1127)
	at org.apache.lucene.util.LuceneTestCase$LuceneTestCaseRunner.runChild(LuceneTestCase.java:1059)
	at org.apache.solr.client.solrj.SolrExampleTests.testPivotFacet(SolrExampleTests.java:650)


FAILED:  org.apache.solr.client.solrj.embedded.SolrExampleStreamingTest.testPivotFacet

Error Message:
expected:<1> but was:<2>

Stack Trace:
junit.framework.AssertionFailedError: expected:<1> but was:<2>
	at org.apache.lucene.util.LuceneTestCase$LuceneTestCaseRunner.runChild(LuceneTestCase.java:1127)
	at org.apache.lucene.util.LuceneTestCase$LuceneTestCaseRunner.runChild(LuceneTestCase.java:1059)
	at org.apache.solr.client.solrj.SolrExampleTests.testPivotFacet(SolrExampleTests.java:650)




Build Log (for compile errors):
[...truncated 8279 lines...]



---------------------------------------------------------------------
To unsubscribe, e-mail: dev-unsubscribe@lucene.apache.org
For additional commands, e-mail: dev-help@lucene.apache.org