You are viewing a plain text version of this content. The canonical link for it is here.
Posted to builds@beam.apache.org by Apache Jenkins Server <je...@builds.apache.org> on 2021/08/10 12:55:37 UTC

Build failed in Jenkins: beam_PostCommit_XVR_Spark3 #547

See <https://ci-beam.apache.org/job/beam_PostCommit_XVR_Spark3/547/display/redirect>

Changes:


------------------------------------------
[...truncated 81.07 KB...]
> Task :runners:spark:3:job-server:sparkJobServerSetup

> Task :sdks:python:sdist
RefactoringTool: Refactored <https://ci-beam.apache.org/job/beam_PostCommit_XVR_Spark3/ws/src/sdks/python/apache_beam/portability/api/beam_expansion_api_pb2.py>
RefactoringTool: Refactored <https://ci-beam.apache.org/job/beam_PostCommit_XVR_Spark3/ws/src/sdks/python/apache_beam/portability/api/beam_expansion_api_pb2_grpc.py>

> Task :sdks:java:extensions:sql:expansion-service:shadowJar FROM-CACHE

> Task :sdks:python:sdist
RefactoringTool: Refactored <https://ci-beam.apache.org/job/beam_PostCommit_XVR_Spark3/ws/src/sdks/python/apache_beam/portability/api/beam_fn_api_pb2.py>
RefactoringTool: Refactored <https://ci-beam.apache.org/job/beam_PostCommit_XVR_Spark3/ws/src/sdks/python/apache_beam/portability/api/beam_fn_api_pb2_grpc.py>
RefactoringTool: Refactored <https://ci-beam.apache.org/job/beam_PostCommit_XVR_Spark3/ws/src/sdks/python/apache_beam/portability/api/beam_interactive_api_pb2.py>
RefactoringTool: Refactored <https://ci-beam.apache.org/job/beam_PostCommit_XVR_Spark3/ws/src/sdks/python/apache_beam/portability/api/beam_job_api_pb2.py>
RefactoringTool: Refactored <https://ci-beam.apache.org/job/beam_PostCommit_XVR_Spark3/ws/src/sdks/python/apache_beam/portability/api/beam_job_api_pb2_grpc.py>
RefactoringTool: Refactored <https://ci-beam.apache.org/job/beam_PostCommit_XVR_Spark3/ws/src/sdks/python/apache_beam/portability/api/beam_provision_api_pb2.py>
RefactoringTool: Refactored <https://ci-beam.apache.org/job/beam_PostCommit_XVR_Spark3/ws/src/sdks/python/apache_beam/portability/api/beam_provision_api_pb2_grpc.py>
RefactoringTool: Refactored <https://ci-beam.apache.org/job/beam_PostCommit_XVR_Spark3/ws/src/sdks/python/apache_beam/portability/api/beam_runner_api_pb2.py>
RefactoringTool: Refactored <https://ci-beam.apache.org/job/beam_PostCommit_XVR_Spark3/ws/src/sdks/python/apache_beam/portability/api/beam_runner_api_pb2_grpc.py>
RefactoringTool: No changes to <https://ci-beam.apache.org/job/beam_PostCommit_XVR_Spark3/ws/src/sdks/python/apache_beam/portability/api/endpoints_pb2.py>
RefactoringTool: Refactored <https://ci-beam.apache.org/job/beam_PostCommit_XVR_Spark3/ws/src/sdks/python/apache_beam/portability/api/external_transforms_pb2.py>
RefactoringTool: Refactored <https://ci-beam.apache.org/job/beam_PostCommit_XVR_Spark3/ws/src/sdks/python/apache_beam/portability/api/metrics_pb2.py>
RefactoringTool: No changes to <https://ci-beam.apache.org/job/beam_PostCommit_XVR_Spark3/ws/src/sdks/python/apache_beam/portability/api/schema_pb2.py>
RefactoringTool: Refactored <https://ci-beam.apache.org/job/beam_PostCommit_XVR_Spark3/ws/src/sdks/python/apache_beam/portability/api/standard_window_fns_pb2.py>
RefactoringTool: Files that were modified:
RefactoringTool: <https://ci-beam.apache.org/job/beam_PostCommit_XVR_Spark3/ws/src/sdks/python/apache_beam/portability/api/beam_artifact_api_pb2.py>
RefactoringTool: <https://ci-beam.apache.org/job/beam_PostCommit_XVR_Spark3/ws/src/sdks/python/apache_beam/portability/api/beam_artifact_api_pb2_grpc.py>
RefactoringTool: <https://ci-beam.apache.org/job/beam_PostCommit_XVR_Spark3/ws/src/sdks/python/apache_beam/portability/api/beam_expansion_api_pb2.py>
RefactoringTool: <https://ci-beam.apache.org/job/beam_PostCommit_XVR_Spark3/ws/src/sdks/python/apache_beam/portability/api/beam_expansion_api_pb2_grpc.py>
RefactoringTool: <https://ci-beam.apache.org/job/beam_PostCommit_XVR_Spark3/ws/src/sdks/python/apache_beam/portability/api/beam_fn_api_pb2.py>
RefactoringTool: <https://ci-beam.apache.org/job/beam_PostCommit_XVR_Spark3/ws/src/sdks/python/apache_beam/portability/api/beam_fn_api_pb2_grpc.py>
RefactoringTool: <https://ci-beam.apache.org/job/beam_PostCommit_XVR_Spark3/ws/src/sdks/python/apache_beam/portability/api/beam_interactive_api_pb2.py>
RefactoringTool: <https://ci-beam.apache.org/job/beam_PostCommit_XVR_Spark3/ws/src/sdks/python/apache_beam/portability/api/beam_job_api_pb2.py>
RefactoringTool: <https://ci-beam.apache.org/job/beam_PostCommit_XVR_Spark3/ws/src/sdks/python/apache_beam/portability/api/beam_job_api_pb2_grpc.py>
RefactoringTool: <https://ci-beam.apache.org/job/beam_PostCommit_XVR_Spark3/ws/src/sdks/python/apache_beam/portability/api/beam_provision_api_pb2.py>
RefactoringTool: <https://ci-beam.apache.org/job/beam_PostCommit_XVR_Spark3/ws/src/sdks/python/apache_beam/portability/api/beam_provision_api_pb2_grpc.py>
RefactoringTool: <https://ci-beam.apache.org/job/beam_PostCommit_XVR_Spark3/ws/src/sdks/python/apache_beam/portability/api/beam_runner_api_pb2.py>
RefactoringTool: <https://ci-beam.apache.org/job/beam_PostCommit_XVR_Spark3/ws/src/sdks/python/apache_beam/portability/api/beam_runner_api_pb2_grpc.py>
RefactoringTool: <https://ci-beam.apache.org/job/beam_PostCommit_XVR_Spark3/ws/src/sdks/python/apache_beam/portability/api/endpoints_pb2.py>
RefactoringTool: <https://ci-beam.apache.org/job/beam_PostCommit_XVR_Spark3/ws/src/sdks/python/apache_beam/portability/api/external_transforms_pb2.py>
RefactoringTool: <https://ci-beam.apache.org/job/beam_PostCommit_XVR_Spark3/ws/src/sdks/python/apache_beam/portability/api/metrics_pb2.py>
RefactoringTool: <https://ci-beam.apache.org/job/beam_PostCommit_XVR_Spark3/ws/src/sdks/python/apache_beam/portability/api/schema_pb2.py>
RefactoringTool: <https://ci-beam.apache.org/job/beam_PostCommit_XVR_Spark3/ws/src/sdks/python/apache_beam/portability/api/standard_window_fns_pb2.py>
INFO:gen_protos:Writing urn stubs: <https://ci-beam.apache.org/job/beam_PostCommit_XVR_Spark3/ws/src/sdks/python/apache_beam/portability/api/metrics_pb2_urns.py>
INFO:gen_protos:Writing urn stubs: <https://ci-beam.apache.org/job/beam_PostCommit_XVR_Spark3/ws/src/sdks/python/apache_beam/portability/api/beam_artifact_api_pb2_urns.py>
INFO:gen_protos:Writing urn stubs: <https://ci-beam.apache.org/job/beam_PostCommit_XVR_Spark3/ws/src/sdks/python/apache_beam/portability/api/standard_window_fns_pb2_urns.py>
INFO:gen_protos:Writing urn stubs: <https://ci-beam.apache.org/job/beam_PostCommit_XVR_Spark3/ws/src/sdks/python/apache_beam/portability/api/beam_runner_api_pb2_urns.py>
warning: no files found matching 'README.md'
warning: no files found matching 'NOTICE'
warning: no files found matching 'LICENSE'
warning: no files found matching 'LICENSE.python'
warning: sdist: standard file not found: should have one of README, README.rst, README.txt, README.md


> Task :sdks:go:resolveBuildDependencies
Resolving golang.org/x/sys: commit='fde4db37ae7ad8191b03d30d27f258b5291ae4e3', urls=[https://go.googlesource.com/sys]

> Task :sdks:python:container:py36:copyDockerfileDependencies
> Task :sdks:python:installGcpTest

> Task :release:go-licenses:java:dockerRun
+ go-licenses save github.com/apache/beam/sdks/java/container --save_path=/output/licenses

> Task :release:go-licenses:py:dockerRun
+ go-licenses save github.com/apache/beam/sdks/python/container --save_path=/output/licenses

> Task :sdks:go:resolveBuildDependencies
Resolving golang.org/x/text: commit='23ae387dee1f90d29a23c0e87ee0b46038fbed0e', urls=[https://go.googlesource.com/text]
Resolving cached github.com/etcd-io/etcd: commit='11214aa33bf5a47d3d9d8dafe0f6b97237dfe921', urls=[https://github.com/etcd-io/etcd.git, git@github.com:etcd-io/etcd.git]

> Task :release:go-licenses:java:dockerRun
+ go-licenses csv github.com/apache/beam/sdks/java/container
+ tee /output/licenses/list.csv
+ chmod -R a+w /output/licenses

> Task :release:go-licenses:java:createLicenses
> Task :sdks:java:container:java8:copyGolangLicenses

> Task :release:go-licenses:py:dockerRun
+ go-licenses csv github.com/apache/beam/sdks/python/container
+ tee /output/licenses/list.csv
+ chmod -R a+w /output/licenses

> Task :release:go-licenses:py:createLicenses
> Task :sdks:python:container:py36:copyGolangLicenses

> Task :sdks:go:resolveBuildDependencies
Resolving google.golang.org/api: commit='0324d5e90dc7753607860272666845fad9ceb97e', urls=[https://code.googlesource.com/google-api-go-client]
Resolving google.golang.org/genproto: commit='4d944d34d83c502a5f761500a14d8842648415c3', urls=[https://github.com/google/go-genproto]
Resolving google.golang.org/grpc: commit='5e8f83304c0563d1ba74db05fee83d9c18ab9a58', urls=[https://github.com/grpc/grpc-go]
Resolving google.golang.org/protobuf: commit='d165be301fb1e13390ad453281ded24385fd8ebc', urls=[https://go.googlesource.com/protobuf]
Resolving cached github.com/etcd-io/etcd: commit='11214aa33bf5a47d3d9d8dafe0f6b97237dfe921', urls=[https://github.com/etcd-io/etcd.git, git@github.com:etcd-io/etcd.git]
Resolving cached github.com/etcd-io/etcd: commit='11214aa33bf5a47d3d9d8dafe0f6b97237dfe921', urls=[https://github.com/etcd-io/etcd.git, git@github.com:etcd-io/etcd.git]

> Task :sdks:go:installDependencies
> Task :sdks:go:buildLinuxAmd64
> Task :sdks:go:goBuild

> Task :sdks:java:container:resolveBuildDependencies
Resolving ./github.com/apache/beam/sdks/go@<https://ci-beam.apache.org/job/beam_PostCommit_XVR_Spark3/ws/src/sdks/go>

> Task :sdks:python:container:resolveBuildDependencies
Resolving ./github.com/apache/beam/sdks/go@<https://ci-beam.apache.org/job/beam_PostCommit_XVR_Spark3/ws/src/sdks/go>

> Task :sdks:java:container:installDependencies
> Task :sdks:python:container:installDependencies
> Task :sdks:java:container:buildLinuxAmd64
> Task :sdks:java:container:goBuild
> Task :sdks:python:container:buildDarwinAmd64
> Task :sdks:java:container:java8:copySdkHarnessLauncher
> Task :sdks:java:container:java8:dockerPrepare
> Task :sdks:python:container:buildLinuxAmd64
> Task :sdks:python:container:goBuild
> Task :sdks:python:container:py36:copyLauncherDependencies
> Task :sdks:python:container:py36:dockerPrepare
> Task :sdks:java:container:java8:docker
> Task :sdks:python:container:py36:docker
> Task :runners:spark:3:job-server:validatesCrossLanguageRunnerSetup
> Task :runners:spark:3:job-server:validatesCrossLanguageRunnerJavaUsingJava
> Task :runners:spark:3:job-server:validatesCrossLanguageRunnerJavaUsingPython

org.apache.beam.runners.core.construction.ValidateRunnerXlangTest > partitionTest FAILED
    org.apache.beam.vendor.grpc.v1p36p0.io.grpc.StatusRuntimeException at ValidateRunnerXlangTest.java:126
        Caused by: org.apache.beam.vendor.grpc.v1p36p0.io.netty.channel.AbstractChannel$AnnotatedConnectException
            Caused by: java.net.ConnectException at Errors.java:124

org.apache.beam.runners.core.construction.ValidateRunnerXlangTest > coGroupByKeyTest FAILED
    org.apache.beam.vendor.grpc.v1p36p0.io.grpc.StatusRuntimeException at ValidateRunnerXlangTest.java:232
        Caused by: org.apache.beam.vendor.grpc.v1p36p0.io.netty.channel.AbstractChannel$AnnotatedConnectException
            Caused by: java.net.ConnectException at Errors.java:124
    java.lang.NullPointerException at ValidateRunnerXlangTest.java:125

org.apache.beam.runners.core.construction.ValidateRunnerXlangTest > groupByKeyTest FAILED
    org.apache.beam.vendor.grpc.v1p36p0.io.grpc.StatusRuntimeException at ValidateRunnerXlangTest.java:200
        Caused by: org.apache.beam.vendor.grpc.v1p36p0.io.netty.channel.AbstractChannel$AnnotatedConnectException
            Caused by: java.net.ConnectException at Errors.java:124
    java.lang.NullPointerException at ValidateRunnerXlangTest.java:125

org.apache.beam.runners.core.construction.ValidateRunnerXlangTest > combinePerKeyTest FAILED
    org.apache.beam.vendor.grpc.v1p36p0.io.grpc.StatusRuntimeException at ValidateRunnerXlangTest.java:277
        Caused by: org.apache.beam.vendor.grpc.v1p36p0.io.netty.channel.AbstractChannel$AnnotatedConnectException
            Caused by: java.net.ConnectException at Errors.java:124
    java.lang.NullPointerException at ValidateRunnerXlangTest.java:125

org.apache.beam.runners.core.construction.ValidateRunnerXlangTest > flattenTest FAILED
    org.apache.beam.vendor.grpc.v1p36p0.io.grpc.StatusRuntimeException at ValidateRunnerXlangTest.java:297
        Caused by: org.apache.beam.vendor.grpc.v1p36p0.io.netty.channel.AbstractChannel$AnnotatedConnectException
            Caused by: java.net.ConnectException at Errors.java:124
    java.lang.NullPointerException at ValidateRunnerXlangTest.java:125

org.apache.beam.runners.core.construction.ValidateRunnerXlangTest > singleInputOutputTest FAILED
    org.apache.beam.vendor.grpc.v1p36p0.io.grpc.StatusRuntimeException at ValidateRunnerXlangTest.java:158
        Caused by: org.apache.beam.vendor.grpc.v1p36p0.io.netty.channel.AbstractChannel$AnnotatedConnectException
            Caused by: java.net.ConnectException at Errors.java:124
    java.lang.NullPointerException at ValidateRunnerXlangTest.java:125

org.apache.beam.runners.core.construction.ValidateRunnerXlangTest > multiInputOutputWithSideInputTest FAILED
    org.apache.beam.vendor.grpc.v1p36p0.io.grpc.StatusRuntimeException at ValidateRunnerXlangTest.java:180
        Caused by: org.apache.beam.vendor.grpc.v1p36p0.io.netty.channel.AbstractChannel$AnnotatedConnectException
            Caused by: java.net.ConnectException at Errors.java:124
    java.lang.NullPointerException at ValidateRunnerXlangTest.java:125

8 tests completed, 7 failed

> Task :runners:spark:3:job-server:validatesCrossLanguageRunnerJavaUsingPython FAILED
> Task :runners:spark:3:job-server:validatesCrossLanguageRunnerJavaUsingPythonOnly

org.apache.beam.runners.core.construction.ValidateRunnerXlangTest > pythonDependenciesTest FAILED
    org.apache.beam.vendor.grpc.v1p36p0.io.grpc.StatusRuntimeException at ValidateRunnerXlangTest.java:340
        Caused by: org.apache.beam.vendor.grpc.v1p36p0.io.netty.channel.AbstractChannel$AnnotatedConnectException
            Caused by: java.net.ConnectException at Errors.java:124
    java.lang.NullPointerException at ValidateRunnerXlangTest.java:125

1 test completed, 1 failed

> Task :runners:spark:3:job-server:validatesCrossLanguageRunnerJavaUsingPythonOnly FAILED
> Task :runners:spark:3:job-server:validatesCrossLanguageRunnerPythonUsingJava
> Task :runners:spark:3:job-server:validatesCrossLanguageRunnerPythonUsingJava FAILED
> Task :runners:spark:3:job-server:validatesCrossLanguageRunnerPythonUsingPython FAILED
> Task :runners:spark:3:job-server:validatesCrossLanguageRunnerPythonUsingSql
> Task :runners:spark:3:job-server:validatesCrossLanguageRunnerPythonUsingSql FAILED
> Task :runners:spark:3:job-server:validatesCrossLanguageRunnerCleanup
> Task :runners:spark:3:job-server:sparkJobServerCleanup

FAILURE: Build completed with 5 failures.

1: Task failed with an exception.
-----------
* What went wrong:
Execution failed for task ':runners:spark:3:job-server:validatesCrossLanguageRunnerJavaUsingPython'.
> There were failing tests. See the report at: file://<https://ci-beam.apache.org/job/beam_PostCommit_XVR_Spark3/ws/src/runners/spark/3/job-server/build/reports/tests/validatesCrossLanguageRunnerJavaUsingPython/index.html>

* Try:
Run with --stacktrace option to get the stack trace. Run with --info or --debug option to get more log output. Run with --scan to get full insights.
==============================================================================

2: Task failed with an exception.
-----------
* What went wrong:
Execution failed for task ':runners:spark:3:job-server:validatesCrossLanguageRunnerJavaUsingPythonOnly'.
> There were failing tests. See the report at: file://<https://ci-beam.apache.org/job/beam_PostCommit_XVR_Spark3/ws/src/runners/spark/3/job-server/build/reports/tests/validatesCrossLanguageRunnerJavaUsingPythonOnly/index.html>

* Try:
Run with --stacktrace option to get the stack trace. Run with --info or --debug option to get more log output. Run with --scan to get full insights.
==============================================================================

3: Task failed with an exception.
-----------
* What went wrong:
Execution failed for task ':runners:spark:3:job-server:validatesCrossLanguageRunnerPythonUsingJava'.
> Process 'command 'sh'' finished with non-zero exit value 1

* Try:
Run with --stacktrace option to get the stack trace. Run with --info or --debug option to get more log output. Run with --scan to get full insights.
==============================================================================

4: Task failed with an exception.
-----------
* What went wrong:
Execution failed for task ':runners:spark:3:job-server:validatesCrossLanguageRunnerPythonUsingPython'.
> Process 'command 'sh'' finished with non-zero exit value 1

* Try:
Run with --stacktrace option to get the stack trace. Run with --info or --debug option to get more log output. Run with --scan to get full insights.
==============================================================================

5: Task failed with an exception.
-----------
* What went wrong:
Execution failed for task ':runners:spark:3:job-server:validatesCrossLanguageRunnerPythonUsingSql'.
> Process 'command 'sh'' finished with non-zero exit value 1

* Try:
Run with --stacktrace option to get the stack trace. Run with --info or --debug option to get more log output. Run with --scan to get full insights.
==============================================================================

* Get more help at https://help.gradle.org

Deprecated Gradle features were used in this build, making it incompatible with Gradle 7.0.
Use '--warning-mode all' to show the individual deprecation warnings.
See https://docs.gradle.org/6.8.3/userguide/command_line_interface.html#sec:command_line_warnings

BUILD FAILED in 53m 30s
185 actionable tasks: 133 executed, 48 from cache, 4 up-to-date

Publishing build scan...
https://gradle.com/s/fzp6wkreur5re

Build step 'Invoke Gradle script' changed build result to FAILURE
Build step 'Invoke Gradle script' marked build as failure

---------------------------------------------------------------------
To unsubscribe, e-mail: builds-unsubscribe@beam.apache.org
For additional commands, e-mail: builds-help@beam.apache.org


Jenkins build is back to normal : beam_PostCommit_XVR_Spark3 #549

Posted by Apache Jenkins Server <je...@builds.apache.org>.
See <https://ci-beam.apache.org/job/beam_PostCommit_XVR_Spark3/549/display/redirect?page=changes>


---------------------------------------------------------------------
To unsubscribe, e-mail: builds-unsubscribe@beam.apache.org
For additional commands, e-mail: builds-help@beam.apache.org


Build failed in Jenkins: beam_PostCommit_XVR_Spark3 #548

Posted by Apache Jenkins Server <je...@builds.apache.org>.
See <https://ci-beam.apache.org/job/beam_PostCommit_XVR_Spark3/548/display/redirect?page=changes>

Changes:

[chamikaramj] Fix typo

[noreply] [BEAM-12403][BEAM-12348] Add User State Support for Portable SamzaRunner


------------------------------------------
[...truncated 555.33 KB...]
apache_beam/pipeline.py:565: in run
    return self.runner.run_pipeline(self, self._options)
apache_beam/runners/portability/portable_runner.py:438: in run_pipeline
    job_service_handle = self.create_job_service(options)
apache_beam/runners/portability/portable_runner.py:317: in create_job_service
    return self.create_job_service_handle(server.start(), options)
apache_beam/runners/portability/job_server.py:54: in start
    grpc.channel_ready_future(channel).result(timeout=self._timeout)
../../build/gradleenv/1922375555/lib/python3.6/site-packages/grpc/_utilities.py:140: in result
    self._block(timeout)
_ _ _ _ _ _ _ _ _ _ _ _ _ _ _ _ _ _ _ _ _ _ _ _ _ _ _ _ _ _ _ _ _ _ _ _ _ _ _ _ 

self = <grpc._utilities._ChannelReadyFuture object at 0x7f2a85d445c0>
timeout = 60

    def _block(self, timeout):
        until = None if timeout is None else time.time() + timeout
        with self._condition:
            while True:
                if self._cancelled:
                    raise grpc.FutureCancelledError()
                elif self._matured:
                    return
                else:
                    if until is None:
                        self._condition.wait()
                    else:
                        remaining = until - time.time()
                        if remaining < 0:
>                           raise grpc.FutureTimeoutError()
E                           grpc.FutureTimeoutError

../../build/gradleenv/1922375555/lib/python3.6/site-packages/grpc/_utilities.py:86: FutureTimeoutError
----------------------------- Captured stderr call -----------------------------
WARNING:root:Make sure that locally built Python SDK docker image has Python 3.6 interpreter.
WARNING:root:Make sure that locally built Python SDK docker image has Python 3.6 interpreter.
------------------------------ Captured log call -------------------------------
WARNING  root:environments.py:374 Make sure that locally built Python SDK docker image has Python 3.6 interpreter.
WARNING  root:environments.py:374 Make sure that locally built Python SDK docker image has Python 3.6 interpreter.
__________________ SqlTransformTest.test_windowing_before_sql __________________

self = <apache_beam.transforms.sql_test.SqlTransformTest testMethod=test_windowing_before_sql>

    def test_windowing_before_sql(self):
      with TestPipeline() as p:
        out = (
            p | beam.Create([
                SimpleRow(5, "foo", 1.),
                SimpleRow(15, "bar", 2.),
                SimpleRow(25, "baz", 3.)
            ])
            | beam.Map(lambda v: beam.window.TimestampedValue(v, v.id)).
            with_output_types(SimpleRow)
            | beam.WindowInto(
                beam.window.FixedWindows(10)).with_output_types(SimpleRow)
            | SqlTransform("SELECT COUNT(*) as `count` FROM PCOLLECTION"))
>       assert_that(out, equal_to([(1, ), (1, ), (1, )]))

apache_beam/transforms/sql_test.py:175: 
_ _ _ _ _ _ _ _ _ _ _ _ _ _ _ _ _ _ _ _ _ _ _ _ _ _ _ _ _ _ _ _ _ _ _ _ _ _ _ _ 
apache_beam/pipeline.py:586: in __exit__
    self.result = self.run()
apache_beam/testing/test_pipeline.py:114: in run
    False if self.not_use_test_runner_api else test_runner_api))
apache_beam/pipeline.py:565: in run
    return self.runner.run_pipeline(self, self._options)
apache_beam/runners/portability/portable_runner.py:438: in run_pipeline
    job_service_handle = self.create_job_service(options)
apache_beam/runners/portability/portable_runner.py:317: in create_job_service
    return self.create_job_service_handle(server.start(), options)
apache_beam/runners/portability/job_server.py:54: in start
    grpc.channel_ready_future(channel).result(timeout=self._timeout)
../../build/gradleenv/1922375555/lib/python3.6/site-packages/grpc/_utilities.py:140: in result
    self._block(timeout)
_ _ _ _ _ _ _ _ _ _ _ _ _ _ _ _ _ _ _ _ _ _ _ _ _ _ _ _ _ _ _ _ _ _ _ _ _ _ _ _ 

self = <grpc._utilities._ChannelReadyFuture object at 0x7f2a85c6e860>
timeout = 60

    def _block(self, timeout):
        until = None if timeout is None else time.time() + timeout
        with self._condition:
            while True:
                if self._cancelled:
                    raise grpc.FutureCancelledError()
                elif self._matured:
                    return
                else:
                    if until is None:
                        self._condition.wait()
                    else:
                        remaining = until - time.time()
                        if remaining < 0:
>                           raise grpc.FutureTimeoutError()
E                           grpc.FutureTimeoutError

../../build/gradleenv/1922375555/lib/python3.6/site-packages/grpc/_utilities.py:86: FutureTimeoutError
----------------------------- Captured stderr call -----------------------------
WARNING:root:Make sure that locally built Python SDK docker image has Python 3.6 interpreter.
WARNING:root:Make sure that locally built Python SDK docker image has Python 3.6 interpreter.
------------------------------ Captured log call -------------------------------
WARNING  root:environments.py:374 Make sure that locally built Python SDK docker image has Python 3.6 interpreter.
WARNING  root:environments.py:374 Make sure that locally built Python SDK docker image has Python 3.6 interpreter.
_________________ SqlTransformTest.test_zetasql_generate_data __________________

self = <apache_beam.transforms.sql_test.SqlTransformTest testMethod=test_zetasql_generate_data>

    def test_zetasql_generate_data(self):
      with TestPipeline() as p:
        out = p | SqlTransform(
            """SELECT
              CAST(1 AS INT64) AS `int`,
              CAST('foo' AS STRING) AS `str`,
              CAST(3.14  AS FLOAT64) AS `flt`""",
            dialect="zetasql")
>       assert_that(out, equal_to([(1, "foo", 3.14)]))

apache_beam/transforms/sql_test.py:160: 
_ _ _ _ _ _ _ _ _ _ _ _ _ _ _ _ _ _ _ _ _ _ _ _ _ _ _ _ _ _ _ _ _ _ _ _ _ _ _ _ 
apache_beam/pipeline.py:586: in __exit__
    self.result = self.run()
apache_beam/testing/test_pipeline.py:114: in run
    False if self.not_use_test_runner_api else test_runner_api))
apache_beam/pipeline.py:565: in run
    return self.runner.run_pipeline(self, self._options)
apache_beam/runners/portability/portable_runner.py:438: in run_pipeline
    job_service_handle = self.create_job_service(options)
apache_beam/runners/portability/portable_runner.py:317: in create_job_service
    return self.create_job_service_handle(server.start(), options)
apache_beam/runners/portability/job_server.py:54: in start
    grpc.channel_ready_future(channel).result(timeout=self._timeout)
../../build/gradleenv/1922375555/lib/python3.6/site-packages/grpc/_utilities.py:140: in result
    self._block(timeout)
_ _ _ _ _ _ _ _ _ _ _ _ _ _ _ _ _ _ _ _ _ _ _ _ _ _ _ _ _ _ _ _ _ _ _ _ _ _ _ _ 

self = <grpc._utilities._ChannelReadyFuture object at 0x7f2a85cb1ef0>
timeout = 60

    def _block(self, timeout):
        until = None if timeout is None else time.time() + timeout
        with self._condition:
            while True:
                if self._cancelled:
                    raise grpc.FutureCancelledError()
                elif self._matured:
                    return
                else:
                    if until is None:
                        self._condition.wait()
                    else:
                        remaining = until - time.time()
                        if remaining < 0:
>                           raise grpc.FutureTimeoutError()
E                           grpc.FutureTimeoutError

../../build/gradleenv/1922375555/lib/python3.6/site-packages/grpc/_utilities.py:86: FutureTimeoutError
----------------------------- Captured stderr call -----------------------------
WARNING:root:Make sure that locally built Python SDK docker image has Python 3.6 interpreter.
WARNING:root:Make sure that locally built Python SDK docker image has Python 3.6 interpreter.
------------------------------ Captured log call -------------------------------
WARNING  root:environments.py:374 Make sure that locally built Python SDK docker image has Python 3.6 interpreter.
WARNING  root:environments.py:374 Make sure that locally built Python SDK docker image has Python 3.6 interpreter.
- generated xml file: <https://ci-beam.apache.org/job/beam_PostCommit_XVR_Spark3/ws/src/sdks/python/pytest_xlangSqlValidateRunner.xml> -
================= 9 failed, 4962 deselected in 650.15 seconds ==================

> Task :runners:spark:3:job-server:validatesCrossLanguageRunnerPythonUsingSql FAILED

> Task :runners:spark:3:job-server:validatesCrossLanguageRunnerCleanup
Skipping invalid pid: 13243.
Stopping expansion service pid: 13250.

> Task :runners:spark:3:job-server:sparkJobServerCleanup

FAILURE: Build completed with 6 failures.

1: Task failed with an exception.
-----------
* What went wrong:
Execution failed for task ':runners:spark:3:job-server:validatesCrossLanguageRunnerJavaUsingJava'.
> There were failing tests. See the report at: file://<https://ci-beam.apache.org/job/beam_PostCommit_XVR_Spark3/ws/src/runners/spark/3/job-server/build/reports/tests/validatesCrossLanguageRunnerJavaUsingJava/index.html>

* Try:
Run with --stacktrace option to get the stack trace. Run with --info or --debug option to get more log output. Run with --scan to get full insights.
==============================================================================

2: Task failed with an exception.
-----------
* What went wrong:
Execution failed for task ':runners:spark:3:job-server:validatesCrossLanguageRunnerJavaUsingPython'.
> There were failing tests. See the report at: file://<https://ci-beam.apache.org/job/beam_PostCommit_XVR_Spark3/ws/src/runners/spark/3/job-server/build/reports/tests/validatesCrossLanguageRunnerJavaUsingPython/index.html>

* Try:
Run with --stacktrace option to get the stack trace. Run with --info or --debug option to get more log output. Run with --scan to get full insights.
==============================================================================

3: Task failed with an exception.
-----------
* What went wrong:
Execution failed for task ':runners:spark:3:job-server:validatesCrossLanguageRunnerJavaUsingPythonOnly'.
> There were failing tests. See the report at: file://<https://ci-beam.apache.org/job/beam_PostCommit_XVR_Spark3/ws/src/runners/spark/3/job-server/build/reports/tests/validatesCrossLanguageRunnerJavaUsingPythonOnly/index.html>

* Try:
Run with --stacktrace option to get the stack trace. Run with --info or --debug option to get more log output. Run with --scan to get full insights.
==============================================================================

4: Task failed with an exception.
-----------
* What went wrong:
Execution failed for task ':runners:spark:3:job-server:validatesCrossLanguageRunnerPythonUsingJava'.
> Process 'command 'sh'' finished with non-zero exit value 1

* Try:
Run with --stacktrace option to get the stack trace. Run with --info or --debug option to get more log output. Run with --scan to get full insights.
==============================================================================

5: Task failed with an exception.
-----------
* What went wrong:
Execution failed for task ':runners:spark:3:job-server:validatesCrossLanguageRunnerPythonUsingPython'.
> Process 'command 'sh'' finished with non-zero exit value 1

* Try:
Run with --stacktrace option to get the stack trace. Run with --info or --debug option to get more log output. Run with --scan to get full insights.
==============================================================================

6: Task failed with an exception.
-----------
* What went wrong:
Execution failed for task ':runners:spark:3:job-server:validatesCrossLanguageRunnerPythonUsingSql'.
> Process 'command 'sh'' finished with non-zero exit value 1

* Try:
Run with --stacktrace option to get the stack trace. Run with --info or --debug option to get more log output. Run with --scan to get full insights.
==============================================================================

* Get more help at https://help.gradle.org

Deprecated Gradle features were used in this build, making it incompatible with Gradle 7.0.
Use '--warning-mode all' to show the individual deprecation warnings.
See https://docs.gradle.org/6.8.3/userguide/command_line_interface.html#sec:command_line_warnings

BUILD FAILED in 55m 33s
185 actionable tasks: 133 executed, 48 from cache, 4 up-to-date

Publishing build scan...
https://gradle.com/s/bsjwa2iexujfq

Build step 'Invoke Gradle script' changed build result to FAILURE
Build step 'Invoke Gradle script' marked build as failure

---------------------------------------------------------------------
To unsubscribe, e-mail: builds-unsubscribe@beam.apache.org
For additional commands, e-mail: builds-help@beam.apache.org