You are viewing a plain text version of this content. The canonical link for it is here.
Posted to hdfs-dev@hadoop.apache.org by Apache Jenkins Server <hu...@hudson.apache.org> on 2011/05/20 02:32:48 UTC
Hadoop-Hdfs-trunk-Commit - Build # 673 - Still Failing
See https://builds.apache.org/hudson/job/Hadoop-Hdfs-trunk-Commit/673/
###################################################################################
########################## LAST 60 LINES OF THE CONSOLE ###########################
[...truncated 2643 lines...]
[junit] Running org.apache.hadoop.hdfs.server.datanode.TestDiskError
[junit] Tests run: 3, Failures: 0, Errors: 0, Time elapsed: 8.876 sec
[junit] Running org.apache.hadoop.hdfs.server.datanode.TestInterDatanodeProtocol
[junit] Tests run: 3, Failures: 0, Errors: 0, Time elapsed: 5.425 sec
[junit] Running org.apache.hadoop.hdfs.server.datanode.TestSimulatedFSDataset
[junit] Tests run: 8, Failures: 0, Errors: 0, Time elapsed: 0.776 sec
[junit] Running org.apache.hadoop.hdfs.server.namenode.TestBackupNode
[junit] Tests run: 2, Failures: 0, Errors: 0, Time elapsed: 18.1 sec
[junit] Running org.apache.hadoop.hdfs.server.namenode.TestCheckpoint
[junit] Tests run: 4, Failures: 0, Errors: 0, Time elapsed: 31.495 sec
[junit] Running org.apache.hadoop.hdfs.server.namenode.TestComputeInvalidateWork
[junit] Tests run: 1, Failures: 0, Errors: 0, Time elapsed: 5.219 sec
[junit] Running org.apache.hadoop.hdfs.server.namenode.TestDatanodeDescriptor
[junit] Tests run: 2, Failures: 0, Errors: 0, Time elapsed: 0.167 sec
[junit] Running org.apache.hadoop.hdfs.server.namenode.TestEditLog
[junit] Tests run: 4, Failures: 0, Errors: 0, Time elapsed: 12.645 sec
[junit] Running org.apache.hadoop.hdfs.server.namenode.TestFileLimit
[junit] Tests run: 2, Failures: 0, Errors: 0, Time elapsed: 4.615 sec
[junit] Running org.apache.hadoop.hdfs.server.namenode.TestHeartbeatHandling
[junit] Tests run: 1, Failures: 0, Errors: 0, Time elapsed: 3.28 sec
[junit] Running org.apache.hadoop.hdfs.server.namenode.TestHost2NodesMap
[junit] Tests run: 4, Failures: 0, Errors: 0, Time elapsed: 0.077 sec
[junit] Running org.apache.hadoop.hdfs.server.namenode.TestNamenodeCapacityReport
[junit] Tests run: 1, Failures: 0, Errors: 0, Time elapsed: 2.987 sec
[junit] Running org.apache.hadoop.hdfs.server.namenode.TestOverReplicatedBlocks
[junit] Tests run: 1, Failures: 0, Errors: 0, Time elapsed: 4.027 sec
[junit] Running org.apache.hadoop.hdfs.server.namenode.TestPendingReplication
[junit] Tests run: 1, Failures: 0, Errors: 0, Time elapsed: 7.307 sec
[junit] Running org.apache.hadoop.hdfs.server.namenode.TestReplicationPolicy
[junit] Tests run: 8, Failures: 0, Errors: 0, Time elapsed: 0.071 sec
[junit] Running org.apache.hadoop.hdfs.server.namenode.TestSafeMode
[junit] Tests run: 2, Failures: 0, Errors: 0, Time elapsed: 8.74 sec
[junit] Running org.apache.hadoop.hdfs.server.namenode.TestStartup
[junit] Tests run: 5, Failures: 0, Errors: 0, Time elapsed: 10.666 sec
[junit] Running org.apache.hadoop.hdfs.server.namenode.TestStorageRestore
[junit] Tests run: 2, Failures: 0, Errors: 0, Time elapsed: 8.555 sec
[junit] Running org.apache.hadoop.net.TestNetworkTopology
[junit] Tests run: 8, Failures: 0, Errors: 0, Time elapsed: 0.101 sec
[junit] Running org.apache.hadoop.security.TestPermission
[junit] Tests run: 3, Failures: 0, Errors: 0, Time elapsed: 5.442 sec
checkfailure:
[touch] Creating /grid/0/hudson/hudson-slave/workspace/Hadoop-Hdfs-trunk-Commit/trunk/build/test/testsfailed
BUILD FAILED
/grid/0/hudson/hudson-slave/workspace/Hadoop-Hdfs-trunk-Commit/trunk/build.xml:712: The following error occurred while executing this line:
/grid/0/hudson/hudson-slave/workspace/Hadoop-Hdfs-trunk-Commit/trunk/build.xml:669: The following error occurred while executing this line:
/grid/0/hudson/hudson-slave/workspace/Hadoop-Hdfs-trunk-Commit/trunk/build.xml:737: Tests failed!
Total time: 9 minutes 10 seconds
[FINDBUGS] Skipping publisher since build result is FAILURE
Recording fingerprints
Archiving artifacts
Recording test results
Publishing Javadoc
Publishing Clover coverage report...
No Clover report will be published due to a Build Failure
Email was triggered for: Failure
Sending email for trigger: Failure
###################################################################################
############################## FAILED TESTS (if any) ##############################
1 tests failed.
FAILED: org.apache.hadoop.hdfs.TestHDFSTrash.testTrashEmptier
Error Message:
null
Stack Trace:
junit.framework.AssertionFailedError: null
at org.apache.hadoop.fs.TestTrash.testTrashEmptier(TestTrash.java:479)
at junit.extensions.TestDecorator.basicRun(TestDecorator.java:24)
at junit.extensions.TestSetup$1.protect(TestSetup.java:23)
at junit.extensions.TestSetup.run(TestSetup.java:27)
Hadoop-Hdfs-trunk-Commit - Build # 676 - Still Failing
Posted by Apache Jenkins Server <hu...@hudson.apache.org>.
See https://builds.apache.org/hudson/job/Hadoop-Hdfs-trunk-Commit/676/
###################################################################################
########################## LAST 60 LINES OF THE CONSOLE ###########################
[...truncated 2642 lines...]
[junit] Running org.apache.hadoop.hdfs.server.datanode.TestDiskError
[junit] Tests run: 3, Failures: 0, Errors: 0, Time elapsed: 8.916 sec
[junit] Running org.apache.hadoop.hdfs.server.datanode.TestInterDatanodeProtocol
[junit] Tests run: 3, Failures: 0, Errors: 0, Time elapsed: 5.196 sec
[junit] Running org.apache.hadoop.hdfs.server.datanode.TestSimulatedFSDataset
[junit] Tests run: 8, Failures: 0, Errors: 0, Time elapsed: 0.768 sec
[junit] Running org.apache.hadoop.hdfs.server.namenode.TestBackupNode
[junit] Tests run: 2, Failures: 0, Errors: 0, Time elapsed: 18.288 sec
[junit] Running org.apache.hadoop.hdfs.server.namenode.TestCheckpoint
[junit] Tests run: 4, Failures: 0, Errors: 0, Time elapsed: 32.171 sec
[junit] Running org.apache.hadoop.hdfs.server.namenode.TestComputeInvalidateWork
[junit] Tests run: 1, Failures: 0, Errors: 0, Time elapsed: 4.956 sec
[junit] Running org.apache.hadoop.hdfs.server.namenode.TestDatanodeDescriptor
[junit] Tests run: 2, Failures: 0, Errors: 0, Time elapsed: 0.172 sec
[junit] Running org.apache.hadoop.hdfs.server.namenode.TestEditLog
[junit] Tests run: 5, Failures: 0, Errors: 0, Time elapsed: 13.244 sec
[junit] Running org.apache.hadoop.hdfs.server.namenode.TestFileLimit
[junit] Tests run: 2, Failures: 0, Errors: 0, Time elapsed: 5.225 sec
[junit] Running org.apache.hadoop.hdfs.server.namenode.TestHeartbeatHandling
[junit] Tests run: 1, Failures: 0, Errors: 0, Time elapsed: 3.1 sec
[junit] Running org.apache.hadoop.hdfs.server.namenode.TestHost2NodesMap
[junit] Tests run: 4, Failures: 0, Errors: 0, Time elapsed: 0.09 sec
[junit] Running org.apache.hadoop.hdfs.server.namenode.TestNamenodeCapacityReport
[junit] Tests run: 1, Failures: 0, Errors: 0, Time elapsed: 3.175 sec
[junit] Running org.apache.hadoop.hdfs.server.namenode.TestOverReplicatedBlocks
[junit] Tests run: 1, Failures: 0, Errors: 0, Time elapsed: 4.032 sec
[junit] Running org.apache.hadoop.hdfs.server.namenode.TestPendingReplication
[junit] Tests run: 1, Failures: 0, Errors: 0, Time elapsed: 7.3 sec
[junit] Running org.apache.hadoop.hdfs.server.namenode.TestReplicationPolicy
[junit] Tests run: 8, Failures: 0, Errors: 0, Time elapsed: 0.064 sec
[junit] Running org.apache.hadoop.hdfs.server.namenode.TestSafeMode
[junit] Tests run: 2, Failures: 0, Errors: 0, Time elapsed: 8.665 sec
[junit] Running org.apache.hadoop.hdfs.server.namenode.TestStartup
[junit] Tests run: 5, Failures: 0, Errors: 0, Time elapsed: 10.69 sec
[junit] Running org.apache.hadoop.hdfs.server.namenode.TestStorageRestore
[junit] Tests run: 2, Failures: 0, Errors: 0, Time elapsed: 8.412 sec
[junit] Running org.apache.hadoop.net.TestNetworkTopology
[junit] Tests run: 8, Failures: 0, Errors: 0, Time elapsed: 0.111 sec
[junit] Running org.apache.hadoop.security.TestPermission
[junit] Tests run: 3, Failures: 0, Errors: 0, Time elapsed: 5.281 sec
checkfailure:
[touch] Creating /grid/0/hudson/hudson-slave/workspace/Hadoop-Hdfs-trunk-Commit/trunk/build/test/testsfailed
BUILD FAILED
/grid/0/hudson/hudson-slave/workspace/Hadoop-Hdfs-trunk-Commit/trunk/build.xml:712: The following error occurred while executing this line:
/grid/0/hudson/hudson-slave/workspace/Hadoop-Hdfs-trunk-Commit/trunk/build.xml:669: The following error occurred while executing this line:
/grid/0/hudson/hudson-slave/workspace/Hadoop-Hdfs-trunk-Commit/trunk/build.xml:737: Tests failed!
Total time: 8 minutes 51 seconds
[FINDBUGS] Skipping publisher since build result is FAILURE
Recording fingerprints
Archiving artifacts
Recording test results
Publishing Javadoc
Publishing Clover coverage report...
No Clover report will be published due to a Build Failure
Email was triggered for: Failure
Sending email for trigger: Failure
###################################################################################
############################## FAILED TESTS (if any) ##############################
1 tests failed.
FAILED: org.apache.hadoop.hdfs.TestHDFSTrash.testTrashEmptier
Error Message:
null
Stack Trace:
junit.framework.AssertionFailedError: null
at org.apache.hadoop.fs.TestTrash.testTrashEmptier(TestTrash.java:479)
at junit.extensions.TestDecorator.basicRun(TestDecorator.java:24)
at junit.extensions.TestSetup$1.protect(TestSetup.java:23)
at junit.extensions.TestSetup.run(TestSetup.java:27)
Hadoop-Hdfs-trunk-Commit - Build # 675 - Still Failing
Posted by Apache Jenkins Server <hu...@hudson.apache.org>.
See https://builds.apache.org/hudson/job/Hadoop-Hdfs-trunk-Commit/675/
###################################################################################
########################## LAST 60 LINES OF THE CONSOLE ###########################
[...truncated 2658 lines...]
[junit] Running org.apache.hadoop.hdfs.server.datanode.TestDiskError
[junit] Tests run: 3, Failures: 0, Errors: 0, Time elapsed: 9.156 sec
[junit] Running org.apache.hadoop.hdfs.server.datanode.TestInterDatanodeProtocol
[junit] Tests run: 3, Failures: 0, Errors: 0, Time elapsed: 5.317 sec
[junit] Running org.apache.hadoop.hdfs.server.datanode.TestSimulatedFSDataset
[junit] Tests run: 8, Failures: 0, Errors: 0, Time elapsed: 0.79 sec
[junit] Running org.apache.hadoop.hdfs.server.namenode.TestBackupNode
[junit] Tests run: 2, Failures: 0, Errors: 0, Time elapsed: 18.271 sec
[junit] Running org.apache.hadoop.hdfs.server.namenode.TestCheckpoint
[junit] Tests run: 4, Failures: 0, Errors: 0, Time elapsed: 31.094 sec
[junit] Running org.apache.hadoop.hdfs.server.namenode.TestComputeInvalidateWork
[junit] Tests run: 1, Failures: 0, Errors: 0, Time elapsed: 5.056 sec
[junit] Running org.apache.hadoop.hdfs.server.namenode.TestDatanodeDescriptor
[junit] Tests run: 2, Failures: 0, Errors: 0, Time elapsed: 0.172 sec
[junit] Running org.apache.hadoop.hdfs.server.namenode.TestEditLog
[junit] Tests run: 5, Failures: 0, Errors: 0, Time elapsed: 13.321 sec
[junit] Running org.apache.hadoop.hdfs.server.namenode.TestFileLimit
[junit] Tests run: 2, Failures: 0, Errors: 0, Time elapsed: 4.626 sec
[junit] Running org.apache.hadoop.hdfs.server.namenode.TestHeartbeatHandling
[junit] Tests run: 1, Failures: 0, Errors: 0, Time elapsed: 3.299 sec
[junit] Running org.apache.hadoop.hdfs.server.namenode.TestHost2NodesMap
[junit] Tests run: 4, Failures: 0, Errors: 0, Time elapsed: 0.088 sec
[junit] Running org.apache.hadoop.hdfs.server.namenode.TestNamenodeCapacityReport
[junit] Tests run: 1, Failures: 0, Errors: 0, Time elapsed: 3.215 sec
[junit] Running org.apache.hadoop.hdfs.server.namenode.TestOverReplicatedBlocks
[junit] Tests run: 1, Failures: 0, Errors: 0, Time elapsed: 4.23 sec
[junit] Running org.apache.hadoop.hdfs.server.namenode.TestPendingReplication
[junit] Tests run: 1, Failures: 0, Errors: 0, Time elapsed: 7.314 sec
[junit] Running org.apache.hadoop.hdfs.server.namenode.TestReplicationPolicy
[junit] Tests run: 8, Failures: 0, Errors: 0, Time elapsed: 0.062 sec
[junit] Running org.apache.hadoop.hdfs.server.namenode.TestSafeMode
[junit] Tests run: 2, Failures: 0, Errors: 0, Time elapsed: 8.927 sec
[junit] Running org.apache.hadoop.hdfs.server.namenode.TestStartup
[junit] Tests run: 5, Failures: 0, Errors: 0, Time elapsed: 10.772 sec
[junit] Running org.apache.hadoop.hdfs.server.namenode.TestStorageRestore
[junit] Tests run: 2, Failures: 0, Errors: 0, Time elapsed: 8.5 sec
[junit] Running org.apache.hadoop.net.TestNetworkTopology
[junit] Tests run: 8, Failures: 0, Errors: 0, Time elapsed: 0.116 sec
[junit] Running org.apache.hadoop.security.TestPermission
[junit] Tests run: 3, Failures: 0, Errors: 0, Time elapsed: 5.472 sec
checkfailure:
[touch] Creating /grid/0/hudson/hudson-slave/workspace/Hadoop-Hdfs-trunk-Commit/trunk/build/test/testsfailed
BUILD FAILED
/grid/0/hudson/hudson-slave/workspace/Hadoop-Hdfs-trunk-Commit/trunk/build.xml:712: The following error occurred while executing this line:
/grid/0/hudson/hudson-slave/workspace/Hadoop-Hdfs-trunk-Commit/trunk/build.xml:669: The following error occurred while executing this line:
/grid/0/hudson/hudson-slave/workspace/Hadoop-Hdfs-trunk-Commit/trunk/build.xml:737: Tests failed!
Total time: 9 minutes 11 seconds
[FINDBUGS] Skipping publisher since build result is FAILURE
Recording fingerprints
Archiving artifacts
Recording test results
Publishing Javadoc
Publishing Clover coverage report...
No Clover report will be published due to a Build Failure
Email was triggered for: Failure
Sending email for trigger: Failure
###################################################################################
############################## FAILED TESTS (if any) ##############################
1 tests failed.
FAILED: org.apache.hadoop.hdfs.TestHDFSTrash.testTrashEmptier
Error Message:
null
Stack Trace:
junit.framework.AssertionFailedError: null
at org.apache.hadoop.fs.TestTrash.testTrashEmptier(TestTrash.java:479)
at junit.extensions.TestDecorator.basicRun(TestDecorator.java:24)
at junit.extensions.TestSetup$1.protect(TestSetup.java:23)
at junit.extensions.TestSetup.run(TestSetup.java:27)
Hadoop-Hdfs-trunk-Commit - Build # 674 - Still Failing
Posted by Apache Jenkins Server <hu...@hudson.apache.org>.
See https://builds.apache.org/hudson/job/Hadoop-Hdfs-trunk-Commit/674/
###################################################################################
########################## LAST 60 LINES OF THE CONSOLE ###########################
[...truncated 2642 lines...]
[junit] Running org.apache.hadoop.hdfs.server.datanode.TestDiskError
[junit] Tests run: 3, Failures: 0, Errors: 0, Time elapsed: 8.862 sec
[junit] Running org.apache.hadoop.hdfs.server.datanode.TestInterDatanodeProtocol
[junit] Tests run: 3, Failures: 0, Errors: 0, Time elapsed: 5.301 sec
[junit] Running org.apache.hadoop.hdfs.server.datanode.TestSimulatedFSDataset
[junit] Tests run: 8, Failures: 0, Errors: 0, Time elapsed: 0.772 sec
[junit] Running org.apache.hadoop.hdfs.server.namenode.TestBackupNode
[junit] Tests run: 2, Failures: 0, Errors: 0, Time elapsed: 18.909 sec
[junit] Running org.apache.hadoop.hdfs.server.namenode.TestCheckpoint
[junit] Tests run: 4, Failures: 0, Errors: 0, Time elapsed: 31.213 sec
[junit] Running org.apache.hadoop.hdfs.server.namenode.TestComputeInvalidateWork
[junit] Tests run: 1, Failures: 0, Errors: 0, Time elapsed: 5.149 sec
[junit] Running org.apache.hadoop.hdfs.server.namenode.TestDatanodeDescriptor
[junit] Tests run: 2, Failures: 0, Errors: 0, Time elapsed: 0.173 sec
[junit] Running org.apache.hadoop.hdfs.server.namenode.TestEditLog
[junit] Tests run: 4, Failures: 0, Errors: 0, Time elapsed: 12.812 sec
[junit] Running org.apache.hadoop.hdfs.server.namenode.TestFileLimit
[junit] Tests run: 2, Failures: 0, Errors: 0, Time elapsed: 4.677 sec
[junit] Running org.apache.hadoop.hdfs.server.namenode.TestHeartbeatHandling
[junit] Tests run: 1, Failures: 0, Errors: 0, Time elapsed: 3.3 sec
[junit] Running org.apache.hadoop.hdfs.server.namenode.TestHost2NodesMap
[junit] Tests run: 4, Failures: 0, Errors: 0, Time elapsed: 0.087 sec
[junit] Running org.apache.hadoop.hdfs.server.namenode.TestNamenodeCapacityReport
[junit] Tests run: 1, Failures: 0, Errors: 0, Time elapsed: 3.125 sec
[junit] Running org.apache.hadoop.hdfs.server.namenode.TestOverReplicatedBlocks
[junit] Tests run: 1, Failures: 0, Errors: 0, Time elapsed: 3.921 sec
[junit] Running org.apache.hadoop.hdfs.server.namenode.TestPendingReplication
[junit] Tests run: 1, Failures: 0, Errors: 0, Time elapsed: 7.305 sec
[junit] Running org.apache.hadoop.hdfs.server.namenode.TestReplicationPolicy
[junit] Tests run: 8, Failures: 0, Errors: 0, Time elapsed: 0.081 sec
[junit] Running org.apache.hadoop.hdfs.server.namenode.TestSafeMode
[junit] Tests run: 2, Failures: 0, Errors: 0, Time elapsed: 9.179 sec
[junit] Running org.apache.hadoop.hdfs.server.namenode.TestStartup
[junit] Tests run: 5, Failures: 0, Errors: 0, Time elapsed: 10.648 sec
[junit] Running org.apache.hadoop.hdfs.server.namenode.TestStorageRestore
[junit] Tests run: 2, Failures: 0, Errors: 0, Time elapsed: 8.546 sec
[junit] Running org.apache.hadoop.net.TestNetworkTopology
[junit] Tests run: 8, Failures: 0, Errors: 0, Time elapsed: 0.116 sec
[junit] Running org.apache.hadoop.security.TestPermission
[junit] Tests run: 3, Failures: 0, Errors: 0, Time elapsed: 5.129 sec
checkfailure:
[touch] Creating /grid/0/hudson/hudson-slave/workspace/Hadoop-Hdfs-trunk-Commit/trunk/build/test/testsfailed
BUILD FAILED
/grid/0/hudson/hudson-slave/workspace/Hadoop-Hdfs-trunk-Commit/trunk/build.xml:712: The following error occurred while executing this line:
/grid/0/hudson/hudson-slave/workspace/Hadoop-Hdfs-trunk-Commit/trunk/build.xml:669: The following error occurred while executing this line:
/grid/0/hudson/hudson-slave/workspace/Hadoop-Hdfs-trunk-Commit/trunk/build.xml:737: Tests failed!
Total time: 9 minutes 0 seconds
[FINDBUGS] Skipping publisher since build result is FAILURE
Recording fingerprints
Archiving artifacts
Recording test results
Publishing Javadoc
Publishing Clover coverage report...
No Clover report will be published due to a Build Failure
Email was triggered for: Failure
Sending email for trigger: Failure
###################################################################################
############################## FAILED TESTS (if any) ##############################
1 tests failed.
FAILED: org.apache.hadoop.hdfs.TestHDFSTrash.testTrashEmptier
Error Message:
null
Stack Trace:
junit.framework.AssertionFailedError: null
at org.apache.hadoop.fs.TestTrash.testTrashEmptier(TestTrash.java:479)
at junit.extensions.TestDecorator.basicRun(TestDecorator.java:24)
at junit.extensions.TestSetup$1.protect(TestSetup.java:23)
at junit.extensions.TestSetup.run(TestSetup.java:27)