You are viewing a plain text version of this content. The canonical link for it is here.
Posted to dev@lucene.apache.org by Policeman Jenkins Server <je...@thetaphi.de> on 2016/05/04 09:13:29 UTC

[JENKINS-EA] Lucene-Solr-master-Linux (32bit/jdk-9-ea+116) - Build # 16653 - Failure!

Build: http://jenkins.thetaphi.de/job/Lucene-Solr-master-Linux/16653/
Java: 32bit/jdk-9-ea+116 -client -XX:+UseConcMarkSweepGC

2 tests failed.
FAILED:  junit.framework.TestSuite.org.apache.solr.handler.TestReplicationHandler

Error Message:
ObjectTracker found 1 object(s) that were not released!!! [NRTCachingDirectory]

Stack Trace:
java.lang.AssertionError: ObjectTracker found 1 object(s) that were not released!!! [NRTCachingDirectory]
	at __randomizedtesting.SeedInfo.seed([7E459AB348B88AB6]:0)
	at org.junit.Assert.fail(Assert.java:93)
	at org.junit.Assert.assertTrue(Assert.java:43)
	at org.junit.Assert.assertNull(Assert.java:551)
	at org.apache.solr.SolrTestCaseJ4.afterClass(SolrTestCaseJ4.java:255)
	at jdk.internal.reflect.GeneratedMethodAccessor15.invoke(Unknown Source)
	at jdk.internal.reflect.DelegatingMethodAccessorImpl.invoke(java.base@9-ea/DelegatingMethodAccessorImpl.java:43)
	at java.lang.reflect.Method.invoke(java.base@9-ea/Method.java:531)
	at com.carrotsearch.randomizedtesting.RandomizedRunner.invoke(RandomizedRunner.java:1764)
	at com.carrotsearch.randomizedtesting.RandomizedRunner$7.evaluate(RandomizedRunner.java:834)
	at com.carrotsearch.randomizedtesting.rules.StatementAdapter.evaluate(StatementAdapter.java:36)
	at com.carrotsearch.randomizedtesting.rules.SystemPropertiesRestoreRule$1.evaluate(SystemPropertiesRestoreRule.java:57)
	at org.apache.lucene.util.AbstractBeforeAfterRule$1.evaluate(AbstractBeforeAfterRule.java:45)
	at com.carrotsearch.randomizedtesting.rules.StatementAdapter.evaluate(StatementAdapter.java:36)
	at org.apache.lucene.util.TestRuleStoreClassName$1.evaluate(TestRuleStoreClassName.java:41)
	at com.carrotsearch.randomizedtesting.rules.NoShadowingOrOverridesOnMethodsRule$1.evaluate(NoShadowingOrOverridesOnMethodsRule.java:40)
	at com.carrotsearch.randomizedtesting.rules.NoShadowingOrOverridesOnMethodsRule$1.evaluate(NoShadowingOrOverridesOnMethodsRule.java:40)
	at com.carrotsearch.randomizedtesting.rules.StatementAdapter.evaluate(StatementAdapter.java:36)
	at com.carrotsearch.randomizedtesting.rules.StatementAdapter.evaluate(StatementAdapter.java:36)
	at com.carrotsearch.randomizedtesting.rules.StatementAdapter.evaluate(StatementAdapter.java:36)
	at org.apache.lucene.util.TestRuleAssertionsRequired$1.evaluate(TestRuleAssertionsRequired.java:53)
	at org.apache.lucene.util.TestRuleMarkFailure$1.evaluate(TestRuleMarkFailure.java:47)
	at org.apache.lucene.util.TestRuleIgnoreAfterMaxFailures$1.evaluate(TestRuleIgnoreAfterMaxFailures.java:64)
	at org.apache.lucene.util.TestRuleIgnoreTestSuites$1.evaluate(TestRuleIgnoreTestSuites.java:54)
	at com.carrotsearch.randomizedtesting.rules.StatementAdapter.evaluate(StatementAdapter.java:36)
	at com.carrotsearch.randomizedtesting.ThreadLeakControl$StatementRunner.run(ThreadLeakControl.java:367)
	at java.lang.Thread.run(java.base@9-ea/Thread.java:804)


FAILED:  org.apache.solr.schema.TestManagedSchemaAPI.test

Error Message:
Error from server at http://127.0.0.1:33079/solr/testschemaapi_shard1_replica1: ERROR: [doc=2] unknown field 'myNewField1'

Stack Trace:
org.apache.solr.client.solrj.impl.CloudSolrClient$RouteException: Error from server at http://127.0.0.1:33079/solr/testschemaapi_shard1_replica1: ERROR: [doc=2] unknown field 'myNewField1'
	at __randomizedtesting.SeedInfo.seed([7E459AB348B88AB6:F611A569E644E74E]:0)
	at org.apache.solr.client.solrj.impl.CloudSolrClient.directUpdate(CloudSolrClient.java:661)
	at org.apache.solr.client.solrj.impl.CloudSolrClient.sendRequest(CloudSolrClient.java:1073)
	at org.apache.solr.client.solrj.impl.CloudSolrClient.requestWithRetryOnStaleState(CloudSolrClient.java:962)
	at org.apache.solr.client.solrj.impl.CloudSolrClient.request(CloudSolrClient.java:898)
	at org.apache.solr.schema.TestManagedSchemaAPI.testAddFieldAndDocument(TestManagedSchemaAPI.java:86)
	at org.apache.solr.schema.TestManagedSchemaAPI.test(TestManagedSchemaAPI.java:55)
	at jdk.internal.reflect.NativeMethodAccessorImpl.invoke0(java.base@9-ea/Native Method)
	at jdk.internal.reflect.NativeMethodAccessorImpl.invoke(java.base@9-ea/NativeMethodAccessorImpl.java:62)
	at jdk.internal.reflect.DelegatingMethodAccessorImpl.invoke(java.base@9-ea/DelegatingMethodAccessorImpl.java:43)
	at java.lang.reflect.Method.invoke(java.base@9-ea/Method.java:531)
	at com.carrotsearch.randomizedtesting.RandomizedRunner.invoke(RandomizedRunner.java:1764)
	at com.carrotsearch.randomizedtesting.RandomizedRunner$8.evaluate(RandomizedRunner.java:871)
	at com.carrotsearch.randomizedtesting.RandomizedRunner$9.evaluate(RandomizedRunner.java:907)
	at com.carrotsearch.randomizedtesting.RandomizedRunner$10.evaluate(RandomizedRunner.java:921)
	at com.carrotsearch.randomizedtesting.rules.SystemPropertiesRestoreRule$1.evaluate(SystemPropertiesRestoreRule.java:57)
	at org.apache.lucene.util.TestRuleSetupTeardownChained$1.evaluate(TestRuleSetupTeardownChained.java:49)
	at org.apache.lucene.util.AbstractBeforeAfterRule$1.evaluate(AbstractBeforeAfterRule.java:45)
	at org.apache.lucene.util.TestRuleThreadAndTestName$1.evaluate(TestRuleThreadAndTestName.java:48)
	at org.apache.lucene.util.TestRuleIgnoreAfterMaxFailures$1.evaluate(TestRuleIgnoreAfterMaxFailures.java:64)
	at org.apache.lucene.util.TestRuleMarkFailure$1.evaluate(TestRuleMarkFailure.java:47)
	at com.carrotsearch.randomizedtesting.rules.StatementAdapter.evaluate(StatementAdapter.java:36)
	at com.carrotsearch.randomizedtesting.ThreadLeakControl$StatementRunner.run(ThreadLeakControl.java:367)
	at com.carrotsearch.randomizedtesting.ThreadLeakControl.forkTimeoutingTask(ThreadLeakControl.java:809)
	at com.carrotsearch.randomizedtesting.ThreadLeakControl$3.evaluate(ThreadLeakControl.java:460)
	at com.carrotsearch.randomizedtesting.RandomizedRunner.runSingleTest(RandomizedRunner.java:880)
	at com.carrotsearch.randomizedtesting.RandomizedRunner$5.evaluate(RandomizedRunner.java:781)
	at com.carrotsearch.randomizedtesting.RandomizedRunner$6.evaluate(RandomizedRunner.java:816)
	at com.carrotsearch.randomizedtesting.RandomizedRunner$7.evaluate(RandomizedRunner.java:827)
	at com.carrotsearch.randomizedtesting.rules.StatementAdapter.evaluate(StatementAdapter.java:36)
	at com.carrotsearch.randomizedtesting.rules.SystemPropertiesRestoreRule$1.evaluate(SystemPropertiesRestoreRule.java:57)
	at org.apache.lucene.util.AbstractBeforeAfterRule$1.evaluate(AbstractBeforeAfterRule.java:45)
	at com.carrotsearch.randomizedtesting.rules.StatementAdapter.evaluate(StatementAdapter.java:36)
	at org.apache.lucene.util.TestRuleStoreClassName$1.evaluate(TestRuleStoreClassName.java:41)
	at com.carrotsearch.randomizedtesting.rules.NoShadowingOrOverridesOnMethodsRule$1.evaluate(NoShadowingOrOverridesOnMethodsRule.java:40)
	at com.carrotsearch.randomizedtesting.rules.NoShadowingOrOverridesOnMethodsRule$1.evaluate(NoShadowingOrOverridesOnMethodsRule.java:40)
	at com.carrotsearch.randomizedtesting.rules.StatementAdapter.evaluate(StatementAdapter.java:36)
	at com.carrotsearch.randomizedtesting.rules.StatementAdapter.evaluate(StatementAdapter.java:36)
	at com.carrotsearch.randomizedtesting.rules.StatementAdapter.evaluate(StatementAdapter.java:36)
	at org.apache.lucene.util.TestRuleAssertionsRequired$1.evaluate(TestRuleAssertionsRequired.java:53)
	at org.apache.lucene.util.TestRuleMarkFailure$1.evaluate(TestRuleMarkFailure.java:47)
	at org.apache.lucene.util.TestRuleIgnoreAfterMaxFailures$1.evaluate(TestRuleIgnoreAfterMaxFailures.java:64)
	at org.apache.lucene.util.TestRuleIgnoreTestSuites$1.evaluate(TestRuleIgnoreTestSuites.java:54)
	at com.carrotsearch.randomizedtesting.rules.StatementAdapter.evaluate(StatementAdapter.java:36)
	at com.carrotsearch.randomizedtesting.ThreadLeakControl$StatementRunner.run(ThreadLeakControl.java:367)
	at java.lang.Thread.run(java.base@9-ea/Thread.java:804)
Caused by: org.apache.solr.client.solrj.impl.HttpSolrClient$RemoteSolrException: Error from server at http://127.0.0.1:33079/solr/testschemaapi_shard1_replica1: ERROR: [doc=2] unknown field 'myNewField1'
	at org.apache.solr.client.solrj.impl.HttpSolrClient.executeMethod(HttpSolrClient.java:606)
	at org.apache.solr.client.solrj.impl.HttpSolrClient.request(HttpSolrClient.java:259)
	at org.apache.solr.client.solrj.impl.HttpSolrClient.request(HttpSolrClient.java:248)
	at org.apache.solr.client.solrj.impl.LBHttpSolrClient.doRequest(LBHttpSolrClient.java:413)
	at org.apache.solr.client.solrj.impl.LBHttpSolrClient.request(LBHttpSolrClient.java:366)
	at org.apache.solr.client.solrj.impl.CloudSolrClient.lambda$directUpdate$0(CloudSolrClient.java:638)
	at java.util.concurrent.FutureTask.run(java.base@9-ea/FutureTask.java:266)
	at org.apache.solr.common.util.ExecutorUtil$MDCAwareThreadPoolExecutor.lambda$execute$0(ExecutorUtil.java:229)
	at java.util.concurrent.ThreadPoolExecutor.runWorker(java.base@9-ea/ThreadPoolExecutor.java:1158)
	at java.util.concurrent.ThreadPoolExecutor$Worker.run(java.base@9-ea/ThreadPoolExecutor.java:632)
	... 1 more




Build Log:
[...truncated 11420 lines...]
   [junit4] Suite: org.apache.solr.schema.TestManagedSchemaAPI
   [junit4]   2> Creating dataDir: /home/jenkins/workspace/Lucene-Solr-master-Linux/solr/build/solr-core/test/J0/temp/solr.schema.TestManagedSchemaAPI_7E459AB348B88AB6-001/init-core-data-001
   [junit4]   2> 1093320 INFO  (SUITE-TestManagedSchemaAPI-seed#[7E459AB348B88AB6]-worker) [    ] o.a.s.SolrTestCaseJ4 Randomized ssl (false) and clientAuth (false)
   [junit4]   2> 1093321 INFO  (SUITE-TestManagedSchemaAPI-seed#[7E459AB348B88AB6]-worker) [    ] o.a.s.c.ZkTestServer STARTING ZK TEST SERVER
   [junit4]   2> 1093321 INFO  (Thread-3045) [    ] o.a.s.c.ZkTestServer client port:0.0.0.0/0.0.0.0:0
   [junit4]   2> 1093321 INFO  (Thread-3045) [    ] o.a.s.c.ZkTestServer Starting server
   [junit4]   2> 1093421 INFO  (SUITE-TestManagedSchemaAPI-seed#[7E459AB348B88AB6]-worker) [    ] o.a.s.c.ZkTestServer start zk server on port:35765
   [junit4]   2> 1093421 INFO  (SUITE-TestManagedSchemaAPI-seed#[7E459AB348B88AB6]-worker) [    ] o.a.s.c.c.SolrZkClient Using default ZkCredentialsProvider
   [junit4]   2> 1093422 INFO  (SUITE-TestManagedSchemaAPI-seed#[7E459AB348B88AB6]-worker) [    ] o.a.s.c.c.ConnectionManager Waiting for client to connect to ZooKeeper
   [junit4]   2> 1093423 INFO  (zkCallback-1221-thread-1) [    ] o.a.s.c.c.ConnectionManager Watcher org.apache.solr.common.cloud.ConnectionManager@1db1313 name:ZooKeeperConnection Watcher:127.0.0.1:35765 got event WatchedEvent state:SyncConnected type:None path:null path:null type:None
   [junit4]   2> 1093423 INFO  (SUITE-TestManagedSchemaAPI-seed#[7E459AB348B88AB6]-worker) [    ] o.a.s.c.c.ConnectionManager Client is connected to ZooKeeper
   [junit4]   2> 1093423 INFO  (SUITE-TestManagedSchemaAPI-seed#[7E459AB348B88AB6]-worker) [    ] o.a.s.c.c.SolrZkClient Using default ZkACLProvider
   [junit4]   2> 1093423 INFO  (SUITE-TestManagedSchemaAPI-seed#[7E459AB348B88AB6]-worker) [    ] o.a.s.c.c.SolrZkClient makePath: /solr/solr.xml
   [junit4]   2> 1093425 INFO  (jetty-launcher-1220-thread-1) [    ] o.e.j.s.Server jetty-9.3.8.v20160314
   [junit4]   2> 1093425 INFO  (jetty-launcher-1220-thread-2) [    ] o.e.j.s.Server jetty-9.3.8.v20160314
   [junit4]   2> 1093426 INFO  (jetty-launcher-1220-thread-1) [    ] o.e.j.s.h.ContextHandler Started o.e.j.s.ServletContextHandler@16be71e{/solr,null,AVAILABLE}
   [junit4]   2> 1093426 INFO  (jetty-launcher-1220-thread-2) [    ] o.e.j.s.h.ContextHandler Started o.e.j.s.ServletContextHandler@1d25d46{/solr,null,AVAILABLE}
   [junit4]   2> 1093427 INFO  (jetty-launcher-1220-thread-1) [    ] o.e.j.s.ServerConnector Started ServerConnector@1582a9a{HTTP/1.1,[http/1.1]}{127.0.0.1:33079}
   [junit4]   2> 1093427 INFO  (jetty-launcher-1220-thread-2) [    ] o.e.j.s.ServerConnector Started ServerConnector@14dc674{HTTP/1.1,[http/1.1]}{127.0.0.1:36177}
   [junit4]   2> 1093427 INFO  (jetty-launcher-1220-thread-1) [    ] o.e.j.s.Server Started @1095089ms
   [junit4]   2> 1093427 INFO  (jetty-launcher-1220-thread-2) [    ] o.e.j.s.Server Started @1095089ms
   [junit4]   2> 1093427 INFO  (jetty-launcher-1220-thread-1) [    ] o.a.s.c.s.e.JettySolrRunner Jetty properties: {hostContext=/solr, hostPort=33079}
   [junit4]   2> 1093427 INFO  (jetty-launcher-1220-thread-2) [    ] o.a.s.c.s.e.JettySolrRunner Jetty properties: {hostContext=/solr, hostPort=36177}
   [junit4]   2> 1093427 INFO  (jetty-launcher-1220-thread-1) [    ] o.a.s.s.SolrDispatchFilter SolrDispatchFilter.init(): jdk.internal.loader.ClassLoaders$AppClassLoader@a4a92b
   [junit4]   2> 1093427 INFO  (jetty-launcher-1220-thread-1) [    ] o.a.s.c.SolrResourceLoader new SolrResourceLoader for directory: '/home/jenkins/workspace/Lucene-Solr-master-Linux/solr/build/solr-core/test/J0/temp/solr.schema.TestManagedSchemaAPI_7E459AB348B88AB6-001/tempDir-001/node1'
   [junit4]   2> 1093427 INFO  (jetty-launcher-1220-thread-2) [    ] o.a.s.s.SolrDispatchFilter SolrDispatchFilter.init(): jdk.internal.loader.ClassLoaders$AppClassLoader@a4a92b
   [junit4]   2> 1093427 INFO  (jetty-launcher-1220-thread-1) [    ] o.a.s.c.SolrResourceLoader JNDI not configured for solr (NoInitialContextEx)
   [junit4]   2> 1093427 INFO  (jetty-launcher-1220-thread-2) [    ] o.a.s.c.SolrResourceLoader new SolrResourceLoader for directory: '/home/jenkins/workspace/Lucene-Solr-master-Linux/solr/build/solr-core/test/J0/temp/solr.schema.TestManagedSchemaAPI_7E459AB348B88AB6-001/tempDir-001/node2'
   [junit4]   2> 1093427 INFO  (jetty-launcher-1220-thread-1) [    ] o.a.s.c.SolrResourceLoader solr home defaulted to 'solr/' (could not find system property or JNDI)
   [junit4]   2> 1093427 INFO  (jetty-launcher-1220-thread-2) [    ] o.a.s.c.SolrResourceLoader JNDI not configured for solr (NoInitialContextEx)
   [junit4]   2> 1093427 INFO  (jetty-launcher-1220-thread-1) [    ] o.a.s.c.c.SolrZkClient Using default ZkCredentialsProvider
   [junit4]   2> 1093427 INFO  (jetty-launcher-1220-thread-2) [    ] o.a.s.c.SolrResourceLoader solr home defaulted to 'solr/' (could not find system property or JNDI)
   [junit4]   2> 1093428 INFO  (jetty-launcher-1220-thread-1) [    ] o.a.s.c.c.ConnectionManager Waiting for client to connect to ZooKeeper
   [junit4]   2> 1093428 INFO  (jetty-launcher-1220-thread-2) [    ] o.a.s.c.c.SolrZkClient Using default ZkCredentialsProvider
   [junit4]   2> 1093428 INFO  (jetty-launcher-1220-thread-2) [    ] o.a.s.c.c.ConnectionManager Waiting for client to connect to ZooKeeper
   [junit4]   2> 1093428 INFO  (zkCallback-1222-thread-1) [    ] o.a.s.c.c.ConnectionManager Watcher org.apache.solr.common.cloud.ConnectionManager@9b6e1f name:ZooKeeperConnection Watcher:127.0.0.1:35765/solr got event WatchedEvent state:SyncConnected type:None path:null path:null type:None
   [junit4]   2> 1093428 INFO  (jetty-launcher-1220-thread-1) [    ] o.a.s.c.c.ConnectionManager Client is connected to ZooKeeper
   [junit4]   2> 1093428 INFO  (zkCallback-1223-thread-1) [    ] o.a.s.c.c.ConnectionManager Watcher org.apache.solr.common.cloud.ConnectionManager@1f9d758 name:ZooKeeperConnection Watcher:127.0.0.1:35765/solr got event WatchedEvent state:SyncConnected type:None path:null path:null type:None
   [junit4]   2> 1093428 INFO  (jetty-launcher-1220-thread-2) [    ] o.a.s.c.c.ConnectionManager Client is connected to ZooKeeper
   [junit4]   2> 1093428 INFO  (jetty-launcher-1220-thread-1) [    ] o.a.s.c.c.SolrZkClient Using default ZkACLProvider
   [junit4]   2> 1093429 INFO  (jetty-launcher-1220-thread-2) [    ] o.a.s.c.c.SolrZkClient Using default ZkACLProvider
   [junit4]   2> 1093429 INFO  (jetty-launcher-1220-thread-2) [    ] o.a.s.s.SolrDispatchFilter solr.xml found in ZooKeeper. Loading...
   [junit4]   2> 1093429 INFO  (jetty-launcher-1220-thread-1) [    ] o.a.s.s.SolrDispatchFilter solr.xml found in ZooKeeper. Loading...
   [junit4]   2> 1093432 INFO  (jetty-launcher-1220-thread-1) [    ] o.a.s.c.CorePropertiesLocator Config-defined core root directory: /home/jenkins/workspace/Lucene-Solr-master-Linux/solr/build/solr-core/test/J0/temp/solr.schema.TestManagedSchemaAPI_7E459AB348B88AB6-001/tempDir-001/node1/.
   [junit4]   2> 1093433 INFO  (jetty-launcher-1220-thread-1) [    ] o.a.s.c.CoreContainer New CoreContainer 26014229
   [junit4]   2> 1093433 INFO  (jetty-launcher-1220-thread-1) [    ] o.a.s.c.CoreContainer Loading cores into CoreContainer [instanceDir=/home/jenkins/workspace/Lucene-Solr-master-Linux/solr/build/solr-core/test/J0/temp/solr.schema.TestManagedSchemaAPI_7E459AB348B88AB6-001/tempDir-001/node1]
   [junit4]   2> 1093433 WARN  (jetty-launcher-1220-thread-1) [    ] o.a.s.c.CoreContainer Couldn't add files from /home/jenkins/workspace/Lucene-Solr-master-Linux/solr/build/solr-core/test/J0/temp/solr.schema.TestManagedSchemaAPI_7E459AB348B88AB6-001/tempDir-001/node1/lib to classpath: /home/jenkins/workspace/Lucene-Solr-master-Linux/solr/build/solr-core/test/J0/temp/solr.schema.TestManagedSchemaAPI_7E459AB348B88AB6-001/tempDir-001/node1/lib
   [junit4]   2> 1093433 INFO  (jetty-launcher-1220-thread-2) [    ] o.a.s.c.CorePropertiesLocator Config-defined core root directory: /home/jenkins/workspace/Lucene-Solr-master-Linux/solr/build/solr-core/test/J0/temp/solr.schema.TestManagedSchemaAPI_7E459AB348B88AB6-001/tempDir-001/node2/.
   [junit4]   2> 1093433 INFO  (jetty-launcher-1220-thread-1) [    ] o.a.s.h.c.HttpShardHandlerFactory created with socketTimeout : 90000,urlScheme : ,connTimeout : 15000,maxConnectionsPerHost : 20,maxConnections : 10000,corePoolSize : 0,maximumPoolSize : 2147483647,maxThreadIdleTime : 5,sizeOfQueue : -1,fairnessPolicy : false,
   [junit4]   2> 1093433 INFO  (jetty-launcher-1220-thread-2) [    ] o.a.s.c.CoreContainer New CoreContainer 22883507
   [junit4]   2> 1093433 INFO  (jetty-launcher-1220-thread-2) [    ] o.a.s.c.CoreContainer Loading cores into CoreContainer [instanceDir=/home/jenkins/workspace/Lucene-Solr-master-Linux/solr/build/solr-core/test/J0/temp/solr.schema.TestManagedSchemaAPI_7E459AB348B88AB6-001/tempDir-001/node2]
   [junit4]   2> 1093433 WARN  (jetty-launcher-1220-thread-2) [    ] o.a.s.c.CoreContainer Couldn't add files from /home/jenkins/workspace/Lucene-Solr-master-Linux/solr/build/solr-core/test/J0/temp/solr.schema.TestManagedSchemaAPI_7E459AB348B88AB6-001/tempDir-001/node2/lib to classpath: /home/jenkins/workspace/Lucene-Solr-master-Linux/solr/build/solr-core/test/J0/temp/solr.schema.TestManagedSchemaAPI_7E459AB348B88AB6-001/tempDir-001/node2/lib
   [junit4]   2> 1093433 INFO  (jetty-launcher-1220-thread-2) [    ] o.a.s.h.c.HttpShardHandlerFactory created with socketTimeout : 90000,urlScheme : ,connTimeout : 15000,maxConnectionsPerHost : 20,maxConnections : 10000,corePoolSize : 0,maximumPoolSize : 2147483647,maxThreadIdleTime : 5,sizeOfQueue : -1,fairnessPolicy : false,
   [junit4]   2> 1093434 INFO  (jetty-launcher-1220-thread-2) [    ] o.a.s.u.UpdateShardHandler Creating UpdateShardHandler HTTP client with params: 
   [junit4]   2> 1093434 INFO  (jetty-launcher-1220-thread-1) [    ] o.a.s.u.UpdateShardHandler Creating UpdateShardHandler HTTP client with params: 
   [junit4]   2> 1093434 INFO  (jetty-launcher-1220-thread-2) [    ] o.a.s.l.LogWatcher SLF4J impl is org.slf4j.impl.Log4jLoggerFactory
   [junit4]   2> 1093434 INFO  (jetty-launcher-1220-thread-1) [    ] o.a.s.l.LogWatcher SLF4J impl is org.slf4j.impl.Log4jLoggerFactory
   [junit4]   2> 1093435 INFO  (jetty-launcher-1220-thread-2) [    ] o.a.s.l.LogWatcher Registering Log Listener [Log4j (org.slf4j.impl.Log4jLoggerFactory)]
   [junit4]   2> 1093435 INFO  (jetty-launcher-1220-thread-1) [    ] o.a.s.l.LogWatcher Registering Log Listener [Log4j (org.slf4j.impl.Log4jLoggerFactory)]
   [junit4]   2> 1093435 INFO  (jetty-launcher-1220-thread-2) [    ] o.a.s.c.ZkContainer Zookeeper client=127.0.0.1:35765/solr
   [junit4]   2> 1093435 INFO  (jetty-launcher-1220-thread-1) [    ] o.a.s.c.ZkContainer Zookeeper client=127.0.0.1:35765/solr
   [junit4]   2> 1093435 INFO  (jetty-launcher-1220-thread-2) [    ] o.a.s.c.ZkController zkHost includes chroot
   [junit4]   2> 1093435 INFO  (jetty-launcher-1220-thread-1) [    ] o.a.s.c.ZkController zkHost includes chroot
   [junit4]   2> 1093435 INFO  (jetty-launcher-1220-thread-2) [    ] o.a.s.c.c.SolrZkClient Using default ZkCredentialsProvider
   [junit4]   2> 1093435 INFO  (jetty-launcher-1220-thread-1) [    ] o.a.s.c.c.SolrZkClient Using default ZkCredentialsProvider
   [junit4]   2> 1093435 INFO  (jetty-launcher-1220-thread-2) [    ] o.a.s.c.c.ConnectionManager Waiting for client to connect to ZooKeeper
   [junit4]   2> 1093435 INFO  (jetty-launcher-1220-thread-1) [    ] o.a.s.c.c.ConnectionManager Waiting for client to connect to ZooKeeper
   [junit4]   2> 1093436 INFO  (zkCallback-1228-thread-1) [    ] o.a.s.c.c.ConnectionManager Watcher org.apache.solr.common.cloud.ConnectionManager@33ef26 name:ZooKeeperConnection Watcher:127.0.0.1:35765 got event WatchedEvent state:SyncConnected type:None path:null path:null type:None
   [junit4]   2> 1093436 INFO  (jetty-launcher-1220-thread-2) [    ] o.a.s.c.c.ConnectionManager Client is connected to ZooKeeper
   [junit4]   2> 1093436 INFO  (zkCallback-1229-thread-1) [    ] o.a.s.c.c.ConnectionManager Watcher org.apache.solr.common.cloud.ConnectionManager@a2b82d name:ZooKeeperConnection Watcher:127.0.0.1:35765 got event WatchedEvent state:SyncConnected type:None path:null path:null type:None
   [junit4]   2> 1093436 INFO  (jetty-launcher-1220-thread-1) [    ] o.a.s.c.c.ConnectionManager Client is connected to ZooKeeper
   [junit4]   2> 1093436 INFO  (jetty-launcher-1220-thread-2) [    ] o.a.s.c.c.SolrZkClient Using default ZkACLProvider
   [junit4]   2> 1093436 INFO  (jetty-launcher-1220-thread-1) [    ] o.a.s.c.c.SolrZkClient Using default ZkACLProvider
   [junit4]   2> 1093436 INFO  (jetty-launcher-1220-thread-2) [    ] o.a.s.c.ZkController Added new OnReconnect listener org.apache.solr.cloud.ZkController$$Lambda$81/33144726@1e2cb38
   [junit4]   2> 1093436 INFO  (jetty-launcher-1220-thread-1) [    ] o.a.s.c.ZkController Added new OnReconnect listener org.apache.solr.cloud.ZkController$$Lambda$81/33144726@1a03c8d
   [junit4]   2> 1093436 INFO  (jetty-launcher-1220-thread-2) [    ] o.a.s.c.c.ConnectionManager Waiting for client to connect to ZooKeeper
   [junit4]   2> 1093437 INFO  (jetty-launcher-1220-thread-1) [    ] o.a.s.c.c.ConnectionManager Waiting for client to connect to ZooKeeper
   [junit4]   2> 1093437 INFO  (zkCallback-1230-thread-1) [    ] o.a.s.c.c.ConnectionManager Watcher org.apache.solr.common.cloud.ConnectionManager@1754b42 name:ZooKeeperConnection Watcher:127.0.0.1:35765/solr got event WatchedEvent state:SyncConnected type:None path:null path:null type:None
   [junit4]   2> 1093437 INFO  (jetty-launcher-1220-thread-2) [    ] o.a.s.c.c.ConnectionManager Client is connected to ZooKeeper
   [junit4]   2> 1093437 INFO  (zkCallback-1231-thread-1) [    ] o.a.s.c.c.ConnectionManager Watcher org.apache.solr.common.cloud.ConnectionManager@c3dbc name:ZooKeeperConnection Watcher:127.0.0.1:35765/solr got event WatchedEvent state:SyncConnected type:None path:null path:null type:None
   [junit4]   2> 1093437 INFO  (jetty-launcher-1220-thread-1) [    ] o.a.s.c.c.ConnectionManager Client is connected to ZooKeeper
   [junit4]   2> 1093438 INFO  (jetty-launcher-1220-thread-2) [    ] o.a.s.c.c.SolrZkClient makePath: /overseer/queue
   [junit4]   2> 1093438 INFO  (jetty-launcher-1220-thread-1) [    ] o.a.s.c.c.SolrZkClient makePath: /overseer/queue
   [junit4]   2> 1093438 INFO  (jetty-launcher-1220-thread-2) [    ] o.a.s.c.c.SolrZkClient makePath: /overseer/collection-queue-work
   [junit4]   2> 1093438 INFO  (jetty-launcher-1220-thread-1) [    ] o.a.s.c.c.SolrZkClient makePath: /overseer/collection-queue-work
   [junit4]   2> 1093439 INFO  (jetty-launcher-1220-thread-2) [    ] o.a.s.c.c.SolrZkClient makePath: /overseer/collection-map-running
   [junit4]   2> 1093439 INFO  (jetty-launcher-1220-thread-1) [    ] o.a.s.c.c.SolrZkClient makePath: /overseer/collection-map-running
   [junit4]   2> 1093440 INFO  (jetty-launcher-1220-thread-2) [    ] o.a.s.c.c.SolrZkClient makePath: /overseer/collection-map-completed
   [junit4]   2> 1093440 INFO  (jetty-launcher-1220-thread-1) [    ] o.a.s.c.c.SolrZkClient makePath: /overseer/collection-map-completed
   [junit4]   2> 1093440 INFO  (jetty-launcher-1220-thread-2) [    ] o.a.s.c.c.SolrZkClient makePath: /overseer/collection-map-failure
   [junit4]   2> 1093440 INFO  (jetty-launcher-1220-thread-1) [    ] o.a.s.c.c.SolrZkClient makePath: /overseer/collection-map-failure
   [junit4]   2> 1093441 INFO  (jetty-launcher-1220-thread-2) [    ] o.a.s.c.c.SolrZkClient makePath: /live_nodes
   [junit4]   2> 1093441 INFO  (jetty-launcher-1220-thread-1) [    ] o.a.s.c.c.SolrZkClient makePath: /collections
   [junit4]   2> 1093441 INFO  (jetty-launcher-1220-thread-2) [    ] o.a.s.c.c.SolrZkClient makePath: /collections
   [junit4]   2> 1093442 INFO  (jetty-launcher-1220-thread-2) [    ] o.a.s.c.c.SolrZkClient makePath: /aliases.json
   [junit4]   2> 1093442 INFO  (jetty-launcher-1220-thread-1) [    ] o.a.s.c.c.SolrZkClient makePath: /aliases.json
   [junit4]   2> 1093443 INFO  (jetty-launcher-1220-thread-1) [    ] o.a.s.c.c.SolrZkClient makePath: /clusterstate.json
   [junit4]   2> 1093443 INFO  (jetty-launcher-1220-thread-2) [    ] o.a.s.c.c.SolrZkClient makePath: /clusterstate.json
   [junit4]   2> 1093443 INFO  (jetty-launcher-1220-thread-2) [    ] o.a.s.c.c.SolrZkClient makePath: /security.json
   [junit4]   2> 1093443 INFO  (jetty-launcher-1220-thread-1) [    ] o.a.s.c.c.SolrZkClient makePath: /security.json
   [junit4]   2> 1093443 INFO  (jetty-launcher-1220-thread-2) [    ] o.a.s.c.c.ZkStateReader Updating cluster state from ZooKeeper... 
   [junit4]   2> 1093443 INFO  (jetty-launcher-1220-thread-1) [    ] o.a.s.c.c.ZkStateReader Updating cluster state from ZooKeeper... 
   [junit4]   2> 1093444 INFO  (jetty-launcher-1220-thread-2) [    ] o.a.s.c.c.ZkStateReader Updated live nodes from ZooKeeper... (0) -> (0)
   [junit4]   2> 1093444 INFO  (jetty-launcher-1220-thread-1) [    ] o.a.s.c.c.ZkStateReader Updated live nodes from ZooKeeper... (0) -> (0)
   [junit4]   2> 1093444 INFO  (jetty-launcher-1220-thread-2) [    ] o.a.s.c.c.SolrZkClient makePath: /overseer_elect
   [junit4]   2> 1093444 INFO  (jetty-launcher-1220-thread-1) [    ] o.a.s.c.c.SolrZkClient makePath: /overseer_elect
   [junit4]   2> 1093445 INFO  (jetty-launcher-1220-thread-2) [    ] o.a.s.c.c.SolrZkClient makePath: /overseer_elect/election
   [junit4]   2> 1093445 INFO  (jetty-launcher-1220-thread-1) [    ] o.a.s.c.c.SolrZkClient makePath: /overseer_elect/election
   [junit4]   2> 1093445 INFO  (jetty-launcher-1220-thread-2) [    ] o.a.s.c.Overseer Overseer (id=null) closing
   [junit4]   2> 1093445 INFO  (jetty-launcher-1220-thread-1) [    ] o.a.s.c.Overseer Overseer (id=null) closing
   [junit4]   2> 1093445 INFO  (jetty-launcher-1220-thread-2) [    ] o.a.s.c.LeaderElector Joined leadership election with path: /overseer_elect/election/95836724988870661-127.0.0.1:36177_solr-n_0000000000
   [junit4]   2> 1093445 INFO  (jetty-launcher-1220-thread-1) [    ] o.a.s.c.LeaderElector Joined leadership election with path: /overseer_elect/election/95836724988870662-127.0.0.1:33079_solr-n_0000000001
   [junit4]   2> 1093445 INFO  (jetty-launcher-1220-thread-2) [    ] o.a.s.c.OverseerElectionContext I am going to be the leader 127.0.0.1:36177_solr
   [junit4]   2> 1093446 INFO  (jetty-launcher-1220-thread-2) [    ] o.a.s.c.c.SolrZkClient makePath: /overseer_elect/leader
   [junit4]   2> 1093446 INFO  (jetty-launcher-1220-thread-1) [    ] o.a.s.c.LeaderElector Watching path /overseer_elect/election/95836724988870661-127.0.0.1:36177_solr-n_0000000000 to know if I could be the leader
   [junit4]   2> 1093446 INFO  (jetty-launcher-1220-thread-1) [    ] o.a.s.c.ZkController Register node as live in ZooKeeper:/live_nodes/127.0.0.1:33079_solr
   [junit4]   2> 1093446 INFO  (jetty-launcher-1220-thread-2) [    ] o.a.s.c.Overseer Overseer (id=95836724988870661-127.0.0.1:36177_solr-n_0000000000) starting
   [junit4]   2> 1093446 INFO  (jetty-launcher-1220-thread-1) [    ] o.a.s.c.c.SolrZkClient makePath: /live_nodes/127.0.0.1:33079_solr
   [junit4]   2> 1093446 INFO  (zkCallback-1231-thread-1) [    ] o.a.s.c.c.ZkStateReader A live node change: [WatchedEvent state:SyncConnected type:NodeChildrenChanged path:/live_nodes], has occurred - updating... (live nodes size: [0])
   [junit4]   2> 1093446 INFO  (zkCallback-1230-thread-1) [    ] o.a.s.c.c.ZkStateReader A live node change: [WatchedEvent state:SyncConnected type:NodeChildrenChanged path:/live_nodes], has occurred - updating... (live nodes size: [0])
   [junit4]   2> 1093447 INFO  (jetty-launcher-1220-thread-2) [    ] o.a.s.c.c.SolrZkClient makePath: /overseer/queue-work
   [junit4]   2> 1093447 INFO  (zkCallback-1230-thread-1) [    ] o.a.s.c.c.ZkStateReader Updated live nodes from ZooKeeper... (0) -> (1)
   [junit4]   2> 1093447 INFO  (zkCallback-1231-thread-1) [    ] o.a.s.c.c.ZkStateReader Updated live nodes from ZooKeeper... (0) -> (1)
   [junit4]   2> 1093448 INFO  (jetty-launcher-1220-thread-2) [    ] o.a.s.c.OverseerAutoReplicaFailoverThread Starting OverseerAutoReplicaFailoverThread autoReplicaFailoverWorkLoopDelay=10000 autoReplicaFailoverWaitAfterExpiration=30000 autoReplicaFailoverBadNodeExpiration=60000
   [junit4]   2> 1093449 INFO  (OverseerCollectionConfigSetProcessor-95836724988870661-127.0.0.1:36177_solr-n_0000000000) [    ] o.a.s.c.OverseerTaskProcessor Process current queue of overseer operations
   [junit4]   2> 1093449 INFO  (OverseerStateUpdate-95836724988870661-127.0.0.1:36177_solr-n_0000000000) [    ] o.a.s.c.Overseer Starting to work on the main queue
   [junit4]   2> 1093449 INFO  (jetty-launcher-1220-thread-2) [    ] o.a.s.c.ZkController Publish node=127.0.0.1:36177_solr as DOWN
   [junit4]   2> 1093449 INFO  (OverseerStateUpdate-95836724988870661-127.0.0.1:36177_solr-n_0000000000) [    ] o.a.s.c.c.ZkStateReader Updated live nodes from ZooKeeper... (1) -> (1)
   [junit4]   2> 1093450 INFO  (OverseerStateUpdate-95836724988870661-127.0.0.1:36177_solr-n_0000000000) [    ] o.a.s.c.Overseer processMessage: queueSize: 1, message = {
   [junit4]   2>   "operation":"downnode",
   [junit4]   2>   "node_name":"127.0.0.1:36177_solr"} current state version: 0
   [junit4]   2> 1093450 INFO  (OverseerStateUpdate-95836724988870661-127.0.0.1:36177_solr-n_0000000000) [    ] o.a.s.c.o.NodeMutator DownNode state invoked for node: 127.0.0.1:36177_solr
   [junit4]   2> 1093466 INFO  (jetty-launcher-1220-thread-1) [    ] o.a.s.c.CoreContainer Security conf doesn't exist. Skipping setup for authorization module.
   [junit4]   2> 1093466 INFO  (jetty-launcher-1220-thread-1) [    ] o.a.s.c.CoreContainer No authentication plugin used.
   [junit4]   2> 1093466 INFO  (jetty-launcher-1220-thread-1) [    ] o.a.s.c.CorePropertiesLocator Looking for core definitions underneath /home/jenkins/workspace/Lucene-Solr-master-Linux/solr/build/solr-core/test/J0/temp/solr.schema.TestManagedSchemaAPI_7E459AB348B88AB6-001/tempDir-001/node1/.
   [junit4]   2> 1093466 INFO  (jetty-launcher-1220-thread-1) [    ] o.a.s.c.CorePropertiesLocator Found 0 core definitions
   [junit4]   2> 1093467 INFO  (jetty-launcher-1220-thread-1) [    ] o.a.s.s.SolrDispatchFilter user.dir=/home/jenkins/workspace/Lucene-Solr-master-Linux/solr/build/solr-core/test/J0
   [junit4]   2> 1093467 INFO  (jetty-launcher-1220-thread-1) [    ] o.a.s.s.SolrDispatchFilter SolrDispatchFilter.init() done
   [junit4]   2> 1094449 INFO  (jetty-launcher-1220-thread-2) [    ] o.a.s.c.ZkController Register node as live in ZooKeeper:/live_nodes/127.0.0.1:36177_solr
   [junit4]   2> 1094450 INFO  (jetty-launcher-1220-thread-2) [    ] o.a.s.c.c.SolrZkClient makePath: /live_nodes/127.0.0.1:36177_solr
   [junit4]   2> 1094451 INFO  (zkCallback-1231-thread-1) [    ] o.a.s.c.c.ZkStateReader A live node change: [WatchedEvent state:SyncConnected type:NodeChildrenChanged path:/live_nodes], has occurred - updating... (live nodes size: [1])
   [junit4]   2> 1094451 INFO  (zkCallback-1230-thread-1) [    ] o.a.s.c.c.ZkStateReader A live node change: [WatchedEvent state:SyncConnected type:NodeChildrenChanged path:/live_nodes], has occurred - updating... (live nodes size: [1])
   [junit4]   2> 1094451 INFO  (zkCallback-1231-thread-1) [    ] o.a.s.c.c.ZkStateReader Updated live nodes from ZooKeeper... (1) -> (2)
   [junit4]   2> 1094451 INFO  (zkCallback-1230-thread-1) [    ] o.a.s.c.c.ZkStateReader Updated live nodes from ZooKeeper... (1) -> (2)
   [junit4]   2> 1094497 INFO  (jetty-launcher-1220-thread-2) [    ] o.a.s.c.CoreContainer Security conf doesn't exist. Skipping setup for authorization module.
   [junit4]   2> 1094497 INFO  (jetty-launcher-1220-thread-2) [    ] o.a.s.c.CoreContainer No authentication plugin used.
   [junit4]   2> 1094499 INFO  (jetty-launcher-1220-thread-2) [    ] o.a.s.c.CorePropertiesLocator Looking for core definitions underneath /home/jenkins/workspace/Lucene-Solr-master-Linux/solr/build/solr-core/test/J0/temp/solr.schema.TestManagedSchemaAPI_7E459AB348B88AB6-001/tempDir-001/node2/.
   [junit4]   2> 1094499 INFO  (jetty-launcher-1220-thread-2) [    ] o.a.s.c.CorePropertiesLocator Found 0 core definitions
   [junit4]   2> 1094499 INFO  (jetty-launcher-1220-thread-2) [    ] o.a.s.s.SolrDispatchFilter user.dir=/home/jenkins/workspace/Lucene-Solr-master-Linux/solr/build/solr-core/test/J0
   [junit4]   2> 1094499 INFO  (jetty-launcher-1220-thread-2) [    ] o.a.s.s.SolrDispatchFilter SolrDispatchFilter.init() done
   [junit4]   2> 1094499 INFO  (SUITE-TestManagedSchemaAPI-seed#[7E459AB348B88AB6]-worker) [    ] o.a.s.c.c.SolrZkClient Using default ZkCredentialsProvider
   [junit4]   2> 1094500 INFO  (SUITE-TestManagedSchemaAPI-seed#[7E459AB348B88AB6]-worker) [    ] o.a.s.c.c.ConnectionManager Waiting for client to connect to ZooKeeper
   [junit4]   2> 1094500 INFO  (zkCallback-1232-thread-1) [    ] o.a.s.c.c.ConnectionManager Watcher org.apache.solr.common.cloud.ConnectionManager@14313aa name:ZooKeeperConnection Watcher:127.0.0.1:35765 got event WatchedEvent state:SyncConnected type:None path:null path:null type:None
   [junit4]   2> 1094500 INFO  (SUITE-TestManagedSchemaAPI-seed#[7E459AB348B88AB6]-worker) [    ] o.a.s.c.c.ConnectionManager Client is connected to ZooKeeper
   [junit4]   2> 1094501 INFO  (SUITE-TestManagedSchemaAPI-seed#[7E459AB348B88AB6]-worker) [    ] o.a.s.c.c.SolrZkClient Using default ZkACLProvider
   [junit4]   2> 1094501 INFO  (SUITE-TestManagedSchemaAPI-seed#[7E459AB348B88AB6]-worker) [    ] o.a.s.c.s.i.CloudSolrClient Final constructed zkHost string: 127.0.0.1:35765/solr
   [junit4]   2> 1094502 INFO  (SUITE-TestManagedSchemaAPI-seed#[7E459AB348B88AB6]-worker) [    ] o.a.s.c.c.SolrZkClient Using default ZkCredentialsProvider
   [junit4]   2> 1094502 INFO  (SUITE-TestManagedSchemaAPI-seed#[7E459AB348B88AB6]-worker) [    ] o.a.s.c.c.ConnectionManager Waiting for client to connect to ZooKeeper
   [junit4]   2> 1094502 INFO  (zkCallback-1234-thread-1) [    ] o.a.s.c.c.ConnectionManager Watcher org.apache.solr.common.cloud.ConnectionManager@371f4c name:ZooKeeperConnection Watcher:127.0.0.1:35765/solr got event WatchedEvent state:SyncConnected type:None path:null path:null type:None
   [junit4]   2> 1094502 INFO  (SUITE-TestManagedSchemaAPI-seed#[7E459AB348B88AB6]-worker) [    ] o.a.s.c.c.ConnectionManager Client is connected to ZooKeeper
   [junit4]   2> 1094503 INFO  (SUITE-TestManagedSchemaAPI-seed#[7E459AB348B88AB6]-worker) [    ] o.a.s.c.c.SolrZkClient Using default ZkACLProvider
   [junit4]   2> 1094503 INFO  (SUITE-TestManagedSchemaAPI-seed#[7E459AB348B88AB6]-worker) [    ] o.a.s.c.c.ZkStateReader Updating cluster state from ZooKeeper... 
   [junit4]   2> 1094503 INFO  (SUITE-TestManagedSchemaAPI-seed#[7E459AB348B88AB6]-worker) [    ] o.a.s.c.c.ZkStateReader Updated live nodes from ZooKeeper... (0) -> (2)
   [junit4]   2> 1094504 INFO  (SUITE-TestManagedSchemaAPI-seed#[7E459AB348B88AB6]-worker) [    ] o.a.s.c.c.SolrZkClient makePath: /configs/conf1/solrconfig.xml
   [junit4]   2> 1094504 INFO  (SUITE-TestManagedSchemaAPI-seed#[7E459AB348B88AB6]-worker) [    ] o.a.s.c.c.SolrZkClient makePath: /configs/conf1/managed-schema
   [junit4]   2> 1094516 INFO  (TEST-TestManagedSchemaAPI.test-seed#[7E459AB348B88AB6]) [    ] o.a.s.SolrTestCaseJ4 ###Starting test
   [junit4]   2> 1094518 INFO  (qtp30965955-9363) [    ] o.a.s.h.a.CollectionsHandler Invoked Collection Action :create with params replicationFactor=2&collection.configName=conf1&name=testschemaapi&action=CREATE&numShards=1&wt=javabin&version=2 and sendToOCPQueue=true
   [junit4]   2> 1094519 INFO  (OverseerCollectionConfigSetProcessor-95836724988870661-127.0.0.1:36177_solr-n_0000000000) [    ] o.a.s.c.OverseerTaskProcessor Overseer Collection Message Handler: Get the message id:/overseer/collection-queue-work/qn-0000000000 message:{
   [junit4]   2>   "name":"testschemaapi",
   [junit4]   2>   "fromApi":"true",
   [junit4]   2>   "replicationFactor":"2",
   [junit4]   2>   "collection.configName":"conf1",
   [junit4]   2>   "numShards":"1",
   [junit4]   2>   "stateFormat":"2",
   [junit4]   2>   "operation":"create"}
   [junit4]   2> 1094519 INFO  (OverseerThreadFactory-4328-thread-1) [    ] o.a.s.c.OverseerCollectionMessageHandler OverseerCollectionMessageHandler.processMessage : create , {
   [junit4]   2>   "name":"testschemaapi",
   [junit4]   2>   "fromApi":"true",
   [junit4]   2>   "replicationFactor":"2",
   [junit4]   2>   "collection.configName":"conf1",
   [junit4]   2>   "numShards":"1",
   [junit4]   2>   "stateFormat":"2",
   [junit4]   2>   "operation":"create"}
   [junit4]   2> 1094519 INFO  (OverseerThreadFactory-4328-thread-1) [    ] o.a.s.c.OverseerCollectionMessageHandler Create collection testschemaapi
   [junit4]   2> 1094520 INFO  (OverseerThreadFactory-4328-thread-1) [    ] o.a.s.c.OverseerCollectionMessageHandler creating collections conf node /collections/testschemaapi 
   [junit4]   2> 1094520 INFO  (OverseerThreadFactory-4328-thread-1) [    ] o.a.s.c.c.SolrZkClient makePath: /collections/testschemaapi
   [junit4]   2> 1094520 INFO  (zkCallback-1231-thread-1) [    ] o.a.s.c.c.ZkStateReader A collections change: [WatchedEvent state:SyncConnected type:NodeChildrenChanged path:/collections], has occurred - updating...
   [junit4]   2> 1094520 INFO  (zkCallback-1234-thread-1) [    ] o.a.s.c.c.ZkStateReader A collections change: [WatchedEvent state:SyncConnected type:NodeChildrenChanged path:/collections], has occurred - updating...
   [junit4]   2> 1094520 INFO  (zkCallback-1230-thread-1) [    ] o.a.s.c.c.ZkStateReader A collections change: [WatchedEvent state:SyncConnected type:NodeChildrenChanged path:/collections], has occurred - updating...
   [junit4]   2> 1094521 INFO  (OverseerStateUpdate-95836724988870661-127.0.0.1:36177_solr-n_0000000000) [    ] o.a.s.c.Overseer processMessage: queueSize: 1, message = {
   [junit4]   2>   "name":"testschemaapi",
   [junit4]   2>   "fromApi":"true",
   [junit4]   2>   "replicationFactor":"2",
   [junit4]   2>   "collection.configName":"conf1",
   [junit4]   2>   "numShards":"1",
   [junit4]   2>   "stateFormat":"2",
   [junit4]   2>   "operation":"create"} current state version: 0
   [junit4]   2> 1094521 INFO  (OverseerStateUpdate-95836724988870661-127.0.0.1:36177_solr-n_0000000000) [    ] o.a.s.c.o.ClusterStateMutator building a new cName: testschemaapi
   [junit4]   2> 1094522 INFO  (OverseerStateUpdate-95836724988870661-127.0.0.1:36177_solr-n_0000000000) [    ] o.a.s.c.o.ZkStateWriter going to create_collection /collections/testschemaapi/state.json
   [junit4]   2> 1094621 INFO  (OverseerThreadFactory-4328-thread-1) [    ] o.a.s.c.OverseerCollectionMessageHandler Creating SolrCores for new collection testschemaapi, shardNames [shard1] , replicationFactor : 2
   [junit4]   2> 1094621 INFO  (OverseerThreadFactory-4328-thread-1) [    ] o.a.s.c.OverseerCollectionMessageHandler Creating core testschemaapi_shard1_replica2 as part of shard shard1 of collection testschemaapi on 127.0.0.1:36177_solr
   [junit4]   2> 1094622 INFO  (OverseerThreadFactory-4328-thread-1) [    ] o.a.s.c.OverseerCollectionMessageHandler Creating core testschemaapi_shard1_replica1 as part of shard shard1 of collection testschemaapi on 127.0.0.1:33079_solr
   [junit4]   2> 1094623 INFO  (qtp30965955-9367) [    ] o.a.s.h.a.CoreAdminOperation core create command qt=/admin/cores&collection.configName=conf1&name=testschemaapi_shard1_replica1&action=CREATE&numShards=1&collection=testschemaapi&shard=shard1&wt=javabin&version=2
   [junit4]   2> 1094623 INFO  (qtp28279198-9364) [    ] o.a.s.h.a.CoreAdminOperation core create command qt=/admin/cores&collection.configName=conf1&name=testschemaapi_shard1_replica2&action=CREATE&numShards=1&collection=testschemaapi&shard=shard1&wt=javabin&version=2
   [junit4]   2> 1094623 INFO  (qtp30965955-9367) [    ] o.a.s.c.CoreDescriptor Created CoreDescriptor: {name=testschemaapi_shard1_replica1, collection.configName=conf1, config=solrconfig.xml, transient=false, schema=schema.xml, loadOnStartup=true, configSetProperties=configsetprops.json, collection=testschemaapi, numShards=1, dataDir=data/, shard=shard1}
   [junit4]   2> 1094623 INFO  (qtp28279198-9364) [    ] o.a.s.c.CoreDescriptor Created CoreDescriptor: {name=testschemaapi_shard1_replica2, collection.configName=conf1, config=solrconfig.xml, transient=false, schema=schema.xml, loadOnStartup=true, configSetProperties=configsetprops.json, collection=testschemaapi, numShards=1, dataDir=data/, shard=shard1}
   [junit4]   2> 1094624 INFO  (qtp30965955-9367) [    ] o.a.s.c.ZkController publishing state=down
   [junit4]   2> 1094624 INFO  (qtp28279198-9364) [    ] o.a.s.c.ZkController publishing state=down
   [junit4]   2> 1094624 INFO  (qtp30965955-9367) [    ] o.a.s.c.ZkController Registering watch for collection testschemaapi
   [junit4]   2> 1094624 INFO  (qtp30965955-9367) [    ] o.a.s.c.c.ZkStateReader addZkWatch [testschemaapi]
   [junit4]   2> 1094624 INFO  (qtp28279198-9364) [    ] o.a.s.c.ZkController Registering watch for collection testschemaapi
   [junit4]   2> 1094624 INFO  (OverseerStateUpdate-95836724988870661-127.0.0.1:36177_solr-n_0000000000) [    ] o.a.s.c.Overseer processMessage: queueSize: 2, message = {
   [junit4]   2>   "core":"testschemaapi_shard1_replica1",
   [junit4]   2>   "roles":null,
   [junit4]   2>   "base_url":"http://127.0.0.1:33079/solr",
   [junit4]   2>   "node_name":"127.0.0.1:33079_solr",
   [junit4]   2>   "numShards":"1",
   [junit4]   2>   "state":"down",
   [junit4]   2>   "shard":"shard1",
   [junit4]   2>   "collection":"testschemaapi",
   [junit4]   2>   "operation":"state"} current state version: 0
   [junit4]   2> 1094624 INFO  (qtp30965955-9367) [    ] o.a.s.c.c.ZkStateReader Add data for [testschemaapi] ver [0]
   [junit4]   2> 1094624 INFO  (qtp28279198-9364) [    ] o.a.s.c.c.ZkStateReader addZkWatch [testschemaapi]
   [junit4]   2> 1094624 INFO  (qtp30965955-9367) [    ] o.a.s.c.ZkController look for our core node name
   [junit4]   2> 1094624 INFO  (OverseerStateUpdate-95836724988870661-127.0.0.1:36177_solr-n_0000000000) [    ] o.a.s.c.o.ReplicaMutator Update state numShards=1 message={
   [junit4]   2>   "core":"testschemaapi_shard1_replica1",
   [junit4]   2>   "roles":null,
   [junit4]   2>   "base_url":"http://127.0.0.1:33079/solr",
   [junit4]   2>   "node_name":"127.0.0.1:33079_solr",
   [junit4]   2>   "numShards":"1",
   [junit4]   2>   "state":"down",
   [junit4]   2>   "shard":"shard1",
   [junit4]   2>   "collection":"testschemaapi",
   [junit4]   2>   "operation":"state"}
   [junit4]   2> 1094624 INFO  (qtp28279198-9364) [    ] o.a.s.c.c.ZkStateReader Add data for [testschemaapi] ver [0]
   [junit4]   2> 1094624 INFO  (qtp28279198-9364) [    ] o.a.s.c.ZkController look for our core node name
   [junit4]   2> 1094625 INFO  (OverseerStateUpdate-95836724988870661-127.0.0.1:36177_solr-n_0000000000) [    ] o.a.s.c.Overseer processMessage: queueSize: 2, message = {
   [junit4]   2>   "core":"testschemaapi_shard1_replica2",
   [junit4]   2>   "roles":null,
   [junit4]   2>   "base_url":"http://127.0.0.1:36177/solr",
   [junit4]   2>   "node_name":"127.0.0.1:36177_solr",
   [junit4]   2>   "numShards":"1",
   [junit4]   2>   "state":"down",
   [junit4]   2>   "shard":"shard1",
   [junit4]   2>   "collection":"testschemaapi",
   [junit4]   2>   "operation":"state"} current state version: 0
   [junit4]   2> 1094625 INFO  (OverseerStateUpdate-95836724988870661-127.0.0.1:36177_solr-n_0000000000) [    ] o.a.s.c.o.ReplicaMutator Update state numShards=1 message={
   [junit4]   2>   "core":"testschemaapi_shard1_replica2",
   [junit4]   2>   "roles":null,
   [junit4]   2>   "base_url":"http://127.0.0.1:36177/solr",
   [junit4]   2>   "node_name":"127.0.0.1:36177_solr",
   [junit4]   2>   "numShards":"1",
   [junit4]   2>   "state":"down",
   [junit4]   2>   "shard":"shard1",
   [junit4]   2>   "collection":"testschemaapi",
   [junit4]   2>   "operation":"state"}
   [junit4]   2> 1094726 INFO  (OverseerStateUpdate-95836724988870661-127.0.0.1:36177_solr-n_0000000000) [    ] o.a.s.c.o.ZkStateWriter going to update_collection /collections/testschemaapi/state.json version: 0
   [junit4]   2> 1094726 INFO  (zkCallback-1230-thread-1) [    ] o.a.s.c.c.ZkStateReader A cluster state change: [WatchedEvent state:SyncConnected type:NodeDataChanged path:/collections/testschemaapi/state.json] for collection [testschemaapi] has occurred - updating... (live nodes size: [2])
   [junit4]   2> 1094726 INFO  (zkCallback-1231-thread-1) [    ] o.a.s.c.c.ZkStateReader A cluster state change: [WatchedEvent state:SyncConnected type:NodeDataChanged path:/collections/testschemaapi/state.json] for collection [testschemaapi] has occurred - updating... (live nodes size: [2])
   [junit4]   2> 1094726 INFO  (zkCallback-1230-thread-1) [    ] o.a.s.c.c.ZkStateReader Updating data for [testschemaapi] from [0] to [1]
   [junit4]   2> 1094727 INFO  (zkCallback-1231-thread-1) [    ] o.a.s.c.c.ZkStateReader Updating data for [testschemaapi] from [0] to [1]
   [junit4]   2> 1095624 INFO  (qtp30965955-9367) [    ] o.a.s.c.ZkController waiting to find shard id in clusterstate for testschemaapi_shard1_replica1
   [junit4]   2> 1095624 INFO  (qtp30965955-9367) [    ] o.a.s.c.ZkController Check for collection zkNode:testschemaapi
   [junit4]   2> 1095625 INFO  (qtp28279198-9364) [    ] o.a.s.c.ZkController waiting to find shard id in clusterstate for testschemaapi_shard1_replica2
   [junit4]   2> 1095625 INFO  (qtp28279198-9364) [    ] o.a.s.c.ZkController Check for collection zkNode:testschemaapi
   [junit4]   2> 1095625 INFO  (qtp30965955-9367) [    ] o.a.s.c.ZkController Collection zkNode exists
   [junit4]   2> 1095625 INFO  (qtp30965955-9367) [    ] o.a.s.c.c.ZkStateReader Load collection config from: [/collections/testschemaapi]
   [junit4]   2> 1095625 INFO  (qtp28279198-9364) [    ] o.a.s.c.ZkController Collection zkNode exists
   [junit4]   2> 1095625 INFO  (qtp28279198-9364) [    ] o.a.s.c.c.ZkStateReader Load collection config from: [/collections/testschemaapi]
   [junit4]   2> 1095625 INFO  (qtp30965955-9367) [    ] o.a.s.c.c.ZkStateReader path=[/collections/testschemaapi] [configName]=[conf1] specified config exists in ZooKeeper
   [junit4]   2> 1095625 INFO  (qtp30965955-9367) [    ] o.a.s.c.SolrResourceLoader new SolrResourceLoader for directory: '/home/jenkins/workspace/Lucene-Solr-master-Linux/solr/build/solr-core/test/J0/temp/solr.schema.TestManagedSchemaAPI_7E459AB348B88AB6-001/tempDir-001/node1/testschemaapi_shard1_replica1'
   [junit4]   2> 1095625 INFO  (qtp28279198-9364) [    ] o.a.s.c.c.ZkStateReader path=[/collections/testschemaapi] [configName]=[conf1] specified config exists in ZooKeeper
   [junit4]   2> 1095625 INFO  (qtp28279198-9364) [    ] o.a.s.c.SolrResourceLoader new SolrResourceLoader for directory: '/home/jenkins/workspace/Lucene-Solr-master-Linux/solr/build/solr-core/test/J0/temp/solr.schema.TestManagedSchemaAPI_7E459AB348B88AB6-001/tempDir-001/node2/testschemaapi_shard1_replica2'
   [junit4]   2> 1095625 INFO  (qtp30965955-9367) [    ] o.a.s.c.SolrResourceLoader JNDI not configured for solr (NoInitialContextEx)
   [junit4]   2> 1095625 INFO  (qtp30965955-9367) [    ] o.a.s.c.SolrResourceLoader solr home defaulted to 'solr/' (could not find system property or JNDI)
   [junit4]   2> 1095625 INFO  (qtp28279198-9364) [    ] o.a.s.c.SolrResourceLoader JNDI not configured for solr (NoInitialContextEx)
   [junit4]   2> 1095625 INFO  (qtp28279198-9364) [    ] o.a.s.c.SolrResourceLoader solr home defaulted to 'solr/' (could not find system property or JNDI)
   [junit4]   2> 1095626 INFO  (qtp28279198-9364) [    ] o.a.s.c.Config loaded config solrconfig.xml with version 0 
   [junit4]   2> 1095626 INFO  (qtp30965955-9367) [    ] o.a.s.c.Config loaded config solrconfig.xml with version 0 
   [junit4]   2> 1095628 INFO  (qtp28279198-9364) [    ] o.a.s.c.SolrConfig current version of requestparams : -1
   [junit4]   2> 1095628 INFO  (qtp30965955-9367) [    ] o.a.s.c.SolrConfig current version of requestparams : -1
   [junit4]   2> 1095632 INFO  (qtp28279198-9364) [    ] o.a.s.c.SolrConfig Using Lucene MatchVersion: 7.0.0
   [junit4]   2> 1095632 INFO  (qtp30965955-9367) [    ] o.a.s.c.SolrConfig Using Lucene MatchVersion: 7.0.0
   [junit4]   2> 1095641 INFO  (qtp28279198-9364) [    ] o.a.s.c.SolrConfig Loaded SolrConfig: solrconfig.xml
   [junit4]   2> 1095641 INFO  (qtp30965955-9367) [    ] o.a.s.c.SolrConfig Loaded SolrConfig: solrconfig.xml
   [junit4]   2> 1095643 INFO  (qtp28279198-9364) [    ] o.a.s.s.IndexSchema [testschemaapi_shard1_replica2] Schema name=minimal
   [junit4]   2> 1095643 INFO  (qtp30965955-9367) [    ] o.a.s.s.IndexSchema [testschemaapi_shard1_replica1] Schema name=minimal
   [junit4]   2> 1095647 INFO  (qtp28279198-9364) [    ] o.a.s.s.IndexSchema unique key field: id
   [junit4]   2> 1095647 INFO  (qtp30965955-9367) [    ] o.a.s.s.IndexSchema unique key field: id
   [junit4]   2> 1095648 INFO  (qtp30965955-9367) [    ] o.a.s.c.ConfigSetProperties Did not find ConfigSet properties, assuming default properties: Can't find resource 'configsetprops.json' in classpath or '/configs/conf1', cwd=/home/jenkins/workspace/Lucene-Solr-master-Linux/solr/build/solr-core/test/J0
   [junit4]   2> 1095648 INFO  (qtp28279198-9364) [    ] o.a.s.c.ConfigSetProperties Did not find ConfigSet properties, assuming default properties: Can't find resource 'configsetprops.json' in classpath or '/configs/conf1', cwd=/home/jenkins/workspace/Lucene-Solr-master-Linux/solr/build/solr-core/test/J0
   [junit4]   2> 1095648 INFO  (qtp30965955-9367) [    ] o.a.s.c.CoreContainer Creating SolrCore 'testschemaapi_shard1_replica1' using configuration from collection testschemaapi
   [junit4]   2> 1095648 INFO  (qtp28279198-9364) [    ] o.a.s.c.CoreContainer Creating SolrCore 'testschemaapi_shard1_replica2' using configuration from collection testschemaapi
   [junit4]   2> 1095648 INFO  (qtp28279198-9364) [    ] o.a.s.c.SolrCore org.apache.solr.core.MockDirectoryFactory
   [junit4]   2> 1095648 INFO  (qtp30965955-9367) [    ] o.a.s.c.SolrCore org.apache.solr.core.MockDirectoryFactory
   [junit4]   2> 1095649 INFO  (qtp28279198-9364) [    ] o.a.s.c.SolrCore [[testschemaapi_shard1_replica2] ] Opening new SolrCore at [/home/jenkins/workspace/Lucene-Solr-master-Linux/solr/build/solr-core/test/J0/temp/solr.schema.TestManagedSchemaAPI_7E459AB348B88AB6-001/tempDir-001/node2/testschemaapi_shard1_replica2], dataDir=[/home/jenkins/workspace/Lucene-Solr-master-Linux/solr/build/solr-core/test/J0/temp/solr.schema.TestManagedSchemaAPI_7E459AB348B88AB6-001/tempDir-001/node2/./testschemaapi_shard1_replica2/data/]
   [junit4]   2> 1095649 INFO  (qtp30965955-9367) [    ] o.a.s.c.SolrCore [[testschemaapi_shard1_replica1] ] Opening new SolrCore at [/home/jenkins/workspace/Lucene-Solr-master-Linux/solr/build/solr-core/test/J0/temp/solr.schema.TestManagedSchemaAPI_7E459AB348B88AB6-001/tempDir-001/node1/testschemaapi_shard1_replica1], dataDir=[/home/jenkins/workspace/Lucene-Solr-master-Linux/solr/build/solr-core/test/J0/temp/solr.schema.TestManagedSchemaAPI_7E459AB348B88AB6-001/tempDir-001/node1/./testschemaapi_shard1_replica1/data/]
   [junit4]   2> 1095649 INFO  (qtp28279198-9364) [    ] o.a.s.c.SolrCore JMX monitoring not detected for core: testschemaapi_shard1_replica2
   [junit4]   2> 1095649 INFO  (qtp30965955-9367) [    ] o.a.s.c.SolrCore JMX monitoring not detected for core: testschemaapi_shard1_replica1
   [junit4]   2> 1095649 INFO  (qtp28279198-9364) [    ] o.a.s.c.CachingDirectoryFactory return new directory for /home/jenkins/workspace/Lucene-Solr-master-Linux/solr/build/solr-core/test/J0/temp/solr.schema.TestManagedSchemaAPI_7E459AB348B88AB6-001/tempDir-001/node2/./testschemaapi_shard1_replica2/data
   [junit4]   2> 1095649 INFO  (qtp28279198-9364) [    ] o.a.s.c.SolrCore New index directory detected: old=null new=/home/jenkins/workspace/Lucene-Solr-master-Linux/solr/build/solr-core/test/J0/temp/solr.schema.TestManagedSchemaAPI_7E459AB348B88AB6-001/tempDir-001/node2/./testschemaapi_shard1_replica2/data/index/
   [junit4]   2> 1095650 INFO  (qtp30965955-9367) [    ] o.a.s.c.CachingDirectoryFactory return new directory for /home/jenkins/workspace/Lucene-Solr-master-Linux/solr/build/solr-core/test/J0/temp/solr.schema.TestManagedSchemaAPI_7E459AB348B88AB6-001/tempDir-001/node1/./testschemaapi_shard1_replica1/data
   [junit4]   2> 1095650 WARN  (qtp28279198-9364) [    ] o.a.s.c.SolrCore [testschemaapi_shard1_replica2] Solr index directory '/home/jenkins/workspace/Lucene-Solr-master-Linux/solr/build/solr-core/test/J0/temp/solr.schema.TestManagedSchemaAPI_7E459AB348B88AB6-001/tempDir-001/node2/./testschemaapi_shard1_replica2/data/index' doesn't exist. Creating new index...
   [junit4]   2> 1095650 INFO  (qtp30965955-9367) [    ] o.a.s.c.SolrCore New index directory detected: old=null new=/home/jenkins/workspace/Lucene-Solr-master-Linux/solr/build/solr-core/test/J0/temp/solr.schema.TestManagedSchemaAPI_7E459AB348B88AB6-001/tempDir-001/node1/./testschemaapi_shard1_replica1/data/index/
   [junit4]   2> 1095650 WARN  (qtp30965955-9367) [    ] o.a.s.c.SolrCore [testschemaapi_shard1_replica1] Solr index directory '/home/jenkins/workspace/Lucene-Solr-master-Linux/solr/build/solr-core/test/J0/temp/solr.schema.TestManagedSchemaAPI_7E459AB348B88AB6-001/tempDir-001/node1/./testschemaapi_shard1_replica1/data/index' doesn't exist. Creating new index...
   [junit4]   2> 1095650 INFO  (qtp28279198-9364) [    ] o.a.s.c.CachingDirectoryFactory return new directory for /home/jenkins/workspace/Lucene-Solr-master-Linux/solr/build/solr-core/test/J0/temp/solr.schema.TestManagedSchemaAPI_7E459AB348B88AB6-001/tempDir-001/node2/./testschemaapi_shard1_replica2/data/index
   [junit4]   2> 1095651 INFO  (qtp30965955-9367) [    ] o.a.s.c.CachingDirectoryFactory return new directory for /home/jenkins/workspace/Lucene-Solr-master-Linux/solr/build/solr-core/test/J0/temp/solr.schema.TestManagedSchemaAPI_7E459AB348B88AB6-001/tempDir-001/node1/./testschemaapi_shard1_replica1/data/index
   [junit4]   2> 1095651 INFO  (qtp28279198-9364) [    ] o.a.s.c.SolrDeletionPolicy SolrDeletionPolicy.onCommit: commits: num=1
   [junit4]   2> 	commit{dir=MockDirectoryWrapper(RAMDirectory@a5e34e lockFactory=org.apache.lucene.store.SingleInstanceLockFactory@10e3a07),segFN=segments_1,generation=1}
   [junit4]   2> 1095651 INFO  (qtp30965955-9367) [    ] o.a.s.c.SolrDeletionPolicy SolrDeletionPolicy.onCommit: commits: num=1
   [junit4]   2> 	commit{dir=MockDirectoryWrapper(RAMDirectory@17db4a lockFactory=org.apache.lucene.store.SingleInstanceLockFactory@d51ad0),segFN=segments_1,generation=1}
   [junit4]   2> 1095651 INFO  (qtp28279198-9364) [    ] o.a.s.c.SolrDeletionPolicy newest commit generation = 1
   [junit4]   2> 1095651 INFO  (qtp30965955-9367) [    ] o.a.s.c.SolrDeletionPolicy newest commit generation = 1
   [junit4]   2> 1095651 INFO  (OldIndexDirectoryCleanupThreadForCore-testschemaapi_shard1_replica2) [    ] o.a.s.c.SolrCore Looking for old index directories to cleanup for core testschemaapi_shard1_replica2 in /home/jenkins/workspace/Lucene-Solr-master-Linux/solr/build/solr-core/test/J0/temp/solr.schema.TestManagedSchemaAPI_7E459AB348B88AB6-001/tempDir-001/node2/./testschemaapi_shard1_replica2/data/
   [junit4]   2> 1095651 INFO  (OldIndexDirectoryCleanupThreadForCore-testschemaapi_shard1_replica1) [    ] o.a.s.c.SolrCore Looking for old index directories to cleanup for core testschemaapi_shard1_replica1 in /home/jenkins/workspace/Lucene-Solr-master-Linux/solr/build/solr-core/test/J0/temp/solr.schema.TestManagedSchemaAPI_7E459AB348B88AB6-001/tempDir-001/node1/./testschemaapi_shard1_replica1/data/
   [junit4]   2> 1095651 WARN  (OldIndexDirectoryCleanupThreadForCore-testschemaapi_shard1_replica2) [    ] o.a.s.c.DirectoryFactory /home/jenkins/workspace/Lucene-Solr-master-Linux/solr/build/solr-core/test/J0/temp/solr.schema.TestManagedSchemaAPI_7E459AB348B88AB6-001/tempDir-001/node2/./testschemaapi_shard1_replica2/data/ does not point to a valid data directory; skipping clean-up of old index directories.
   [junit4]   2> 1095651 WARN  (OldIndexDirectoryCleanupThreadForCore-testschemaapi_shard1_replica1) [    ] o.a.s.c.DirectoryFactory /home/jenkins/workspace/Lucene-Solr-master-Linux/solr/build/solr-core/test/J0/temp/solr.schema.TestManagedSchemaAPI_7E459AB348B88AB6-001/tempDir-001/node1/./testschemaapi_shard1_replica1/data/ does not point to a valid data directory; skipping clean-up of old index directories.
   [junit4]   2> 1095652 INFO  (qtp30965955-9367) [    ] o.a.s.c.SolrCore no updateRequestProcessorChain defined as default, creating implicit default
   [junit4]   2> 1095652 INFO  (qtp28279198-9364) [    ] o.a.s.c.SolrCore no updateRequestProcessorChain defined as default, creating implicit default
   [junit4]   2> 1095653 INFO  (qtp30965955-9367) [    ] o.a.s.h.l.XMLLoader xsltCacheLifetimeSeconds=60
   [junit4]   2> 1095653 INFO  (qtp28279198-9364) [    ] o.a.s.h.l.XMLLoader xsltCacheLifetimeSeconds=60
   [junit4]   2> 1095654 INFO  (qtp30965955-9367) [    ] o.a.s.h.l.XMLLoader xsltCacheLifetimeSeconds=60
   [junit4]   2> 1095654 INFO  (qtp28279198-9364) [    ] o.a.s.h.l.XMLLoader xsltCacheLifetimeSeconds=60
   [junit4]   2> 1095654 INFO  (qtp30965955-9367) [    ] o.a.s.h.l.XMLLoader xsltCacheLifetimeSeconds=60
   [junit4]   2> 1095654 INFO  (qtp28279198-9364) [    ] o.a.s.h.l.XMLLoader xsltCacheLifetimeSeconds=60
   [junit4]   2> 1095655 INFO  (qtp30965955-9367) [    ] o.a.s.h.l.XMLLoader xsltCacheLifetimeSeconds=60
   [junit4]   2> 1095655 INFO  (qtp28279198-9364) [    ] o.a.s.h.l.XMLLoader xsltCacheLifetimeSeconds=60
   [junit4]   2> 1095655 INFO  (qtp30965955-9367) [    ] o.a.s.c.RequestHandlers Registered paths: /admin/mbeans,/update/csv,/sql,/update/json/docs,/admin/luke,/export,/select,/admin/segments,/get,/admin/system,/replication,/admin/properties,/config,/stream,/schema,/admin/plugins,/admin/logging,/update/json,/admin/ping,/admin/threads,/update,/admin/file
   [junit4]   2> 1095655 INFO  (qtp28279198-9364) [    ] o.a.s.c.RequestHandlers Registered paths: /admin/mbeans,/update/csv,/sql,/update/json/docs,/admin/luke,/export,/select,/admin/segments,/get,/admin/system,/replication,/admin/properties,/config,/stream,/schema,/admin/plugins,/admin/logging,/update/json,/admin/ping,/admin/threads,/update,/admin/file
   [junit4]   2> 1095655 INFO  (qtp28279198-9364) [    ] o.a.s.c.SolrCore Using default statsCache cache: org.apache.solr.search.stats.LocalStatsCache
   [junit4]   2> 1095655 INFO  (qtp30965955-9367) [    ] o.a.s.c.SolrCore Using default statsCache cache: org.apache.solr.search.stats.LocalStatsCache
   [junit4]   2> 1095656 INFO  (qtp28279198-9364) [    ] o.a.s.u.UpdateHandler Using UpdateLog implementation: org.apache.solr.update.UpdateLog
   [junit4]   2> 1095656 INFO  (qtp30965955-9367) [    ] o.a.s.u.UpdateHandler Using UpdateLog implementation: org.apache.solr.update.UpdateLog
   [junit4]   2> 1095656 INFO  (qtp28279198-9364) [    ] o.a.s.u.UpdateLog Initializing UpdateLog: dataDir=null defaultSyncLevel=FLUSH numRecordsToKeep=100 maxNumLogsToKeep=10 numVersionBuckets=65536
   [junit4]   2> 1095656 INFO  (qtp30965955-9367) [    ] o.a.s.u.UpdateLog Initializing UpdateLog: dataDir=null defaultSyncLevel=FLUSH numRecordsToKeep=100 maxNumLogsToKeep=10 numVersionBuckets=65536
   [junit4]   2> 1095657 INFO  (qtp28279198-9364) [    ] o.a.s.u.CommitTracker Hard AutoCommit: disabled
   [junit4]   2> 1095657 INFO  (qtp30965955-9367) [    ] o.a.s.u.CommitTracker Hard AutoCommit: disabled
   [junit4]   2> 1095657 INFO  (qtp28279198-9364) [    ] o.a.s.u.CommitTracker Soft AutoCommit: disabled
   [junit4]   2> 1095657 INFO  (qtp30965955-9367) [    ] o.a.s.u.CommitTracker Soft AutoCommit: disabled
   [junit4]   2> 1095657 INFO  (qtp28279198-9364) [    ] o.a.s.c.SolrDeletionPolicy SolrDeletionPolicy.onInit: commits: num=1
   [junit4]   2> 	commit{dir=MockDirectoryWrapper(RAMDirectory@a5e34e lockFactory=org.apache.lucene.store.SingleInstanceLockFactory@10e3a07),segFN=segments_1,generation=1}
   [junit4]   2> 1095657 INFO  (qtp30965955-9367) [    ] o.a.s.c.SolrDeletionPolicy SolrDeletionPolicy.onInit: commits: num=1
   [junit4]   2> 	commit{dir=MockDirectoryWrapper(RAMDirectory@17db4a lockFactory=org.apache.lucene.store.SingleInstanceLockFactory@d51ad0),segFN=segments_1,generation=1}
   [junit4]   2> 1095657 INFO  (qtp30965955-9367) [    ] o.a.s.c.SolrDeletionPolicy newest commit generation = 1
   [junit4]   2> 1095657 INFO  (qtp28279198-9364) [    ] o.a.s.c.SolrDeletionPolicy newest commit generation = 1
   [junit4]   2> 1095657 INFO  (qtp30965955-9367) [    ] o.a.s.s.SolrIndexSearcher Opening [Searcher@5f147b[testschemaapi_shard1_replica1] main]
   [junit4]   2> 1095657 INFO  (qtp28279198-9364) [    ] o.a.s.s.SolrIndexSearcher Opening [Searcher@178df41[testschemaapi_shard1_replica2] main]
   [junit4]   2> 1095657 INFO  (qtp30965955-9367) [    ] o.a.s.c.c.ZkStateReader Load collection config from: [/collections/testschemaapi]
   [junit4]   2> 1095657 INFO  (qtp28279198-9364) [    ] o.a.s.c.c.ZkStateReader Load collection config from: [/collections/testschemaapi]
   [junit4]   2> 1095657 INFO  (qtp30965955-9367) [    ] o.a.s.c.c.ZkStateReader path=[/collections/testschemaapi] [configName]=[conf1] specified config exists in ZooKeeper
   [junit4]   2> 1095657 INFO  (qtp28279198-9364) [    ] o.a.s.c.c.ZkStateReader path=[/collections/testschemaapi] [configName]=[conf1] specified config exists in ZooKeeper
   [junit4]   2> 1095657 INFO  (qtp30965955-9367) [    ] o.a.s.r.ManagedResourceStorage Setting up ZooKeeper-based storage for the RestManager with znodeBase: /configs/conf1
   [junit4]   2> 1095657 INFO  (qtp28279198-9364) [    ] o.a.s.r.ManagedResourceStorage Setting up ZooKeeper-based storage for the RestManager with znodeBase: /configs/conf1
   [junit4]   2> 1095657 INFO  (qtp30965955-9367) [    ] o.a.s.r.ManagedResourceStorage Configured ZooKeeperStorageIO with znodeBase: /configs/conf1
   [junit4]   2> 1095658 INFO  (qtp28279198-9364) [    ] o.a.s.r.ManagedResourceStorage Configured ZooKeeperStorageIO with znodeBase: /configs/conf1
   [junit4]   2> 1095658 INFO  (qtp30965955-9367) [    ] o.a.s.r.RestManager Initializing RestManager with initArgs: {}
   [junit4]   2> 1095658 INFO  (qtp28279198-9364) [    ] o.a.s.r.RestManager Initializing RestManager with initArgs: {}
   [junit4]   2> 1095658 INFO  (qtp30965955-9367) [    ] o.a.s.r.ManagedResourceStorage Reading _rest_managed.json using ZooKeeperStorageIO:path=/configs/conf1
   [junit4]   2> 1095658 INFO  (qtp28279198-9364) [    ] o.a.s.r.ManagedResourceStorage Reading _rest_managed.json using ZooKeeperStorageIO:path=/configs/conf1
   [junit4]   2> 1095658 INFO  (qtp30965955-9367) [    ] o.a.s.r.ManagedResourceStorage No data found for znode /configs/conf1/_rest_managed.json
   [junit4]   2> 1095658 INFO  (qtp28279198-9364) [    ] o.a.s.r.ManagedResourceStorage No data found for znode /configs/conf1/_rest_managed.json
   [junit4]   2> 1095658 INFO  (qtp30965955-9367) [    ] o.a.s.r.ManagedResourceStorage Loaded null at path _rest_managed.json using ZooKeeperStorageIO:path=/configs/conf1
   [junit4]   2> 1095658 INFO  (qtp28279198-9364) [    ] o.a.s.r.ManagedResourceStorage Loaded null at path _rest_managed.json using ZooKeeperStorageIO:path=/configs/conf1
   [junit4]   2> 1095658 INFO  (qtp30965955-9367) [    ] o.a.s.r.RestManager Initializing 0 registered ManagedResources
   [junit4]   2> 1095658 INFO  (qtp28279198-9364) [    ] o.a.s.r.RestManager Initializing 0 registered ManagedResources
   [junit4]   2> 1095658 INFO  (qtp30965955-9367) [    ] o.a.s.s.ZkIndexSchemaReader Creating ZooKeeper watch for the managed schema at /configs/conf1/managed-schema
   [junit4]   2> 1095658 INFO  (qtp28279198-9364) [    ] o.a.s.s.ZkIndexSchemaReader Creating ZooKeeper watch for the managed schema at /configs/conf1/managed-schema
   [junit4]   2> 1095658 INFO  (qtp30965955-9367) [    ] o.a.s.c.ZkController Added new OnReconnect listener ZkIndexSchemaReader: /configs/conf1/managed-schema, uniqueCoreId: testschemaapi_shard1_replica1:1081657994839143
   [junit4]   2> 1095658 INFO  (qtp28279198-9364) [    ] o.a.s.c.ZkController Added new OnReconnect listener ZkIndexSchemaReader: /configs/conf1/managed-schema, uniqueCoreId: testschemaapi_shard1_replica2:1081657994874171
   [junit4]   2> 1095658 INFO  (qtp30965955-9367) [    ] o.a.s.h.ReplicationHandler Commits will be reserved for  10000
   [junit4]   2> 1095658 INFO  (qtp28279198-9364) [    ] o.a.s.h.ReplicationHandler Commits will be reserved for  10000
   [junit4]   2> 1095658 INFO  (searcherExecutor-4333-thread-1) [    ] o.a.s.c.SolrCore [testschemaapi_shard1_replica1] Registered new searcher Searcher@5f147b[testschemaapi_shard1_replica1] main{ExitableDirectoryReader(UninvertingDirectoryReader())}
   [junit4]   2> 1095658 INFO  (searcherExecutor-4334-thread-1) [    ] o.a.s.c.SolrCore [testschemaapi_shard1_replica2] Registered new searcher Searcher@178df41[testschemaapi_shard1_replica2] main{ExitableDirectoryReader(UninvertingDirectoryReader())}
   [junit4]   2> 1095658 INFO  (qtp30965955-9367) [    ] o.a.s.u.UpdateLog Looking up max value of version field to seed version buckets
   [junit4]   2> 1095659 INFO  (qtp28279198-9364) [    ] o.a.s.u.UpdateLog Looking up max value of version field to seed version buckets
   [junit4]   2> 1095659 INFO  (qtp30965955-9367) [    ] o.a.s.u.VersionInfo Refreshing highest value of _version_ for 65536 version buckets from index
   [junit4]   2> 1095659 INFO  (qtp28279198-9364) [    ] o.a.s.u.VersionInfo Refreshing highest value of _version_ for 65536 version buckets from index
   [junit4]   2> 1095659 INFO  (qtp30965955-9367) [    ] o.a.s.u.VersionInfo No terms found for _version_, cannot seed version bucket highest value from index
   [junit4]   2> 1095659 INFO  (qtp28279198-9364) [    ] o.a.s.u.VersionInfo No terms found for _version_, cannot seed version bucket highest value from index
   [junit4]   2> 1095659 INFO  (qtp30965955-9367) [    ] o.a.s.u.UpdateLog Could not find max version in index or recent updates, using new clock 1533387602270355456
   [junit4]   2> 1095659 INFO  (qtp28279198-9364) [    ] o.a.s.u.UpdateLog Could not find max version in index or recent updates, using new clock 1533387602270355456
   [junit4]   2> 1095660 INFO  (qtp30965955-9367) [    ] o.a.s.u.UpdateLog Took 1.0ms to seed version buckets with highest version 1533387602270355456
   [junit4]   2> 1095660 INFO  (qtp28279198-9364) [    ] o.a.s.u.UpdateLog Took 1.0ms to seed version buckets with highest version 1533387602270355456
   [junit4]   2> 1095660 INFO  (qtp30965955-9367) [    ] o.a.s.c.ZkController watch zkdir /configs/conf1
   [junit4]   2> 1095660 INFO  (qtp28279198-9364) [    ] o.a.s.c.ZkController watch zkdir /configs/conf1
   [junit4]   2> 1095661 INFO  (qtp30965955-9367) [    ] o.a.s.c.CoreContainer registering core: testschemaapi_shard1_replica1
   [junit4]   2> 1095661 INFO  (qtp28279198-9364) [    ] o.a.s.c.CoreContainer registering core: testschemaapi_shard1_replica2
   [junit4]   2> 1095661 INFO  (qtp30965955-9367) [    ] o.a.s.c.ZkController Register replica - core:testschemaapi_shard1_replica1 address:http://127.0.0.1:33079/solr collection:testschemaapi shard:shard1
   [junit4]   2> 1095661 INFO  (qtp28279198-9364) [    ] o.a.s.c.ZkController Register replica - core:testschemaapi_shard1_replica2 address:http://127.0.0.1:36177/solr collection:testschemaapi shard:shard1
   [junit4]   2> 1095661 INFO  (qtp30965955-9367) [    ] o.a.s.c.c.SolrZkClient makePath: /collections/testschemaapi/leader_elect/shard1/election
   [junit4]   2> 1095661 INFO  (qtp28279198-9364) [    ] o.a.s.c.c.SolrZkClient makePath: /collections/testschemaapi/leader_elect/shard1/election
   [junit4]   2> 1095663 INFO  (qtp30965955-9367) [    ] o.a.s.c.LeaderElector Joined leadership election with path: /collections/testschemaapi/leader_elect/shard1/election/95836724988870662-core_node1-n_0000000000
   [junit4]   2> 1095663 INFO  (qtp28279198-9364) [    ] o.a.s.c.LeaderElector Joined leadership election with path: /collections/testschemaapi/leader_elect/shard1/election/95836724988870661-core_node2-n_0000000001
   [junit4]   2> 1095663 INFO  (qtp30965955-9367) [    ] o.a.s.c.ShardLeaderElectionContext Running the leader process for shard=shard1 and weAreReplacement=false and leaderVoteWait=10000
   [junit4]   2> 1095663 INFO  (qtp28279198-9364) [    ] o.a.s.c.LeaderElector Watching path /collections/testschemaapi/leader_elect/shard1/election/95836724988870662-core_node1-n_0000000000 to know if I could be the leader
   [junit4]   2> 1095663 INFO  (qtp30965955-9367) [    ] o.a.s.c.ShardLeaderElectionContext Enough replicas found to continue.
   [junit4]   2> 1095663 INFO  (qtp30965955-9367) [    ] o.a.s.c.ShardLeaderElectionContext I may be the new leader - try and sync
   [junit4]   2> 1095663 INFO  (qtp30965955-9367) [    ] o.a.s.c.SyncStrategy Sync replicas to http://127.0.0.1:33079/solr/testschemaapi_shard1_replica1/
   [junit4]   2> 1095663 INFO  (qtp30965955-9367) [    ] o.a.s.u.PeerSync PeerSync: core=testschemaapi_shard1_replica1 url=http://127.0.0.1:33079/solr START replicas=[http://127.0.0.1:36177/solr/testschemaapi_shard1_replica2/] nUpdates=100
   [junit4]   2> 1095663 INFO  (OverseerStateUpdate-95836724988870661-127.0.0.1:36177_solr-n_0000000000) [    ] o.a.s.c.Overseer processMessage: queueSize: 1, message = {
   [junit4]   2>   "operation":"leader",
   [junit4]   2>   "shard":"shard1",
   [junit4]   2>   "collection":"testschemaapi"} current state version: 0
   [junit4]   2> 1095664 INFO  (qtp30965955-9367) [    ] o.a.s.u.PeerSync PeerSync: core=testschemaapi_shard1_replica1 url=http://127.0.0.1:33079/solr DONE.  We have no versions.  sync failed.
   [junit4]   2> 1095664 INFO  (qtp30965955-9367) [    ] o.a.s.c.SyncStrategy Leader's attempt to sync with shard failed, moving to the next candidate
   [junit4]   2> 1095664 INFO  (qtp30965955-9367) [    ] o.a.s.c.ShardLeaderElectionContext We failed sync, but we have no versions - we can't sync in that case - we were active before, so become leader anyway
   [junit4]   2> 1095664 INFO  (qtp30965955-9367) [    ] o.a.s.c.c.SolrZkClient makePath: /collections/testschemaapi/leaders/shard1
   [junit4]   2> 1095665 INFO  (qtp28279198-9368) [    ] o.a.s.c.S.Request [testschemaapi_shard1_replica2]  webapp=/solr path=/get params={distrib=false&qt=/get&fingerprint=false&getVersions=100&wt=javabin&version=2} status=0 QTime=0
   [junit4]   2> 1095665 INFO  (qtp30965955-9367) [    ] o.a.s.c.ShardLeaderElectionContextBase Creating leader registration node /collections/testschemaapi/leaders/shard1/leader after winning as /collections/testschemaapi/leader_elect/shard1/election/95836724988870662-core_node1-n_0000000000
   [junit4]   2> 1095666 INFO  (qtp30965955-9367) [    ] o.a.s.c.ShardLeaderElectionContext I am the new leader: http://127.0.0.1:33079/solr/testschemaapi_shard1_replica1/ shard1
   [junit4]   2> 1095666 INFO  (OverseerStateUpdate-95836724988870661-127.0.0.1:36177_solr-n_0000000000) [    ] o.a.s.c.Overseer processMessage: queueSize: 1, message = {
   [junit4]   2>   "operation":"leader",
   [junit4]   2>   "shard":"shard1",
   [junit4]   2>   "collection":"testschemaapi",
   [junit4]   2>   "base_url":"http://127.0.0.1:33079/solr",
   [junit4]   2>   "core":"testschemaapi_shard1_replica1",
   [junit4]   2>   "state":"active"} current state version: 0
   [junit4]   2> 1095767 INFO  (OverseerStateUpdate-95836724988870661-127.0.0.1:36177_solr-n_0000000000) [    ] o.a.s.c.o.ZkStateWriter going to update_collection /collections/testschemaapi/state.json version: 1
   [junit4]   2> 1095767 INFO  (zkCallback-1230-thread-1) [    ] o.a.s.c.c.ZkStateReader A cluster state change: [WatchedEvent state:SyncConnected type:NodeDataChanged path:/collections/testschemaapi/state.json] for collection [testschemaapi] has occurred - updating... (live nodes size: [2])
   [junit4]   2> 1095767 INFO  (zkCallback-1231-thread-1) [    ] o.a.s.c.c.ZkStateReader A cluster state change: [WatchedEvent state:SyncConnected type:NodeDataChanged path:/collections/testschemaapi/state.json] for collection [testschemaapi] has occurred - updating... (live nodes size: [2])
   [junit4]   2> 1095767 INFO  (zkCallback-1230-thread-1) [    ] o.a.s.c.c.ZkStateReader Updating data for [testschemaapi] from [1] to [2]
   [junit4]   2> 1095768 INFO  (zkCallback-1231-thread-1) [    ] o.a.s.c.c.ZkStateReader Updating data for [testschemaapi] from [1] to [2]
   [junit4]   2> 1095816 INFO  (qtp30965955-9367) [    ] o.a.s.c.ZkController We are http://127.0.0.1:33079/solr/testschemaapi_shard1_replica1/ and leader is http://127.0.0.1:33079/solr/testschemaapi_shard1_replica1/
   [junit4]   2> 1095817 INFO  (qtp30965955-9367) [    ] o.a.s.c.ZkController No LogReplay needed for core=testschemaapi_shard1_replica1 baseURL=http://127.0.0.1:33079/solr
   [junit4]   2> 1095817 INFO  (qtp30965955-9367) [    ] o.a.s.c.ZkController I am the leader, no recovery necessary
   [junit4]   2> 1095817 INFO  (qtp30965955-9367) [    ] o.a.s.c.ZkController publishing state=active
   [junit4]   2> 1095817 INFO  (OverseerStateUpdate-95836724988870661-127.0.0.1:36177_solr-n_0000000000) [    ] o.a.s.c.Overseer processMessage: queueSize: 1, message = {
   [junit4]   2>   "core":"testschemaapi_shard1_replica1",
   [junit4]   2>   "core_node_name":"core_node1",
   [junit4]   2>   "roles":null,
   [junit4]   2>   "base_url":"http://127.0.0.1:33079/solr",
   [junit4]   2>   "node_name":"127.0.0.1:33079_solr",
   [junit4]   2>   "numShards":"1",
   [junit4]   2>   "state":"active",
   [junit4]   2>   "shard":"shard1",
   [junit4]   2>   "collection":"testschemaapi",
   [junit4]   2>   "operation":"state"} current state version: 0
   [junit4]   2> 1095818 INFO  (OverseerStateUpdate-95836724988870661-127.0.0.1:36177_solr-n_0000000000) [    ] o.a.s.c.o.ReplicaMutator Update state numShards=1 message={
   [junit4]   2>   "core":"testschemaapi_shard1_replica1",
   [junit4]   2>   "core_node_name":"core_node1",
   [junit4]   2>   "roles":null,
   [junit4]   2>   "base_url":"http://127.0.0.1:33079/solr",
   [junit4]   2>   "node_name":"127.0.0.1:33079_solr",
   [junit4]   2>   "numShards":"1",
   [junit4]   2>   "state":"active",
   [junit4]   2>   "shard":"shard1",
   [junit4]   2>   "collection":"testschemaapi",
   [junit4]   2>   "operation":"state"}
   [junit4]   2> 1095818 INFO  (qtp30965955-9367) [    ] o.a.s.s.HttpSolrCall [admin] webapp=null path=/admin/cores params={qt=/admin/cores&collection.configName=conf1&name=testschemaapi_shard1_replica1&action=CREATE&numShards=1&collection=testschemaapi&shard=shard1&wt=javabin&version=2} status=0 QTime=1195
   [junit4]   2> 1095919 INFO  (OverseerStateUpdate-95836724988870661-127.0.0.1:36177_solr-n_0000000000) [    ] o.a.s.c.o.ZkStateWriter going to update_collection /collections/testschemaapi/state.json version: 2
   [junit4]   2> 1095919 INFO  (zkCallback-1230-thread-1) [    ] o.a.s.c.c.ZkStateReader A cluster state change: [WatchedEvent state:SyncConnected type:NodeDataChanged path:/collections/testschemaapi/state.json] for collection [testschemaapi] has occurred - updating... (live nodes size: [2])
   [junit4]   2> 1095919 INFO  (zkCallback-1231-thread-1) [    ] o.a.s.c.c.ZkStateReader A cluster state change: [WatchedEvent state:SyncConnected type:NodeDataChanged path:/collections/testschemaapi/state.json] for collection [testschemaapi] has occurred - updating... (live nodes size: [2])
   [junit4]   2> 1095919 INFO  (zkCallback-1230-thread-1) [    ] o.a.s.c.c.ZkStateReader Updating data for [testschemaapi] from [2] to [3]
   [junit4]   2> 1095919 INFO  (zkCallback-1231-thread-1) [    ] o.a.s.c.c.ZkStateReader Updating data for [testschemaapi] from [2] to [3]
   [junit4]   2> 1096663 INFO  (qtp28279198-9364) [    ] o.a.s.c.ZkController We are http://127.0.0.1:36177/solr/testschemaapi_shard1_replica2/ and leader is http://127.0.0.1:33079/solr/testschemaapi_shard1_replica1/
   [junit4]   2> 1096664 INFO  (qtp28279198-9364) [    ] o.a.s.c.ZkController No LogReplay needed for core=testschemaapi_shard1_replica2 baseURL=http://127.0.0.1:36177/solr
   [junit4]   2> 1096664 INFO  (qtp28279198-9364) [    ] o.a.s.c.ZkController Core needs to recover:testschemaapi_shard1_replica2
   [junit4]   2> 1096664 INFO  (updateExecutor-1225-thread-1) [    ] o.a.s.u.DefaultSolrCoreState Running recovery
   [junit4]   2> 1096664 INFO  (recoveryExecutor-1227-thread-1) [    ] o.a.s.c.RecoveryStrategy Starting recovery process. recoveringAfterStartup=true
   [junit4]   2> 1096664 INFO  (recoveryExecutor-1227-thread-1) [    ] o.a.s.c.RecoveryStrategy ###### startupVersions=[[]]
   [junit4]   2> 1096664 INFO  (recoveryExecutor-1227-thread-1) [    ] o.a.s.c.RecoveryStrategy Begin buffering updates. core=[testschemaapi_shard1_replica2]
   [junit4]   2> 1096664 INFO  (recoveryExecutor-1227-thread-1) [    ] o.a.s.u.UpdateLog Starting to buffer updates. FSUpdateLog{state=ACTIVE, tlog=null}
   [junit4]   2> 1096664 INFO  (recoveryExecutor-1227-thread-1) [    ] o.a.s.c.RecoveryStrategy Publishing state of core [testschemaapi_shard1_replica2] as recovering, leader is [http://127.0.0.1:33079/solr/testschemaapi_shard1_replica1/] and I am [http://127.0.0.1:36177/solr/testschemaapi_shard1_replica2/]
   [junit4]   2> 1096664 INFO  (recoveryExecutor-1227-thread-1) [    ] o.a.s.c.ZkController publishing state=recovering
   [junit4]   2> 1096664 INFO  (qtp28279198-9364) [    ] o.a.s.s.HttpSolrCall [admin] webapp=null path=/admin/cores params={qt=/admin/cores&collection.configName=conf1&name=testschemaapi_shard1_replica2&action=CREATE&numShards=1&collection=testschemaapi&shard=shard1&wt=javabin&version=2} status=0 QTime=2041
   [junit4]   2> 1096665 INFO  (OverseerThreadFactory-4328-thread-1) [    ] o.a.s.c.OverseerTaskProcessor Overseer Collection Message Handler: Message id:/overseer/collection-queue-work/qn-0000000000 complete, response:{success={127.0.0.1:33079_solr={responseHeader={status=0,QTime=1195},core=testschemaapi_shard1_replica1},127.0.0.1:36177_solr={responseHeader={status=0,QTime=2041},core=testschemaapi_shard1_replica2}}}
   [junit4]   2> 1096665 INFO  (OverseerStateUpdate-95836724988870661-127.0.0.1:36177_solr-n_0000000000) [    ] o.a.s.c.Overseer processMessage: queueSize: 1, message = {
   [junit4]   2>   "core":"testschemaapi_shard1_replica2",
   [junit4]   2>   "core_node_name":"core_node2",
   [junit4]   2>   "roles":null,
   [junit4]   2>   "base_url":"http://127.0.0.1:36177/solr",
   [junit4]   2>   "node_name":"127.0.0.1:36177_solr",
   [junit4]   2>   "numShards":"1",
   [junit4]   2>   "state":"recovering",
   [junit4]   2>   "shard":"shard1",
   [junit4]   2>   "collection":"testschemaapi",
   [junit4]   2>   "operation":"state"} current state version: 0
   [junit4]   2> 1096666 INFO  (OverseerStateUpdate-95836724988870661-127.0.0.1:36177_solr-n_0000000000) [    ] o.a.s.c.o.ReplicaMutator Update state numShards=1 message={
   [junit4]   2>   "core":"testschemaapi_shard1_replica2",
   [junit4]   2>   "core_node_name":"core_node2",
   [junit4]   2>   "roles":null,
   [junit4]   2>   "base_url":"http://127.0.0.1:36177/solr",
   [junit4]   2>   "node_name":"127.0.0.1:36177_solr",
   [junit4]   2>   "numShards":"1",
   [junit4]   2>   "state":"recovering",
   [junit4]   2>   "shard":"shard1",
   [junit4]   2>   "collection":"testschemaapi",
   [junit4]   2>   "operation":"state"}
   [junit4]   2> 1096666 INFO  (zkCallback-1231-thread-1) [    ] o.a.s.c.OverseerTaskQueue NodeDataChanged fired on path /overseer/collection-queue-work/qnr-0000000000 state SyncConnected latchEventType null
   [junit4]   2> 1096666 INFO  (recoveryExecutor-1227-thread-1) [    ] o.a.s.c.RecoveryStrategy Sending prep recovery command to [http://127.0.0.1:33079/solr]; [WaitForState: action=PREPRECOVERY&core=testschemaapi_shard1_replica1&nodeName=127.0.0.1:36177_solr&coreNodeName=core_node2&state=recovering&checkLive=true&onlyIfLeader=true&onlyIfLeaderActive=true]
   [junit4]   2> 1096667 INFO  (qtp30965955-9363) [    ] o.a.s.h.a.CollectionsHandler Wait for new collection to be active for at most 30 seconds. Check all shard replicas
   [junit4]   2> 1096667 INFO  (qtp30965955-9355) [    ] o.a.s.h.a.CoreAdminOperation Going to wait for coreNodeName: core_node2, state: recovering, checkLive: true, onlyIfLeader: true, onlyIfLeaderActive: true
   [junit4]   2> 1096667 INFO  (qtp30965955-9355) [    ] o.a.s.h.a.CoreAdminOperation Will wait a max of 183 seconds to see testschemaapi_shard1_replica1 (shard1 of testschemaapi) have state: recovering
   [junit4]   2> 1096667 INFO  (qtp30965955-9355) [    ] o.a.s.h.a.CoreAdminOperation In WaitForState(recovering): collection=testschemaapi, shard=shard1, thisCore=testschemaapi_shard1_replica1, leaderDoesNotNeedRecovery=false, isLeader? true, live=true, checkLive=true, currentState=down, localState=active, nodeName=127.0.0.1:36177_solr, coreNodeName=core_node2, onlyIfActiveCheckResult=false, nodeProps: core_node2:{"core":"testschemaapi_shard1_replica2","base_url":"http://127.0.0.1:36177/solr","node_name":"127.0.0.1:36177_solr","state":"down"}
   [junit4]   2> 1096767 INFO  (OverseerStateUpdate-95836724988870661-127.0.0.1:36177_solr-n_0000000000) [    ] o.a.s.c.o.ZkStateWriter going to update_collection /collections/testschemaapi/state.json version: 3
   [junit4]   2> 1096767 INFO  (zkCallback-1231-thread-1) [    ] o.a.s.c.c.ZkStateReader A cluster state change: [WatchedEvent state:SyncConnected type:NodeDataChanged path:/collections/testschemaapi/state.json] for collection [testschemaapi] has occurred - updating... (live nodes size: [2])
   [junit4]   2> 1096767 INFO  (zkCallback-1230-thread-1) [    ] o.a.s.c.c.ZkStateReader A cluster state change: [WatchedEvent state:SyncConnected type:NodeDataChanged path:/collections/testschemaapi/state.json] for collection [testschemaapi] has occurred - updating... (live nodes size: [2])
   [junit4]   2> 1096770 INFO  (zkCallback-1231-thread-1) [    ] o.a.s.c.c.ZkStateReader Updating data for [testschemaapi] from [3] to [4]
   [junit4]   2> 1096771 INFO  (zkCallback-1230-thread-1) [    ] o.a.s.c.c.ZkStateReader Updating data for [testschemaapi] from [3] to [4]
   [junit4]   2> 1097667 INFO  (qtp30965955-9355) [    ] o.a.s.h.a.CoreAdminOperation In WaitForState(recovering): collection=testschemaapi, shard=shard1, thisCore=testschemaapi_shard1_replica1, leaderDoesNotNeedRecovery=false, isLeader? true, live=true, checkLive=true, currentState=recovering, localState=active, nodeName=127.0.0.1:36177_solr, coreNodeName=core_node2, onlyIfActiveCheckResult=false, nodeProps: core_node2:{"core":"testschemaapi_shard1_replica2","base_url":"http://127.0.0.1:36177/solr","node_name":"127.0.0.1:36177_solr","state":"recovering"}
   [junit4]   2> 1097667 INFO  (qtp30965955-9355) [    ] o.a.s.h.a.CoreAdminOperation Waited coreNodeName: core_node2, state: recovering, checkLive: true, onlyIfLeader: true for: 1 seconds.
   [junit4]   2> 1097667 INFO  (qtp30965955-9355) [    ] o.a.s.s.HttpSolrCall [admin] webapp=null path=/admin/cores params={nodeName=127.0.0.1:36177_solr&onlyIfLeaderActive=true&core=testschemaapi_shard1_replica1&coreNodeName=core_node2&action=PREPRECOVERY&checkLive=true&state=recovering&onlyIfLeader=true&wt=javabin&version=2} status=0 QTime=1000
   [junit4]   2> 1104668 INFO  (recoveryExecutor-1227-thread-1) [    ] o.a.s.c.RecoveryStrategy Attempting to PeerSync from [http://127.0.0.1:33079/solr/testschemaapi_shard1_replica1/] - recoveringAfterStartup=[true]
   [junit4]   2> 1104668 INFO  (recoveryExecutor-1227-thread-1) [    ] o.a.s.u.PeerSync PeerSync: core=testschemaapi_shard1_replica2 url=http://127.0.0.1:36177/solr START replicas=[http://127.0.0.1:33079/solr/testschemaapi_shard1_replica1/] nUpdates=100
   [junit4]   2> 1104668 WARN  (recoveryExecutor-1227-thread-1) [    ] o.a.s.u.PeerSync no frame of reference to tell if we've missed updates
   [junit4]   2> 1104668 INFO  (recoveryExecutor-1227-thread-1) [    ] o.a.s.c.RecoveryStrategy PeerSync Recovery was not successful - trying replication.
   [junit4]   2> 1104668 INFO  (recoveryExecutor-1227-thread-1) [    ] o.a.s.c.RecoveryStrategy Starting Replication Recovery.
   [junit4]   2> 1104668 INFO  (recoveryExecutor-1227-thread-1) [    ] o.a.s.c.RecoveryStrategy Attempting to replicate from [http://127.0.0.1:33079/solr/testschemaapi_shard1_replica1/].
   [junit4]   2> 1104669 INFO  (qtp30965955-9367) [    ] o.a.s.u.IndexFingerprint IndexFingerprint millis:0.0 result:{maxVersionSpecified=9223372036854775807, maxVersionEncountered=0, maxInHash=0, versionsHash=0, numVersions=0, numDocs=0, maxDoc=0}
   [junit4]   2> 1104669 INFO  (qtp30965955-9367) [    ] o.a.s.c.S.Request [testschemaapi_shard1_replica1]  webapp=/solr path=/get params={distrib=false&qt=/get&fingerprint=true&getVersions=100&wt=javabin&version=2} status=0 QTime=0
   [junit4]   2> 1104669 INFO  (qtp30965955-9359) [    ] o.a.s.u.DirectUpdateHandler2 start commit{,optimize=false,openSearcher=false,waitSearcher=true,expungeDeletes=false,softCommit=false,prepareCommit=false}
   [junit4]   2> 1104670 INFO  (qtp30965955-9359) [    ] o.a.s.u.DirectUpdateHandler2 No uncommitted changes. Skipping IW.commit.
   [junit4]   2> 1104670 INFO  (qtp30965955-9359) [    ] o.a.s.u.DirectUpdateHandler2 end_commit_flush
   [junit4]   2> 1104670 INFO  (qtp30965955-9359) [    ] o.a.s.u.p.LogUpdateProcessorFactory [testschemaapi_shard1_replica1]  webapp=/solr path=/update params={waitSearcher=true&openSearcher=false&commit=true&softCommit=false&commit_end_point=true&wt=javabin&version=2}{commit=} 0 0
   [junit4]   2> 1104671 INFO  (qtp30965955-9357) [    ] o.a.s.c.S.Request [testschemaapi_shard1_replica1]  webapp=/solr path=/replication params={qt=/replication&wt=javabin&version=2&command=indexversion} status=0 QTime=0
   [junit4]   2> 1104671 INFO  (recoveryExecutor-1227-thread-1) [    ] o.a.s.c.RecoveryStrategy No replay needed.
   [junit4]   2> 1104671 INFO  (recoveryExecutor-1227-thread-1) [    ] o.a.s.c.RecoveryStrategy Replication Recovery was successful.
   [junit4]   2> 1104671 INFO  (recoveryExecutor-1227-thread-1) [    ] o.a.s.c.RecoveryStrategy Registering as Active after recovery.
   [junit4]   2> 1104671 INFO  (recoveryExecutor-1227-thread-1) [    ] o.a.s.c.ZkController publishing state=active
   [junit4]   2> 1104672 INFO  (recoveryExecutor-1227-thread-1) [    ] o.a.s.c.RecoveryStrategy Updating version bucket highest from index after successful recovery.
   [junit4]   2> 1104672 INFO  (recoveryExecutor-1227-thread-1) [    ] o.a.s.u.UpdateLog Looking up max value of version field to seed version buckets
   [junit4]   2> 1104672 INFO  (recoveryExecutor-1227-thread-1) [    ] o.a.s.u.VersionInfo Refreshing highest value of _version_ for 65536 version buckets from index
   [junit4]   2> 1104672 INFO  (recoveryExecutor-1227-thread-1) [    ] o.a.s.u.VersionInfo No terms found for _version_, cannot seed version bucket highest value from index
   [junit4]   2> 1104672 INFO  (recoveryExecutor-1227-thread-1) [    ] o.a.s.u.UpdateLog Could not find max version in index or recent updates, using new clock 1533387611721170944
   [junit4]   2> 1104672 INFO  (OverseerStateUpdate-95836724988870661-127.0.0.1:36177_solr-n_0000000000) [    ] o.a.s.c.Overseer processMessage: queueSize: 1, message = {
   [junit4]   2>   "core":"testschemaapi_shard1_replica2",
   [junit4]   2>   "core_node_name":"core_node2",
   [junit4]   2>   "roles":null,
   [junit4]   2>   "base_url":"http://127.0.0.1:36177/solr",
   [junit4]   2>   "node_name":"127.0.0.1:36177_solr",
   [junit4]   2>   "numShards":"1",
   [junit4]   2>   "state":"active",
   [junit4]   2>   "shard":"shard1",
   [junit4]   2>   "collection":"testschemaapi",
   [junit4]   2>   "operation":"state"} current state version: 0
   [junit4]   2> 1104672 INFO  (OverseerStateUpdate-95836724988870661-127.0.0.1:36177_solr-n_0000000000) [    ] o.a.s.c.o.ReplicaMutator Update state numShards=1 message={
   [junit4]   2>   "core":"testschemaapi_shard1_replica2",
   [junit4]   2>   "core_node_name":"core_node2",
   [junit4]   2>   "roles":null,
   [junit4]   2>   "base_url":"http://127.0.0.1:36177/solr",
   [junit4]   2>   "node_name":"127.0.0.1:36177_solr",
   [junit4]   2>   "numShards":"1",
   [junit4]   2>   "state":"active",
   [junit4]   2>   "shard":"shard1",
   [junit4]   2>   "collection":"testschemaapi",
   [junit4]   2>   "operation":"state"}
   [junit4]   2> 1104673 INFO  (OverseerStateUpdate-95836724988870661-127.0.0.1:36177_solr-n_0000000000) [    ] o.a.s.c.o.ZkStateWriter going to update_collection /collections/testschemaapi/state.json version: 4
   [junit4]   2> 1104673 INFO  (zkCallback-1230-thread-1) [    ] 

[...truncated too long message...]

[    ] o.e.j.s.h.ContextHandler Stopped o.e.j.s.ServletContextHandler@d96cf1{/solr,null,UNAVAILABLE}
   [junit4]   2> 1155148 INFO  (TEST-TestReplicationHandler.doTestStressReplication-seed#[7E459AB348B88AB6]) [    ] o.e.j.s.ServerConnector Stopped ServerConnector@60b418{HTTP/1.1,[http/1.1]}{127.0.0.1:0}
   [junit4]   2> 1155148 INFO  (TEST-TestReplicationHandler.doTestStressReplication-seed#[7E459AB348B88AB6]) [    ] o.a.s.c.CoreContainer Shutting down CoreContainer instance=14423313
   [junit4]   2> 1155149 INFO  (coreCloseExecutor-3703-thread-1) [    ] o.a.s.c.SolrCore [collection1]  CLOSING SolrCore org.apache.solr.core.SolrCore@61033e
   [junit4]   2> 1155149 INFO  (coreCloseExecutor-3703-thread-1) [    ] o.a.s.u.DirectUpdateHandler2 closing DirectUpdateHandler2{commits=2,autocommits=0,soft autocommits=0,optimizes=0,rollbacks=0,expungeDeletes=0,docsPending=0,adds=0,deletesById=0,deletesByQuery=0,errors=0,cumulative_adds=6,cumulative_deletesById=0,cumulative_deletesByQuery=0,cumulative_errors=0}
   [junit4]   2> 1155149 INFO  (coreCloseExecutor-3703-thread-1) [    ] o.a.s.u.SolrCoreState Closing SolrCoreState
   [junit4]   2> 1155149 INFO  (coreCloseExecutor-3703-thread-1) [    ] o.a.s.u.DefaultSolrCoreState SolrCoreState ref count has reached 0 - closing IndexWriter
   [junit4]   2> 1155149 INFO  (coreCloseExecutor-3703-thread-1) [    ] o.a.s.u.DefaultSolrCoreState closing IndexWriter with IndexWriterCloser
   [junit4]   2> 1155150 INFO  (coreCloseExecutor-3703-thread-1) [    ] o.a.s.c.SolrCore [collection1] Closing main searcher on request.
   [junit4]   2> 1155151 INFO  (coreCloseExecutor-3703-thread-1) [    ] o.a.s.c.CachingDirectoryFactory Closing NRTCachingDirectoryFactory - 2 directories currently being tracked
   [junit4]   2> 1155151 INFO  (coreCloseExecutor-3703-thread-1) [    ] o.a.s.c.CachingDirectoryFactory looking to close /home/jenkins/workspace/Lucene-Solr-master-Linux/solr/build/solr-core/test/J1/temp/solr.handler.TestReplicationHandler_7E459AB348B88AB6-001/solr-instance-030/collection1/data [CachedDir<<refCount=0;path=/home/jenkins/workspace/Lucene-Solr-master-Linux/solr/build/solr-core/test/J1/temp/solr.handler.TestReplicationHandler_7E459AB348B88AB6-001/solr-instance-030/collection1/data;done=false>>]
   [junit4]   2> 1155151 INFO  (coreCloseExecutor-3703-thread-1) [    ] o.a.s.c.CachingDirectoryFactory Closing directory, CoreContainer#isShutdown=true
   [junit4]   2> 1155151 INFO  (coreCloseExecutor-3703-thread-1) [    ] o.a.s.c.CachingDirectoryFactory Closing directory: /home/jenkins/workspace/Lucene-Solr-master-Linux/solr/build/solr-core/test/J1/temp/solr.handler.TestReplicationHandler_7E459AB348B88AB6-001/solr-instance-030/collection1/data
   [junit4]   2> 1155151 INFO  (coreCloseExecutor-3703-thread-1) [    ] o.a.s.c.CachingDirectoryFactory looking to close /home/jenkins/workspace/Lucene-Solr-master-Linux/solr/build/solr-core/test/J1/temp/solr.handler.TestReplicationHandler_7E459AB348B88AB6-001/solr-instance-030/collection1/data/index.20160504040019640 [CachedDir<<refCount=0;path=/home/jenkins/workspace/Lucene-Solr-master-Linux/solr/build/solr-core/test/J1/temp/solr.handler.TestReplicationHandler_7E459AB348B88AB6-001/solr-instance-030/collection1/data/index.20160504040019640;done=false>>]
   [junit4]   2> 1155151 INFO  (coreCloseExecutor-3703-thread-1) [    ] o.a.s.c.CachingDirectoryFactory Closing directory, CoreContainer#isShutdown=true
   [junit4]   2> 1155151 INFO  (coreCloseExecutor-3703-thread-1) [    ] o.a.s.c.CachingDirectoryFactory Closing directory: /home/jenkins/workspace/Lucene-Solr-master-Linux/solr/build/solr-core/test/J1/temp/solr.handler.TestReplicationHandler_7E459AB348B88AB6-001/solr-instance-030/collection1/data/index.20160504040019640
   [junit4]   2> 1155151 INFO  (TEST-TestReplicationHandler.doTestStressReplication-seed#[7E459AB348B88AB6]) [    ] o.e.j.s.h.ContextHandler Stopped o.e.j.s.ServletContextHandler@f6c2d1{/solr,null,UNAVAILABLE}
   [junit4]   2> 1155152 INFO  (SUITE-TestReplicationHandler-seed#[7E459AB348B88AB6]-worker) [    ] o.a.s.SolrTestCaseJ4 ###deleteCore
   [junit4]   2> ObjectTracker found 1 object(s) that were not released!!! [NRTCachingDirectory]
   [junit4]   2> org.apache.solr.common.util.ObjectReleaseTracker$ObjectTrackerException
   [junit4]   2> 	at org.apache.solr.common.util.ObjectReleaseTracker.track(ObjectReleaseTracker.java:42)
   [junit4]   2> 	at org.apache.solr.core.CachingDirectoryFactory.get(CachingDirectoryFactory.java:347)
   [junit4]   2> 	at org.apache.solr.handler.IndexFetcher.fetchLatestIndex(IndexFetcher.java:381)
   [junit4]   2> 	at org.apache.solr.handler.IndexFetcher.fetchLatestIndex(IndexFetcher.java:265)
   [junit4]   2> 	at org.apache.solr.handler.ReplicationHandler.doFetch(ReplicationHandler.java:388)
   [junit4]   2> 	at org.apache.solr.handler.ReplicationHandler$1.run(ReplicationHandler.java:276)
   [junit4]   2> 
   [junit4]   2> NOTE: test params are: codec=Asserting(Lucene60), sim=ClassicSimilarity, locale=af, timezone=Etc/GMT+5
   [junit4]   2> NOTE: Linux 4.2.0-35-generic i386/Oracle Corporation 9-ea (32-bit)/cpus=12,threads=1,free=157712120,total=309714944
   [junit4]   2> NOTE: All tests run in this JVM: [OutOfBoxZkACLAndCredentialsProvidersTest, TestNonDefinedSimilarityFactory, ConfigSetsAPITest, SolrXmlInZkTest, TestFileDictionaryLookup, TestSystemIdResolver, QueryResultKeyTest, TestLFUCache, SolrIndexConfigTest, TestRawTransformer, OverseerRolesTest, DocValuesTest, SpatialFilterTest, TestFieldCollectionResource, TestTrieFacet, WordBreakSolrSpellCheckerTest, LeaderInitiatedRecoveryOnShardRestartTest, ClassificationUpdateProcessorFactoryTest, TestExpandComponent, DistribCursorPagingTest, HttpPartitionTest, SharedFSAutoReplicaFailoverUtilsTest, TestScoreJoinQPScore, TestRandomCollapseQParserPlugin, SolrIndexSplitterTest, MergeStrategyTest, TestNoOpRegenerator, DistributedFacetPivotLongTailTest, TestSchemaManager, IndexBasedSpellCheckerTest, ClusterStateUpdateTest, SoftAutoCommitTest, TestBulkSchemaAPI, TestClusterStateMutator, ChaosMonkeyNothingIsSafeTest, NotRequiredUniqueKeyTest, TestLMJelinekMercerSimilarityFactory, TestExactStatsCache, VersionInfoTest, DistributedQueueTest, ZkCLITest, DistributedFacetPivotWhiteBoxTest, TestSolrFieldCacheMBean, MBeansHandlerTest, TestDownShardTolerantSearch, AsyncMigrateRouteKeyTest, TestNRTOpen, TestMinMaxOnMultiValuedField, DistanceUnitsTest, CoreAdminCreateDiscoverTest, ShardRoutingCustomTest, TestDefaultStatsCache, HdfsRecoverLeaseTest, TestReplicationHandlerBackup, SimpleMLTQParserTest, TestFiltering, FastVectorHighlighterTest, TestPartialUpdateDeduplication, EnumFieldTest, ConjunctionSolrSpellCheckerTest, TimeZoneUtilsTest, CdcrReplicationHandlerTest, ChangedSchemaMergeTest, TestConfigSetProperties, SaslZkACLProviderTest, TestRuleBasedAuthorizationPlugin, TestBinaryResponseWriter, TestDocBasedVersionConstraints, MinimalSchemaTest, TestQueryUtils, TestFilteredDocIdSet, TestCloudDeleteByQuery, TestImplicitCoreProperties, TestNamedUpdateProcessors, IgnoreCommitOptimizeUpdateProcessorFactoryTest, TestFieldTypeResource, BlobRepositoryCloudTest, TestUpdate, TestQuerySenderListener, TestDFRSimilarityFactory, ConvertedLegacyTest, HdfsSyncSliceTest, TestDefaultSearchFieldResource, DirectSolrSpellCheckerTest, OpenExchangeRatesOrgProviderTest, BlockJoinFacetSimpleTest, NumericFieldsTest, TestWordDelimiterFilterFactory, TestQuerySenderNoQuery, TestTrie, DistributedTermsComponentTest, CSVRequestHandlerTest, ChaosMonkeySafeLeaderTest, TestComplexPhraseQParserPlugin, TestFastLRUCache, BlockCacheTest, CollectionsAPIDistributedZkTest, OpenCloseCoreStressTest, OverseerTest, ShardRoutingTest, RecoveryZkTest, TestReplicationHandler]
   [junit4]   2> NOTE: reproduce with: ant test  -Dtestcase=TestReplicationHandler -Dtests.seed=7E459AB348B88AB6 -Dtests.multiplier=3 -Dtests.slow=true -Dtests.locale=af -Dtests.timezone=Etc/GMT+5 -Dtests.asserts=true -Dtests.file.encoding=ISO-8859-1
   [junit4] ERROR   0.00s J1 | TestReplicationHandler (suite) <<<
   [junit4]    > Throwable #1: java.lang.AssertionError: ObjectTracker found 1 object(s) that were not released!!! [NRTCachingDirectory]
   [junit4]    > 	at __randomizedtesting.SeedInfo.seed([7E459AB348B88AB6]:0)
   [junit4]    > 	at org.apache.solr.SolrTestCaseJ4.afterClass(SolrTestCaseJ4.java:255)
   [junit4]    > 	at jdk.internal.reflect.GeneratedMethodAccessor15.invoke(Unknown Source)
   [junit4]    > 	at jdk.internal.reflect.DelegatingMethodAccessorImpl.invoke(java.base@9-ea/DelegatingMethodAccessorImpl.java:43)
   [junit4]    > 	at java.lang.Thread.run(java.base@9-ea/Thread.java:804)
   [junit4] Completed [284/593 (2!)] on J1 in 78.73s, 14 tests, 1 failure <<< FAILURES!

[...truncated 1028 lines...]
BUILD FAILED
/home/jenkins/workspace/Lucene-Solr-master-Linux/build.xml:740: The following error occurred while executing this line:
/home/jenkins/workspace/Lucene-Solr-master-Linux/build.xml:684: The following error occurred while executing this line:
/home/jenkins/workspace/Lucene-Solr-master-Linux/build.xml:59: The following error occurred while executing this line:
/home/jenkins/workspace/Lucene-Solr-master-Linux/solr/build.xml:233: The following error occurred while executing this line:
/home/jenkins/workspace/Lucene-Solr-master-Linux/solr/common-build.xml:529: The following error occurred while executing this line:
/home/jenkins/workspace/Lucene-Solr-master-Linux/lucene/common-build.xml:1457: The following error occurred while executing this line:
/home/jenkins/workspace/Lucene-Solr-master-Linux/lucene/common-build.xml:1014: There were test failures: 593 suites (10 ignored), 2395 tests, 1 suite-level error, 1 error, 116 ignored (70 assumptions) [seed: 7E459AB348B88AB6]

Total time: 54 minutes 10 seconds
Build step 'Invoke Ant' marked build as failure
Archiving artifacts
[WARNINGS] Skipping publisher since build result is FAILURE
Recording test results
Email was triggered for: Failure - Any
Sending email for trigger: Failure - Any



[JENKINS-EA] Lucene-Solr-master-Linux (32bit/jdk-9-ea+116) - Build # 16654 - Still Failing!

Posted by Policeman Jenkins Server <je...@thetaphi.de>.
Build: http://jenkins.thetaphi.de/job/Lucene-Solr-master-Linux/16654/
Java: 32bit/jdk-9-ea+116 -client -XX:+UseG1GC

2 tests failed.
FAILED:  org.apache.solr.cloud.OverseerTest.testExternalClusterStateChangeBehavior

Error Message:
Illegal state, was: down expected:active clusterState:live nodes:[]collections:{c1=DocCollection(c1)={   "shards":{"shard1":{       "parent":null,       "range":null,       "state":"active",       "replicas":{"core_node1":{           "base_url":"http://127.0.0.1/solr",           "node_name":"node1",           "core":"core1",           "roles":"",           "state":"down"}}}},   "router":{"name":"implicit"}}, test=LazyCollectionRef(test)}

Stack Trace:
java.lang.AssertionError: Illegal state, was: down expected:active clusterState:live nodes:[]collections:{c1=DocCollection(c1)={
  "shards":{"shard1":{
      "parent":null,
      "range":null,
      "state":"active",
      "replicas":{"core_node1":{
          "base_url":"http://127.0.0.1/solr",
          "node_name":"node1",
          "core":"core1",
          "roles":"",
          "state":"down"}}}},
  "router":{"name":"implicit"}}, test=LazyCollectionRef(test)}
	at __randomizedtesting.SeedInfo.seed([6052F78A6263A4C7:84CF46680F3FE89]:0)
	at org.junit.Assert.fail(Assert.java:93)
	at org.apache.solr.cloud.AbstractDistribZkTestBase.verifyReplicaStatus(AbstractDistribZkTestBase.java:239)
	at org.apache.solr.cloud.OverseerTest.testExternalClusterStateChangeBehavior(OverseerTest.java:1272)
	at jdk.internal.reflect.NativeMethodAccessorImpl.invoke0(java.base@9-ea/Native Method)
	at jdk.internal.reflect.NativeMethodAccessorImpl.invoke(java.base@9-ea/NativeMethodAccessorImpl.java:62)
	at jdk.internal.reflect.DelegatingMethodAccessorImpl.invoke(java.base@9-ea/DelegatingMethodAccessorImpl.java:43)
	at java.lang.reflect.Method.invoke(java.base@9-ea/Method.java:531)
	at com.carrotsearch.randomizedtesting.RandomizedRunner.invoke(RandomizedRunner.java:1764)
	at com.carrotsearch.randomizedtesting.RandomizedRunner$8.evaluate(RandomizedRunner.java:871)
	at com.carrotsearch.randomizedtesting.RandomizedRunner$9.evaluate(RandomizedRunner.java:907)
	at com.carrotsearch.randomizedtesting.RandomizedRunner$10.evaluate(RandomizedRunner.java:921)
	at com.carrotsearch.randomizedtesting.rules.SystemPropertiesRestoreRule$1.evaluate(SystemPropertiesRestoreRule.java:57)
	at org.apache.lucene.util.TestRuleSetupTeardownChained$1.evaluate(TestRuleSetupTeardownChained.java:49)
	at org.apache.lucene.util.AbstractBeforeAfterRule$1.evaluate(AbstractBeforeAfterRule.java:45)
	at org.apache.lucene.util.TestRuleThreadAndTestName$1.evaluate(TestRuleThreadAndTestName.java:48)
	at org.apache.lucene.util.TestRuleIgnoreAfterMaxFailures$1.evaluate(TestRuleIgnoreAfterMaxFailures.java:64)
	at org.apache.lucene.util.TestRuleMarkFailure$1.evaluate(TestRuleMarkFailure.java:47)
	at com.carrotsearch.randomizedtesting.rules.StatementAdapter.evaluate(StatementAdapter.java:36)
	at com.carrotsearch.randomizedtesting.ThreadLeakControl$StatementRunner.run(ThreadLeakControl.java:367)
	at com.carrotsearch.randomizedtesting.ThreadLeakControl.forkTimeoutingTask(ThreadLeakControl.java:809)
	at com.carrotsearch.randomizedtesting.ThreadLeakControl$3.evaluate(ThreadLeakControl.java:460)
	at com.carrotsearch.randomizedtesting.RandomizedRunner.runSingleTest(RandomizedRunner.java:880)
	at com.carrotsearch.randomizedtesting.RandomizedRunner$5.evaluate(RandomizedRunner.java:781)
	at com.carrotsearch.randomizedtesting.RandomizedRunner$6.evaluate(RandomizedRunner.java:816)
	at com.carrotsearch.randomizedtesting.RandomizedRunner$7.evaluate(RandomizedRunner.java:827)
	at com.carrotsearch.randomizedtesting.rules.StatementAdapter.evaluate(StatementAdapter.java:36)
	at com.carrotsearch.randomizedtesting.rules.SystemPropertiesRestoreRule$1.evaluate(SystemPropertiesRestoreRule.java:57)
	at org.apache.lucene.util.AbstractBeforeAfterRule$1.evaluate(AbstractBeforeAfterRule.java:45)
	at com.carrotsearch.randomizedtesting.rules.StatementAdapter.evaluate(StatementAdapter.java:36)
	at org.apache.lucene.util.TestRuleStoreClassName$1.evaluate(TestRuleStoreClassName.java:41)
	at com.carrotsearch.randomizedtesting.rules.NoShadowingOrOverridesOnMethodsRule$1.evaluate(NoShadowingOrOverridesOnMethodsRule.java:40)
	at com.carrotsearch.randomizedtesting.rules.NoShadowingOrOverridesOnMethodsRule$1.evaluate(NoShadowingOrOverridesOnMethodsRule.java:40)
	at com.carrotsearch.randomizedtesting.rules.StatementAdapter.evaluate(StatementAdapter.java:36)
	at com.carrotsearch.randomizedtesting.rules.StatementAdapter.evaluate(StatementAdapter.java:36)
	at com.carrotsearch.randomizedtesting.rules.StatementAdapter.evaluate(StatementAdapter.java:36)
	at org.apache.lucene.util.TestRuleAssertionsRequired$1.evaluate(TestRuleAssertionsRequired.java:53)
	at org.apache.lucene.util.TestRuleMarkFailure$1.evaluate(TestRuleMarkFailure.java:47)
	at org.apache.lucene.util.TestRuleIgnoreAfterMaxFailures$1.evaluate(TestRuleIgnoreAfterMaxFailures.java:64)
	at org.apache.lucene.util.TestRuleIgnoreTestSuites$1.evaluate(TestRuleIgnoreTestSuites.java:54)
	at com.carrotsearch.randomizedtesting.rules.StatementAdapter.evaluate(StatementAdapter.java:36)
	at com.carrotsearch.randomizedtesting.ThreadLeakControl$StatementRunner.run(ThreadLeakControl.java:367)
	at java.lang.Thread.run(java.base@9-ea/Thread.java:804)


FAILED:  org.apache.solr.cloud.overseer.ZkStateReaderTest.testStateFormatUpdateWithTimeDelay

Error Message:
Could not find collection : c1

Stack Trace:
org.apache.solr.common.SolrException: Could not find collection : c1
	at __randomizedtesting.SeedInfo.seed([6052F78A6263A4C7:1FCC400F0B01894D]:0)
	at org.apache.solr.common.cloud.ClusterState.getCollection(ClusterState.java:192)
	at org.apache.solr.cloud.overseer.ZkStateReaderTest.testStateFormatUpdate(ZkStateReaderTest.java:128)
	at org.apache.solr.cloud.overseer.ZkStateReaderTest.testStateFormatUpdateWithTimeDelay(ZkStateReaderTest.java:51)
	at jdk.internal.reflect.NativeMethodAccessorImpl.invoke0(java.base@9-ea/Native Method)
	at jdk.internal.reflect.NativeMethodAccessorImpl.invoke(java.base@9-ea/NativeMethodAccessorImpl.java:62)
	at jdk.internal.reflect.DelegatingMethodAccessorImpl.invoke(java.base@9-ea/DelegatingMethodAccessorImpl.java:43)
	at java.lang.reflect.Method.invoke(java.base@9-ea/Method.java:531)
	at com.carrotsearch.randomizedtesting.RandomizedRunner.invoke(RandomizedRunner.java:1764)
	at com.carrotsearch.randomizedtesting.RandomizedRunner$8.evaluate(RandomizedRunner.java:871)
	at com.carrotsearch.randomizedtesting.RandomizedRunner$9.evaluate(RandomizedRunner.java:907)
	at com.carrotsearch.randomizedtesting.RandomizedRunner$10.evaluate(RandomizedRunner.java:921)
	at com.carrotsearch.randomizedtesting.rules.SystemPropertiesRestoreRule$1.evaluate(SystemPropertiesRestoreRule.java:57)
	at org.apache.lucene.util.TestRuleSetupTeardownChained$1.evaluate(TestRuleSetupTeardownChained.java:49)
	at org.apache.lucene.util.AbstractBeforeAfterRule$1.evaluate(AbstractBeforeAfterRule.java:45)
	at org.apache.lucene.util.TestRuleThreadAndTestName$1.evaluate(TestRuleThreadAndTestName.java:48)
	at org.apache.lucene.util.TestRuleIgnoreAfterMaxFailures$1.evaluate(TestRuleIgnoreAfterMaxFailures.java:64)
	at org.apache.lucene.util.TestRuleMarkFailure$1.evaluate(TestRuleMarkFailure.java:47)
	at com.carrotsearch.randomizedtesting.rules.StatementAdapter.evaluate(StatementAdapter.java:36)
	at com.carrotsearch.randomizedtesting.ThreadLeakControl$StatementRunner.run(ThreadLeakControl.java:367)
	at com.carrotsearch.randomizedtesting.ThreadLeakControl.forkTimeoutingTask(ThreadLeakControl.java:809)
	at com.carrotsearch.randomizedtesting.ThreadLeakControl$3.evaluate(ThreadLeakControl.java:460)
	at com.carrotsearch.randomizedtesting.RandomizedRunner.runSingleTest(RandomizedRunner.java:880)
	at com.carrotsearch.randomizedtesting.RandomizedRunner$5.evaluate(RandomizedRunner.java:781)
	at com.carrotsearch.randomizedtesting.RandomizedRunner$6.evaluate(RandomizedRunner.java:816)
	at com.carrotsearch.randomizedtesting.RandomizedRunner$7.evaluate(RandomizedRunner.java:827)
	at com.carrotsearch.randomizedtesting.rules.StatementAdapter.evaluate(StatementAdapter.java:36)
	at com.carrotsearch.randomizedtesting.rules.SystemPropertiesRestoreRule$1.evaluate(SystemPropertiesRestoreRule.java:57)
	at org.apache.lucene.util.AbstractBeforeAfterRule$1.evaluate(AbstractBeforeAfterRule.java:45)
	at com.carrotsearch.randomizedtesting.rules.StatementAdapter.evaluate(StatementAdapter.java:36)
	at org.apache.lucene.util.TestRuleStoreClassName$1.evaluate(TestRuleStoreClassName.java:41)
	at com.carrotsearch.randomizedtesting.rules.NoShadowingOrOverridesOnMethodsRule$1.evaluate(NoShadowingOrOverridesOnMethodsRule.java:40)
	at com.carrotsearch.randomizedtesting.rules.NoShadowingOrOverridesOnMethodsRule$1.evaluate(NoShadowingOrOverridesOnMethodsRule.java:40)
	at com.carrotsearch.randomizedtesting.rules.StatementAdapter.evaluate(StatementAdapter.java:36)
	at com.carrotsearch.randomizedtesting.rules.StatementAdapter.evaluate(StatementAdapter.java:36)
	at com.carrotsearch.randomizedtesting.rules.StatementAdapter.evaluate(StatementAdapter.java:36)
	at org.apache.lucene.util.TestRuleAssertionsRequired$1.evaluate(TestRuleAssertionsRequired.java:53)
	at org.apache.lucene.util.TestRuleMarkFailure$1.evaluate(TestRuleMarkFailure.java:47)
	at org.apache.lucene.util.TestRuleIgnoreAfterMaxFailures$1.evaluate(TestRuleIgnoreAfterMaxFailures.java:64)
	at org.apache.lucene.util.TestRuleIgnoreTestSuites$1.evaluate(TestRuleIgnoreTestSuites.java:54)
	at com.carrotsearch.randomizedtesting.rules.StatementAdapter.evaluate(StatementAdapter.java:36)
	at com.carrotsearch.randomizedtesting.ThreadLeakControl$StatementRunner.run(ThreadLeakControl.java:367)
	at java.lang.Thread.run(java.base@9-ea/Thread.java:804)




Build Log:
[...truncated 11476 lines...]
   [junit4] Suite: org.apache.solr.cloud.overseer.ZkStateReaderTest
   [junit4]   2> Creating dataDir: /home/jenkins/workspace/Lucene-Solr-master-Linux/solr/build/solr-core/test/J2/temp/solr.cloud.overseer.ZkStateReaderTest_6052F78A6263A4C7-001/init-core-data-001
   [junit4]   2> 1098208 INFO  (SUITE-ZkStateReaderTest-seed#[6052F78A6263A4C7]-worker) [    ] o.a.s.SolrTestCaseJ4 Randomized ssl (false) and clientAuth (false)
   [junit4]   2> 1098210 INFO  (TEST-ZkStateReaderTest.testExternalCollectionWatchedNotWatched-seed#[6052F78A6263A4C7]) [    ] o.a.s.SolrTestCaseJ4 ###Starting testExternalCollectionWatchedNotWatched
   [junit4]   2> 1098210 INFO  (TEST-ZkStateReaderTest.testExternalCollectionWatchedNotWatched-seed#[6052F78A6263A4C7]) [    ] o.a.s.c.ZkTestServer STARTING ZK TEST SERVER
   [junit4]   2> 1098210 INFO  (Thread-2293) [    ] o.a.s.c.ZkTestServer client port:0.0.0.0/0.0.0.0:0
   [junit4]   2> 1098210 INFO  (Thread-2293) [    ] o.a.s.c.ZkTestServer Starting server
   [junit4]   2> 1098310 INFO  (TEST-ZkStateReaderTest.testExternalCollectionWatchedNotWatched-seed#[6052F78A6263A4C7]) [    ] o.a.s.c.ZkTestServer start zk server on port:40065
   [junit4]   2> 1098311 INFO  (TEST-ZkStateReaderTest.testExternalCollectionWatchedNotWatched-seed#[6052F78A6263A4C7]) [    ] o.a.s.c.c.SolrZkClient Using default ZkCredentialsProvider
   [junit4]   2> 1098311 INFO  (TEST-ZkStateReaderTest.testExternalCollectionWatchedNotWatched-seed#[6052F78A6263A4C7]) [    ] o.a.s.c.c.ConnectionManager Waiting for client to connect to ZooKeeper
   [junit4]   2> 1098314 INFO  (zkCallback-1074-thread-1) [    ] o.a.s.c.c.ConnectionManager Watcher org.apache.solr.common.cloud.ConnectionManager@15c339e name:ZooKeeperConnection Watcher:127.0.0.1:40065 got event WatchedEvent state:SyncConnected type:None path:null path:null type:None
   [junit4]   2> 1098314 INFO  (TEST-ZkStateReaderTest.testExternalCollectionWatchedNotWatched-seed#[6052F78A6263A4C7]) [    ] o.a.s.c.c.ConnectionManager Client is connected to ZooKeeper
   [junit4]   2> 1098314 INFO  (TEST-ZkStateReaderTest.testExternalCollectionWatchedNotWatched-seed#[6052F78A6263A4C7]) [    ] o.a.s.c.c.SolrZkClient Using default ZkACLProvider
   [junit4]   2> 1098315 INFO  (TEST-ZkStateReaderTest.testExternalCollectionWatchedNotWatched-seed#[6052F78A6263A4C7]) [    ] o.a.s.c.c.SolrZkClient Using default ZkCredentialsProvider
   [junit4]   2> 1098315 INFO  (TEST-ZkStateReaderTest.testExternalCollectionWatchedNotWatched-seed#[6052F78A6263A4C7]) [    ] o.a.s.c.c.ConnectionManager Waiting for client to connect to ZooKeeper
   [junit4]   2> 1098316 INFO  (zkCallback-1075-thread-1) [    ] o.a.s.c.c.ConnectionManager Watcher org.apache.solr.common.cloud.ConnectionManager@1c6cfa0 name:ZooKeeperConnection Watcher:127.0.0.1:40065 got event WatchedEvent state:SyncConnected type:None path:null path:null type:None
   [junit4]   2> 1098316 INFO  (TEST-ZkStateReaderTest.testExternalCollectionWatchedNotWatched-seed#[6052F78A6263A4C7]) [    ] o.a.s.c.c.ConnectionManager Client is connected to ZooKeeper
   [junit4]   2> 1098316 INFO  (TEST-ZkStateReaderTest.testExternalCollectionWatchedNotWatched-seed#[6052F78A6263A4C7]) [    ] o.a.s.c.c.SolrZkClient Using default ZkACLProvider
   [junit4]   2> 1098317 INFO  (TEST-ZkStateReaderTest.testExternalCollectionWatchedNotWatched-seed#[6052F78A6263A4C7]) [    ] o.a.s.c.c.SolrZkClient makePath: /solr
   [junit4]   2> 1098321 INFO  (TEST-ZkStateReaderTest.testExternalCollectionWatchedNotWatched-seed#[6052F78A6263A4C7]) [    ] o.a.s.c.c.SolrZkClient Using default ZkCredentialsProvider
   [junit4]   2> 1098321 INFO  (TEST-ZkStateReaderTest.testExternalCollectionWatchedNotWatched-seed#[6052F78A6263A4C7]) [    ] o.a.s.c.c.ConnectionManager Waiting for client to connect to ZooKeeper
   [junit4]   2> 1098322 INFO  (zkCallback-1076-thread-1) [    ] o.a.s.c.c.ConnectionManager Watcher org.apache.solr.common.cloud.ConnectionManager@1bf619f name:ZooKeeperConnection Watcher:127.0.0.1:40065/solr got event WatchedEvent state:SyncConnected type:None path:null path:null type:None
   [junit4]   2> 1098322 INFO  (TEST-ZkStateReaderTest.testExternalCollectionWatchedNotWatched-seed#[6052F78A6263A4C7]) [    ] o.a.s.c.c.ConnectionManager Client is connected to ZooKeeper
   [junit4]   2> 1098322 INFO  (TEST-ZkStateReaderTest.testExternalCollectionWatchedNotWatched-seed#[6052F78A6263A4C7]) [    ] o.a.s.c.c.SolrZkClient Using default ZkACLProvider
   [junit4]   2> 1098322 INFO  (TEST-ZkStateReaderTest.testExternalCollectionWatchedNotWatched-seed#[6052F78A6263A4C7]) [    ] o.a.s.c.c.SolrZkClient makePath: /live_nodes
   [junit4]   2> 1098323 INFO  (TEST-ZkStateReaderTest.testExternalCollectionWatchedNotWatched-seed#[6052F78A6263A4C7]) [    ] o.a.s.c.c.SolrZkClient makePath: /collections
   [junit4]   2> 1098324 INFO  (TEST-ZkStateReaderTest.testExternalCollectionWatchedNotWatched-seed#[6052F78A6263A4C7]) [    ] o.a.s.c.c.SolrZkClient makePath: /aliases.json
   [junit4]   2> 1098324 INFO  (TEST-ZkStateReaderTest.testExternalCollectionWatchedNotWatched-seed#[6052F78A6263A4C7]) [    ] o.a.s.c.c.SolrZkClient makePath: /clusterstate.json
   [junit4]   2> 1098325 INFO  (TEST-ZkStateReaderTest.testExternalCollectionWatchedNotWatched-seed#[6052F78A6263A4C7]) [    ] o.a.s.c.c.SolrZkClient makePath: /security.json
   [junit4]   2> 1098326 INFO  (TEST-ZkStateReaderTest.testExternalCollectionWatchedNotWatched-seed#[6052F78A6263A4C7]) [    ] o.a.s.c.c.ZkStateReader Updating cluster state from ZooKeeper... 
   [junit4]   2> 1098326 INFO  (TEST-ZkStateReaderTest.testExternalCollectionWatchedNotWatched-seed#[6052F78A6263A4C7]) [    ] o.a.s.c.c.ZkStateReader Updated live nodes from ZooKeeper... (0) -> (0)
   [junit4]   2> 1098327 INFO  (TEST-ZkStateReaderTest.testExternalCollectionWatchedNotWatched-seed#[6052F78A6263A4C7]) [    ] o.a.s.c.c.SolrZkClient makePath: /collections/c1
   [junit4]   2> 1098327 INFO  (zkCallback-1076-thread-1) [    ] o.a.s.c.c.ZkStateReader A collections change: [WatchedEvent state:SyncConnected type:NodeChildrenChanged path:/collections], has occurred - updating...
   [junit4]   2> 1098328 INFO  (TEST-ZkStateReaderTest.testExternalCollectionWatchedNotWatched-seed#[6052F78A6263A4C7]) [    ] o.a.s.c.o.ZkStateWriter going to create_collection /collections/c1/state.json
   [junit4]   2> 1098329 INFO  (TEST-ZkStateReaderTest.testExternalCollectionWatchedNotWatched-seed#[6052F78A6263A4C7]) [    ] o.a.s.c.c.ZkStateReader addZkWatch [c1]
   [junit4]   2> 1098329 INFO  (TEST-ZkStateReaderTest.testExternalCollectionWatchedNotWatched-seed#[6052F78A6263A4C7]) [    ] o.a.s.c.c.ZkStateReader Add data for [c1] ver [0]
   [junit4]   2> 1098329 INFO  (TEST-ZkStateReaderTest.testExternalCollectionWatchedNotWatched-seed#[6052F78A6263A4C7]) [    ] o.a.s.c.c.ZkStateReader Removing watch for uninteresting collection [c1]
   [junit4]   2> 1098330 INFO  (TEST-ZkStateReaderTest.testExternalCollectionWatchedNotWatched-seed#[6052F78A6263A4C7]) [    ] o.a.s.c.ZkTestServer connecting to 127.0.0.1:40065 40065
   [junit4]   2> 1098348 INFO  (Thread-2293) [    ] o.a.s.c.ZkTestServer connecting to 127.0.0.1:40065 40065
   [junit4]   2> 1098350 INFO  (TEST-ZkStateReaderTest.testExternalCollectionWatchedNotWatched-seed#[6052F78A6263A4C7]) [    ] o.a.s.SolrTestCaseJ4 ###Ending testExternalCollectionWatchedNotWatched
   [junit4]   2> 1098354 INFO  (TEST-ZkStateReaderTest.testStateFormatUpdateWithExplicitRefresh-seed#[6052F78A6263A4C7]) [    ] o.a.s.SolrTestCaseJ4 ###Starting testStateFormatUpdateWithExplicitRefresh
   [junit4]   2> 1098354 INFO  (TEST-ZkStateReaderTest.testStateFormatUpdateWithExplicitRefresh-seed#[6052F78A6263A4C7]) [    ] o.a.s.c.ZkTestServer STARTING ZK TEST SERVER
   [junit4]   2> 1098354 INFO  (Thread-2294) [    ] o.a.s.c.ZkTestServer client port:0.0.0.0/0.0.0.0:0
   [junit4]   2> 1098354 INFO  (Thread-2294) [    ] o.a.s.c.ZkTestServer Starting server
   [junit4]   2> 1098454 INFO  (TEST-ZkStateReaderTest.testStateFormatUpdateWithExplicitRefresh-seed#[6052F78A6263A4C7]) [    ] o.a.s.c.ZkTestServer start zk server on port:43885
   [junit4]   2> 1098454 INFO  (TEST-ZkStateReaderTest.testStateFormatUpdateWithExplicitRefresh-seed#[6052F78A6263A4C7]) [    ] o.a.s.c.c.SolrZkClient Using default ZkCredentialsProvider
   [junit4]   2> 1098455 INFO  (TEST-ZkStateReaderTest.testStateFormatUpdateWithExplicitRefresh-seed#[6052F78A6263A4C7]) [    ] o.a.s.c.c.ConnectionManager Waiting for client to connect to ZooKeeper
   [junit4]   2> 1098459 INFO  (zkCallback-1077-thread-1) [    ] o.a.s.c.c.ConnectionManager Watcher org.apache.solr.common.cloud.ConnectionManager@17a9335 name:ZooKeeperConnection Watcher:127.0.0.1:43885 got event WatchedEvent state:SyncConnected type:None path:null path:null type:None
   [junit4]   2> 1098459 INFO  (TEST-ZkStateReaderTest.testStateFormatUpdateWithExplicitRefresh-seed#[6052F78A6263A4C7]) [    ] o.a.s.c.c.ConnectionManager Client is connected to ZooKeeper
   [junit4]   2> 1098459 INFO  (TEST-ZkStateReaderTest.testStateFormatUpdateWithExplicitRefresh-seed#[6052F78A6263A4C7]) [    ] o.a.s.c.c.SolrZkClient Using default ZkACLProvider
   [junit4]   2> 1098460 INFO  (TEST-ZkStateReaderTest.testStateFormatUpdateWithExplicitRefresh-seed#[6052F78A6263A4C7]) [    ] o.a.s.c.c.SolrZkClient Using default ZkCredentialsProvider
   [junit4]   2> 1098460 INFO  (TEST-ZkStateReaderTest.testStateFormatUpdateWithExplicitRefresh-seed#[6052F78A6263A4C7]) [    ] o.a.s.c.c.ConnectionManager Waiting for client to connect to ZooKeeper
   [junit4]   2> 1098461 INFO  (zkCallback-1078-thread-1) [    ] o.a.s.c.c.ConnectionManager Watcher org.apache.solr.common.cloud.ConnectionManager@13d6c5e name:ZooKeeperConnection Watcher:127.0.0.1:43885 got event WatchedEvent state:SyncConnected type:None path:null path:null type:None
   [junit4]   2> 1098461 INFO  (TEST-ZkStateReaderTest.testStateFormatUpdateWithExplicitRefresh-seed#[6052F78A6263A4C7]) [    ] o.a.s.c.c.ConnectionManager Client is connected to ZooKeeper
   [junit4]   2> 1098462 INFO  (TEST-ZkStateReaderTest.testStateFormatUpdateWithExplicitRefresh-seed#[6052F78A6263A4C7]) [    ] o.a.s.c.c.SolrZkClient Using default ZkACLProvider
   [junit4]   2> 1098462 INFO  (TEST-ZkStateReaderTest.testStateFormatUpdateWithExplicitRefresh-seed#[6052F78A6263A4C7]) [    ] o.a.s.c.c.SolrZkClient makePath: /solr
   [junit4]   2> 1098464 INFO  (TEST-ZkStateReaderTest.testStateFormatUpdateWithExplicitRefresh-seed#[6052F78A6263A4C7]) [    ] o.a.s.c.c.SolrZkClient Using default ZkCredentialsProvider
   [junit4]   2> 1098464 INFO  (TEST-ZkStateReaderTest.testStateFormatUpdateWithExplicitRefresh-seed#[6052F78A6263A4C7]) [    ] o.a.s.c.c.ConnectionManager Waiting for client to connect to ZooKeeper
   [junit4]   2> 1098465 INFO  (zkCallback-1079-thread-1) [    ] o.a.s.c.c.ConnectionManager Watcher org.apache.solr.common.cloud.ConnectionManager@2aac09 name:ZooKeeperConnection Watcher:127.0.0.1:43885/solr got event WatchedEvent state:SyncConnected type:None path:null path:null type:None
   [junit4]   2> 1098466 INFO  (TEST-ZkStateReaderTest.testStateFormatUpdateWithExplicitRefresh-seed#[6052F78A6263A4C7]) [    ] o.a.s.c.c.ConnectionManager Client is connected to ZooKeeper
   [junit4]   2> 1098466 INFO  (TEST-ZkStateReaderTest.testStateFormatUpdateWithExplicitRefresh-seed#[6052F78A6263A4C7]) [    ] o.a.s.c.c.SolrZkClient Using default ZkACLProvider
   [junit4]   2> 1098467 INFO  (TEST-ZkStateReaderTest.testStateFormatUpdateWithExplicitRefresh-seed#[6052F78A6263A4C7]) [    ] o.a.s.c.c.SolrZkClient makePath: /live_nodes
   [junit4]   2> 1098473 INFO  (TEST-ZkStateReaderTest.testStateFormatUpdateWithExplicitRefresh-seed#[6052F78A6263A4C7]) [    ] o.a.s.c.c.SolrZkClient makePath: /collections
   [junit4]   2> 1098474 INFO  (TEST-ZkStateReaderTest.testStateFormatUpdateWithExplicitRefresh-seed#[6052F78A6263A4C7]) [    ] o.a.s.c.c.SolrZkClient makePath: /aliases.json
   [junit4]   2> 1098474 INFO  (TEST-ZkStateReaderTest.testStateFormatUpdateWithExplicitRefresh-seed#[6052F78A6263A4C7]) [    ] o.a.s.c.c.SolrZkClient makePath: /clusterstate.json
   [junit4]   2> 1098475 INFO  (TEST-ZkStateReaderTest.testStateFormatUpdateWithExplicitRefresh-seed#[6052F78A6263A4C7]) [    ] o.a.s.c.c.SolrZkClient makePath: /security.json
   [junit4]   2> 1098476 INFO  (TEST-ZkStateReaderTest.testStateFormatUpdateWithExplicitRefresh-seed#[6052F78A6263A4C7]) [    ] o.a.s.c.c.ZkStateReader Updating cluster state from ZooKeeper... 
   [junit4]   2> 1098476 INFO  (TEST-ZkStateReaderTest.testStateFormatUpdateWithExplicitRefresh-seed#[6052F78A6263A4C7]) [    ] o.a.s.c.c.ZkStateReader Updated live nodes from ZooKeeper... (0) -> (0)
   [junit4]   2> 1098477 INFO  (TEST-ZkStateReaderTest.testStateFormatUpdateWithExplicitRefresh-seed#[6052F78A6263A4C7]) [    ] o.a.s.c.c.ZkStateReader addZkWatch [c1]
   [junit4]   2> 1098477 INFO  (TEST-ZkStateReaderTest.testStateFormatUpdateWithExplicitRefresh-seed#[6052F78A6263A4C7]) [    ] o.a.s.c.c.ZkStateReader Deleting data for [c1]
   [junit4]   2> 1098477 INFO  (TEST-ZkStateReaderTest.testStateFormatUpdateWithExplicitRefresh-seed#[6052F78A6263A4C7]) [    ] o.a.s.c.c.SolrZkClient makePath: /collections/c1
   [junit4]   2> 1098479 INFO  (TEST-ZkStateReaderTest.testStateFormatUpdateWithExplicitRefresh-seed#[6052F78A6263A4C7]) [    ] o.a.s.c.o.ZkStateWriter going to create_collection /collections/c1/state.json
   [junit4]   2> 1098480 INFO  (zkCallback-1079-thread-1) [    ] o.a.s.c.c.ZkStateReader A collections change: [WatchedEvent state:SyncConnected type:NodeChildrenChanged path:/collections], has occurred - updating...
   [junit4]   2> 1098480 INFO  (zkCallback-1079-thread-2) [    ] o.a.s.c.c.ZkStateReader A cluster state change: [WatchedEvent state:SyncConnected type:NodeDataChanged path:/clusterstate.json], has occurred - updating... (live nodes size: [0])
   [junit4]   2> 1098490 INFO  (zkCallback-1079-thread-3) [    ] o.a.s.c.c.ZkStateReader A cluster state change: [WatchedEvent state:SyncConnected type:NodeCreated path:/collections/c1/state.json] for collection [c1] has occurred - updating... (live nodes size: [0])
   [junit4]   2> 1099990 WARN  (zkCallback-1079-thread-3) [    ] o.a.s.c.c.ZkStateReader ZooKeeper watch triggered, but Solr cannot talk to ZK: [KeeperErrorCode = Session expired for /collections/c1/state.json]
   [junit4]   2> 1099991 INFO  (TEST-ZkStateReaderTest.testStateFormatUpdateWithExplicitRefresh-seed#[6052F78A6263A4C7]) [    ] o.a.s.c.ZkTestServer connecting to 127.0.0.1:43885 43885
   [junit4]   2> 1100013 INFO  (Thread-2294) [    ] o.a.s.c.ZkTestServer connecting to 127.0.0.1:43885 43885
   [junit4]   2> 1100014 INFO  (TEST-ZkStateReaderTest.testStateFormatUpdateWithExplicitRefresh-seed#[6052F78A6263A4C7]) [    ] o.a.s.SolrTestCaseJ4 ###Ending testStateFormatUpdateWithExplicitRefresh
   [junit4]   2> 1100016 INFO  (TEST-ZkStateReaderTest.testStateFormatUpdateWithTimeDelay-seed#[6052F78A6263A4C7]) [    ] o.a.s.SolrTestCaseJ4 ###Starting testStateFormatUpdateWithTimeDelay
   [junit4]   2> 1100016 INFO  (TEST-ZkStateReaderTest.testStateFormatUpdateWithTimeDelay-seed#[6052F78A6263A4C7]) [    ] o.a.s.c.ZkTestServer STARTING ZK TEST SERVER
   [junit4]   2> 1100017 INFO  (Thread-2295) [    ] o.a.s.c.ZkTestServer client port:0.0.0.0/0.0.0.0:0
   [junit4]   2> 1100017 INFO  (Thread-2295) [    ] o.a.s.c.ZkTestServer Starting server
   [junit4]   2> 1100117 INFO  (TEST-ZkStateReaderTest.testStateFormatUpdateWithTimeDelay-seed#[6052F78A6263A4C7]) [    ] o.a.s.c.ZkTestServer start zk server on port:43898
   [junit4]   2> 1100117 INFO  (TEST-ZkStateReaderTest.testStateFormatUpdateWithTimeDelay-seed#[6052F78A6263A4C7]) [    ] o.a.s.c.c.SolrZkClient Using default ZkCredentialsProvider
   [junit4]   2> 1100117 INFO  (TEST-ZkStateReaderTest.testStateFormatUpdateWithTimeDelay-seed#[6052F78A6263A4C7]) [    ] o.a.s.c.c.ConnectionManager Waiting for client to connect to ZooKeeper
   [junit4]   2> 1100119 INFO  (zkCallback-1080-thread-1) [    ] o.a.s.c.c.ConnectionManager Watcher org.apache.solr.common.cloud.ConnectionManager@1fdf8b3 name:ZooKeeperConnection Watcher:127.0.0.1:43898 got event WatchedEvent state:SyncConnected type:None path:null path:null type:None
   [junit4]   2> 1100119 INFO  (TEST-ZkStateReaderTest.testStateFormatUpdateWithTimeDelay-seed#[6052F78A6263A4C7]) [    ] o.a.s.c.c.ConnectionManager Client is connected to ZooKeeper
   [junit4]   2> 1100120 INFO  (TEST-ZkStateReaderTest.testStateFormatUpdateWithTimeDelay-seed#[6052F78A6263A4C7]) [    ] o.a.s.c.c.SolrZkClient Using default ZkACLProvider
   [junit4]   2> 1100121 INFO  (TEST-ZkStateReaderTest.testStateFormatUpdateWithTimeDelay-seed#[6052F78A6263A4C7]) [    ] o.a.s.c.c.SolrZkClient Using default ZkCredentialsProvider
   [junit4]   2> 1100121 INFO  (TEST-ZkStateReaderTest.testStateFormatUpdateWithTimeDelay-seed#[6052F78A6263A4C7]) [    ] o.a.s.c.c.ConnectionManager Waiting for client to connect to ZooKeeper
   [junit4]   2> 1100122 INFO  (zkCallback-1081-thread-1) [    ] o.a.s.c.c.ConnectionManager Watcher org.apache.solr.common.cloud.ConnectionManager@17df5f4 name:ZooKeeperConnection Watcher:127.0.0.1:43898 got event WatchedEvent state:SyncConnected type:None path:null path:null type:None
   [junit4]   2> 1100122 INFO  (TEST-ZkStateReaderTest.testStateFormatUpdateWithTimeDelay-seed#[6052F78A6263A4C7]) [    ] o.a.s.c.c.ConnectionManager Client is connected to ZooKeeper
   [junit4]   2> 1100122 INFO  (TEST-ZkStateReaderTest.testStateFormatUpdateWithTimeDelay-seed#[6052F78A6263A4C7]) [    ] o.a.s.c.c.SolrZkClient Using default ZkACLProvider
   [junit4]   2> 1100122 INFO  (TEST-ZkStateReaderTest.testStateFormatUpdateWithTimeDelay-seed#[6052F78A6263A4C7]) [    ] o.a.s.c.c.SolrZkClient makePath: /solr
   [junit4]   2> 1100124 INFO  (TEST-ZkStateReaderTest.testStateFormatUpdateWithTimeDelay-seed#[6052F78A6263A4C7]) [    ] o.a.s.c.c.SolrZkClient Using default ZkCredentialsProvider
   [junit4]   2> 1100124 INFO  (TEST-ZkStateReaderTest.testStateFormatUpdateWithTimeDelay-seed#[6052F78A6263A4C7]) [    ] o.a.s.c.c.ConnectionManager Waiting for client to connect to ZooKeeper
   [junit4]   2> 1100125 INFO  (zkCallback-1082-thread-1) [    ] o.a.s.c.c.ConnectionManager Watcher org.apache.solr.common.cloud.ConnectionManager@dc033c name:ZooKeeperConnection Watcher:127.0.0.1:43898/solr got event WatchedEvent state:SyncConnected type:None path:null path:null type:None
   [junit4]   2> 1100125 INFO  (TEST-ZkStateReaderTest.testStateFormatUpdateWithTimeDelay-seed#[6052F78A6263A4C7]) [    ] o.a.s.c.c.ConnectionManager Client is connected to ZooKeeper
   [junit4]   2> 1100125 INFO  (TEST-ZkStateReaderTest.testStateFormatUpdateWithTimeDelay-seed#[6052F78A6263A4C7]) [    ] o.a.s.c.c.SolrZkClient Using default ZkACLProvider
   [junit4]   2> 1100126 INFO  (TEST-ZkStateReaderTest.testStateFormatUpdateWithTimeDelay-seed#[6052F78A6263A4C7]) [    ] o.a.s.c.c.SolrZkClient makePath: /live_nodes
   [junit4]   2> 1100126 INFO  (TEST-ZkStateReaderTest.testStateFormatUpdateWithTimeDelay-seed#[6052F78A6263A4C7]) [    ] o.a.s.c.c.SolrZkClient makePath: /collections
   [junit4]   2> 1100127 INFO  (TEST-ZkStateReaderTest.testStateFormatUpdateWithTimeDelay-seed#[6052F78A6263A4C7]) [    ] o.a.s.c.c.SolrZkClient makePath: /aliases.json
   [junit4]   2> 1100127 INFO  (TEST-ZkStateReaderTest.testStateFormatUpdateWithTimeDelay-seed#[6052F78A6263A4C7]) [    ] o.a.s.c.c.SolrZkClient makePath: /clusterstate.json
   [junit4]   2> 1100128 INFO  (TEST-ZkStateReaderTest.testStateFormatUpdateWithTimeDelay-seed#[6052F78A6263A4C7]) [    ] o.a.s.c.c.SolrZkClient makePath: /security.json
   [junit4]   2> 1100128 INFO  (TEST-ZkStateReaderTest.testStateFormatUpdateWithTimeDelay-seed#[6052F78A6263A4C7]) [    ] o.a.s.c.c.ZkStateReader Updating cluster state from ZooKeeper... 
   [junit4]   2> 1100129 INFO  (TEST-ZkStateReaderTest.testStateFormatUpdateWithTimeDelay-seed#[6052F78A6263A4C7]) [    ] o.a.s.c.c.ZkStateReader Updated live nodes from ZooKeeper... (0) -> (0)
   [junit4]   2> 1100129 INFO  (TEST-ZkStateReaderTest.testStateFormatUpdateWithTimeDelay-seed#[6052F78A6263A4C7]) [    ] o.a.s.c.c.ZkStateReader addZkWatch [c1]
   [junit4]   2> 1100130 INFO  (TEST-ZkStateReaderTest.testStateFormatUpdateWithTimeDelay-seed#[6052F78A6263A4C7]) [    ] o.a.s.c.c.ZkStateReader Deleting data for [c1]
   [junit4]   2> 1100130 INFO  (TEST-ZkStateReaderTest.testStateFormatUpdateWithTimeDelay-seed#[6052F78A6263A4C7]) [    ] o.a.s.c.c.SolrZkClient makePath: /collections/c1
   [junit4]   2> 1100130 INFO  (zkCallback-1082-thread-1) [    ] o.a.s.c.c.ZkStateReader A collections change: [WatchedEvent state:SyncConnected type:NodeChildrenChanged path:/collections], has occurred - updating...
   [junit4]   2> 1100131 INFO  (zkCallback-1082-thread-1) [    ] o.a.s.c.c.ZkStateReader A cluster state change: [WatchedEvent state:SyncConnected type:NodeDataChanged path:/clusterstate.json], has occurred - updating... (live nodes size: [0])
   [junit4]   2> 1100132 INFO  (TEST-ZkStateReaderTest.testStateFormatUpdateWithTimeDelay-seed#[6052F78A6263A4C7]) [    ] o.a.s.c.o.ZkStateWriter going to create_collection /collections/c1/state.json
   [junit4]   2> 1100132 INFO  (zkCallback-1082-thread-2) [    ] o.a.s.c.c.ZkStateReader A cluster state change: [WatchedEvent state:SyncConnected type:NodeDataChanged path:/clusterstate.json], has occurred - updating... (live nodes size: [0])
   [junit4]   2> 1100141 INFO  (zkCallback-1082-thread-1) [    ] o.a.s.c.c.ZkStateReader A cluster state change: [WatchedEvent state:SyncConnected type:NodeCreated path:/collections/c1/state.json] for collection [c1] has occurred - updating... (live nodes size: [0])
   [junit4]   2> 1100141 WARN  (zkCallback-1082-thread-1) [    ] o.a.s.c.c.ZkStateReader ZooKeeper watch triggered, but Solr cannot talk to ZK: [KeeperErrorCode = Session expired for /collections/c1/state.json]
   [junit4]   2> 1100142 INFO  (TEST-ZkStateReaderTest.testStateFormatUpdateWithTimeDelay-seed#[6052F78A6263A4C7]) [    ] o.a.s.c.ZkTestServer connecting to 127.0.0.1:43898 43898
   [junit4]   2> 1100275 INFO  (Thread-2295) [    ] o.a.s.c.ZkTestServer connecting to 127.0.0.1:43898 43898
   [junit4]   2> 1100277 INFO  (TEST-ZkStateReaderTest.testStateFormatUpdateWithTimeDelay-seed#[6052F78A6263A4C7]) [    ] o.a.s.SolrTestCaseJ4 ###Ending testStateFormatUpdateWithTimeDelay
   [junit4]   2> NOTE: reproduce with: ant test  -Dtestcase=ZkStateReaderTest -Dtests.method=testStateFormatUpdateWithTimeDelay -Dtests.seed=6052F78A6263A4C7 -Dtests.multiplier=3 -Dtests.slow=true -Dtests.locale=zh -Dtests.timezone=Asia/Khandyga -Dtests.asserts=true -Dtests.file.encoding=UTF-8
   [junit4] ERROR   0.26s J2 | ZkStateReaderTest.testStateFormatUpdateWithTimeDelay <<<
   [junit4]    > Throwable #1: org.apache.solr.common.SolrException: Could not find collection : c1
   [junit4]    > 	at __randomizedtesting.SeedInfo.seed([6052F78A6263A4C7:1FCC400F0B01894D]:0)
   [junit4]    > 	at org.apache.solr.common.cloud.ClusterState.getCollection(ClusterState.java:192)
   [junit4]    > 	at org.apache.solr.cloud.overseer.ZkStateReaderTest.testStateFormatUpdate(ZkStateReaderTest.java:128)
   [junit4]    > 	at org.apache.solr.cloud.overseer.ZkStateReaderTest.testStateFormatUpdateWithTimeDelay(ZkStateReaderTest.java:51)
   [junit4]    > 	at jdk.internal.reflect.NativeMethodAccessorImpl.invoke0(java.base@9-ea/Native Method)
   [junit4]    > 	at jdk.internal.reflect.NativeMethodAccessorImpl.invoke(java.base@9-ea/NativeMethodAccessorImpl.java:62)
   [junit4]    > 	at jdk.internal.reflect.DelegatingMethodAccessorImpl.invoke(java.base@9-ea/DelegatingMethodAccessorImpl.java:43)
   [junit4]    > 	at java.lang.Thread.run(java.base@9-ea/Thread.java:804)
   [junit4]   2> 1100281 INFO  (TEST-ZkStateReaderTest.testStateFormatUpdateWithTimeDelayLazy-seed#[6052F78A6263A4C7]) [    ] o.a.s.SolrTestCaseJ4 ###Starting testStateFormatUpdateWithTimeDelayLazy
   [junit4]   2> 1100281 INFO  (TEST-ZkStateReaderTest.testStateFormatUpdateWithTimeDelayLazy-seed#[6052F78A6263A4C7]) [    ] o.a.s.c.ZkTestServer STARTING ZK TEST SERVER
   [junit4]   2> 1100281 INFO  (Thread-2296) [    ] o.a.s.c.ZkTestServer client port:0.0.0.0/0.0.0.0:0
   [junit4]   2> 1100281 INFO  (Thread-2296) [    ] o.a.s.c.ZkTestServer Starting server
   [junit4]   2> 1100381 INFO  (TEST-ZkStateReaderTest.testStateFormatUpdateWithTimeDelayLazy-seed#[6052F78A6263A4C7]) [    ] o.a.s.c.ZkTestServer start zk server on port:41339
   [junit4]   2> 1100381 INFO  (TEST-ZkStateReaderTest.testStateFormatUpdateWithTimeDelayLazy-seed#[6052F78A6263A4C7]) [    ] o.a.s.c.c.SolrZkClient Using default ZkCredentialsProvider
   [junit4]   2> 1100382 INFO  (TEST-ZkStateReaderTest.testStateFormatUpdateWithTimeDelayLazy-seed#[6052F78A6263A4C7]) [    ] o.a.s.c.c.ConnectionManager Waiting for client to connect to ZooKeeper
   [junit4]   2> 1100384 INFO  (zkCallback-1083-thread-1) [    ] o.a.s.c.c.ConnectionManager Watcher org.apache.solr.common.cloud.ConnectionManager@15d4b0c name:ZooKeeperConnection Watcher:127.0.0.1:41339 got event WatchedEvent state:SyncConnected type:None path:null path:null type:None
   [junit4]   2> 1100384 INFO  (TEST-ZkStateReaderTest.testStateFormatUpdateWithTimeDelayLazy-seed#[6052F78A6263A4C7]) [    ] o.a.s.c.c.ConnectionManager Client is connected to ZooKeeper
   [junit4]   2> 1100384 INFO  (TEST-ZkStateReaderTest.testStateFormatUpdateWithTimeDelayLazy-seed#[6052F78A6263A4C7]) [    ] o.a.s.c.c.SolrZkClient Using default ZkACLProvider
   [junit4]   2> 1100385 INFO  (TEST-ZkStateReaderTest.testStateFormatUpdateWithTimeDelayLazy-seed#[6052F78A6263A4C7]) [    ] o.a.s.c.c.SolrZkClient Using default ZkCredentialsProvider
   [junit4]   2> 1100385 INFO  (TEST-ZkStateReaderTest.testStateFormatUpdateWithTimeDelayLazy-seed#[6052F78A6263A4C7]) [    ] o.a.s.c.c.ConnectionManager Waiting for client to connect to ZooKeeper
   [junit4]   2> 1100386 INFO  (zkCallback-1084-thread-1) [    ] o.a.s.c.c.ConnectionManager Watcher org.apache.solr.common.cloud.ConnectionManager@1fe3477 name:ZooKeeperConnection Watcher:127.0.0.1:41339 got event WatchedEvent state:SyncConnected type:None path:null path:null type:None
   [junit4]   2> 1100386 INFO  (TEST-ZkStateReaderTest.testStateFormatUpdateWithTimeDelayLazy-seed#[6052F78A6263A4C7]) [    ] o.a.s.c.c.ConnectionManager Client is connected to ZooKeeper
   [junit4]   2> 1100386 INFO  (TEST-ZkStateReaderTest.testStateFormatUpdateWithTimeDelayLazy-seed#[6052F78A6263A4C7]) [    ] o.a.s.c.c.SolrZkClient Using default ZkACLProvider
   [junit4]   2> 1100386 INFO  (TEST-ZkStateReaderTest.testStateFormatUpdateWithTimeDelayLazy-seed#[6052F78A6263A4C7]) [    ] o.a.s.c.c.SolrZkClient makePath: /solr
   [junit4]   2> 1100388 INFO  (TEST-ZkStateReaderTest.testStateFormatUpdateWithTimeDelayLazy-seed#[6052F78A6263A4C7]) [    ] o.a.s.c.c.SolrZkClient Using default ZkCredentialsProvider
   [junit4]   2> 1100389 INFO  (TEST-ZkStateReaderTest.testStateFormatUpdateWithTimeDelayLazy-seed#[6052F78A6263A4C7]) [    ] o.a.s.c.c.ConnectionManager Waiting for client to connect to ZooKeeper
   [junit4]   2> 1100389 INFO  (zkCallback-1085-thread-1) [    ] o.a.s.c.c.ConnectionManager Watcher org.apache.solr.common.cloud.ConnectionManager@29628e name:ZooKeeperConnection Watcher:127.0.0.1:41339/solr got event WatchedEvent state:SyncConnected type:None path:null path:null type:None
   [junit4]   2> 1100389 INFO  (TEST-ZkStateReaderTest.testStateFormatUpdateWithTimeDelayLazy-seed#[6052F78A6263A4C7]) [    ] o.a.s.c.c.ConnectionManager Client is connected to ZooKeeper
   [junit4]   2> 1100390 INFO  (TEST-ZkStateReaderTest.testStateFormatUpdateWithTimeDelayLazy-seed#[6052F78A6263A4C7]) [    ] o.a.s.c.c.SolrZkClient Using default ZkACLProvider
   [junit4]   2> 1100390 INFO  (TEST-ZkStateReaderTest.testStateFormatUpdateWithTimeDelayLazy-seed#[6052F78A6263A4C7]) [    ] o.a.s.c.c.SolrZkClient makePath: /live_nodes
   [junit4]   2> 1100391 INFO  (TEST-ZkStateReaderTest.testStateFormatUpdateWithTimeDelayLazy-seed#[6052F78A6263A4C7]) [    ] o.a.s.c.c.SolrZkClient makePath: /collections
   [junit4]   2> 1100391 INFO  (TEST-ZkStateReaderTest.testStateFormatUpdateWithTimeDelayLazy-seed#[6052F78A6263A4C7]) [    ] o.a.s.c.c.SolrZkClient makePath: /aliases.json
   [junit4]   2> 1100392 INFO  (TEST-ZkStateReaderTest.testStateFormatUpdateWithTimeDelayLazy-seed#[6052F78A6263A4C7]) [    ] o.a.s.c.c.SolrZkClient makePath: /clusterstate.json
   [junit4]   2> 1100392 INFO  (TEST-ZkStateReaderTest.testStateFormatUpdateWithTimeDelayLazy-seed#[6052F78A6263A4C7]) [    ] o.a.s.c.c.SolrZkClient makePath: /security.json
   [junit4]   2> 1100393 INFO  (TEST-ZkStateReaderTest.testStateFormatUpdateWithTimeDelayLazy-seed#[6052F78A6263A4C7]) [    ] o.a.s.c.c.ZkStateReader Updating cluster state from ZooKeeper... 
   [junit4]   2> 1100394 INFO  (TEST-ZkStateReaderTest.testStateFormatUpdateWithTimeDelayLazy-seed#[6052F78A6263A4C7]) [    ] o.a.s.c.c.ZkStateReader Updated live nodes from ZooKeeper... (0) -> (0)
   [junit4]   2> 1100394 INFO  (TEST-ZkStateReaderTest.testStateFormatUpdateWithTimeDelayLazy-seed#[6052F78A6263A4C7]) [    ] o.a.s.c.c.SolrZkClient makePath: /collections/c1
   [junit4]   2> 1100395 INFO  (zkCallback-1085-thread-1) [    ] o.a.s.c.c.ZkStateReader A collections change: [WatchedEvent state:SyncConnected type:NodeChildrenChanged path:/collections], has occurred - updating...
   [junit4]   2> 1100395 INFO  (zkCallback-1085-thread-1) [    ] o.a.s.c.c.ZkStateReader A cluster state change: [WatchedEvent state:SyncConnected type:NodeDataChanged path:/clusterstate.json], has occurred - updating... (live nodes size: [0])
   [junit4]   2> 1100396 INFO  (TEST-ZkStateReaderTest.testStateFormatUpdateWithTimeDelayLazy-seed#[6052F78A6263A4C7]) [    ] o.a.s.c.o.ZkStateWriter going to create_collection /collections/c1/state.json
   [junit4]   2> 1100396 INFO  (zkCallback-1085-thread-1) [    ] o.a.s.c.c.ZkStateReader A cluster state change: [WatchedEvent state:SyncConnected type:NodeDataChanged path:/clusterstate.json], has occurred - updating... (live nodes size: [0])
   [junit4]   2> 1100398 INFO  (TEST-ZkStateReaderTest.testStateFormatUpdateWithTimeDelayLazy-seed#[6052F78A6263A4C7]) [    ] o.a.s.c.ZkTestServer connecting to 127.0.0.1:41339 41339
   [junit4]   2> 1100427 INFO  (Thread-2296) [    ] o.a.s.c.ZkTestServer connecting to 127.0.0.1:41339 41339
   [junit4]   2> 1100428 INFO  (TEST-ZkStateReaderTest.testStateFormatUpdateWithTimeDelayLazy-seed#[6052F78A6263A4C7]) [    ] o.a.s.SolrTestCaseJ4 ###Ending testStateFormatUpdateWithTimeDelayLazy
   [junit4]   2> 1100432 INFO  (TEST-ZkStateReaderTest.testWatchedCollectionCreation-seed#[6052F78A6263A4C7]) [    ] o.a.s.SolrTestCaseJ4 ###Starting testWatchedCollectionCreation
   [junit4]   2> 1100433 INFO  (TEST-ZkStateReaderTest.testWatchedCollectionCreation-seed#[6052F78A6263A4C7]) [    ] o.a.s.c.ZkTestServer STARTING ZK TEST SERVER
   [junit4]   2> 1100433 INFO  (Thread-2297) [    ] o.a.s.c.ZkTestServer client port:0.0.0.0/0.0.0.0:0
   [junit4]   2> 1100433 INFO  (Thread-2297) [    ] o.a.s.c.ZkTestServer Starting server
   [junit4]   2> 1100533 INFO  (TEST-ZkStateReaderTest.testWatchedCollectionCreation-seed#[6052F78A6263A4C7]) [    ] o.a.s.c.ZkTestServer start zk server on port:34216
   [junit4]   2> 1100533 INFO  (TEST-ZkStateReaderTest.testWatchedCollectionCreation-seed#[6052F78A6263A4C7]) [    ] o.a.s.c.c.SolrZkClient Using default ZkCredentialsProvider
   [junit4]   2> 1100534 INFO  (TEST-ZkStateReaderTest.testWatchedCollectionCreation-seed#[6052F78A6263A4C7]) [    ] o.a.s.c.c.ConnectionManager Waiting for client to connect to ZooKeeper
   [junit4]   2> 1100536 INFO  (zkCallback-1086-thread-1) [    ] o.a.s.c.c.ConnectionManager Watcher org.apache.solr.common.cloud.ConnectionManager@1febf57 name:ZooKeeperConnection Watcher:127.0.0.1:34216 got event WatchedEvent state:SyncConnected type:None path:null path:null type:None
   [junit4]   2> 1100536 INFO  (TEST-ZkStateReaderTest.testWatchedCollectionCreation-seed#[6052F78A6263A4C7]) [    ] o.a.s.c.c.ConnectionManager Client is connected to ZooKeeper
   [junit4]   2> 1100537 INFO  (TEST-ZkStateReaderTest.testWatchedCollectionCreation-seed#[6052F78A6263A4C7]) [    ] o.a.s.c.c.SolrZkClient Using default ZkACLProvider
   [junit4]   2> 1100537 INFO  (TEST-ZkStateReaderTest.testWatchedCollectionCreation-seed#[6052F78A6263A4C7]) [    ] o.a.s.c.c.SolrZkClient Using default ZkCredentialsProvider
   [junit4]   2> 1100538 INFO  (TEST-ZkStateReaderTest.testWatchedCollectionCreation-seed#[6052F78A6263A4C7]) [    ] o.a.s.c.c.ConnectionManager Waiting for client to connect to ZooKeeper
   [junit4]   2> 1100538 INFO  (zkCallback-1087-thread-1) [    ] o.a.s.c.c.ConnectionManager Watcher org.apache.solr.common.cloud.ConnectionManager@1a49f88 name:ZooKeeperConnection Watcher:127.0.0.1:34216 got event WatchedEvent state:SyncConnected type:None path:null path:null type:None
   [junit4]   2> 1100539 INFO  (TEST-ZkStateReaderTest.testWatchedCollectionCreation-seed#[6052F78A6263A4C7]) [    ] o.a.s.c.c.ConnectionManager Client is connected to ZooKeeper
   [junit4]   2> 1100539 INFO  (TEST-ZkStateReaderTest.testWatchedCollectionCreation-seed#[6052F78A6263A4C7]) [    ] o.a.s.c.c.SolrZkClient Using default ZkACLProvider
   [junit4]   2> 1100539 INFO  (TEST-ZkStateReaderTest.testWatchedCollectionCreation-seed#[6052F78A6263A4C7]) [    ] o.a.s.c.c.SolrZkClient makePath: /solr
   [junit4]   2> 1100541 INFO  (TEST-ZkStateReaderTest.testWatchedCollectionCreation-seed#[6052F78A6263A4C7]) [    ] o.a.s.c.c.SolrZkClient Using default ZkCredentialsProvider
   [junit4]   2> 1100541 INFO  (TEST-ZkStateReaderTest.testWatchedCollectionCreation-seed#[6052F78A6263A4C7]) [    ] o.a.s.c.c.ConnectionManager Waiting for client to connect to ZooKeeper
   [junit4]   2> 1100542 INFO  (zkCallback-1088-thread-1) [    ] o.a.s.c.c.ConnectionManager Watcher org.apache.solr.common.cloud.ConnectionManager@1ac1b29 name:ZooKeeperConnection Watcher:127.0.0.1:34216/solr got event WatchedEvent state:SyncConnected type:None path:null path:null type:None
   [junit4]   2> 1100542 INFO  (TEST-ZkStateReaderTest.testWatchedCollectionCreation-seed#[6052F78A6263A4C7]) [    ] o.a.s.c.c.ConnectionManager Client is connected to ZooKeeper
   [junit4]   2> 1100542 INFO  (TEST-ZkStateReaderTest.testWatchedCollectionCreation-seed#[6052F78A6263A4C7]) [    ] o.a.s.c.c.SolrZkClient Using default ZkACLProvider
   [junit4]   2> 1100542 INFO  (TEST-ZkStateReaderTest.testWatchedCollectionCreation-seed#[6052F78A6263A4C7]) [    ] o.a.s.c.c.SolrZkClient makePath: /live_nodes
   [junit4]   2> 1100543 INFO  (TEST-ZkStateReaderTest.testWatchedCollectionCreation-seed#[6052F78A6263A4C7]) [    ] o.a.s.c.c.SolrZkClient makePath: /collections
   [junit4]   2> 1100543 INFO  (TEST-ZkStateReaderTest.testWatchedCollectionCreation-seed#[6052F78A6263A4C7]) [    ] o.a.s.c.c.SolrZkClient makePath: /aliases.json
   [junit4]   2> 1100544 INFO  (TEST-ZkStateReaderTest.testWatchedCollectionCreation-seed#[6052F78A6263A4C7]) [    ] o.a.s.c.c.SolrZkClient makePath: /clusterstate.json
   [junit4]   2> 1100544 INFO  (TEST-ZkStateReaderTest.testWatchedCollectionCreation-seed#[6052F78A6263A4C7]) [    ] o.a.s.c.c.SolrZkClient makePath: /security.json
   [junit4]   2> 1100545 INFO  (TEST-ZkStateReaderTest.testWatchedCollectionCreation-seed#[6052F78A6263A4C7]) [    ] o.a.s.c.c.ZkStateReader Updating cluster state from ZooKeeper... 
   [junit4]   2> 1100545 INFO  (TEST-ZkStateReaderTest.testWatchedCollectionCreation-seed#[6052F78A6263A4C7]) [    ] o.a.s.c.c.ZkStateReader Updated live nodes from ZooKeeper... (0) -> (0)
   [junit4]   2> 1100546 INFO  (TEST-ZkStateReaderTest.testWatchedCollectionCreation-seed#[6052F78A6263A4C7]) [    ] o.a.s.c.c.ZkStateReader addZkWatch [c1]
   [junit4]   2> 1100546 INFO  (TEST-ZkStateReaderTest.testWatchedCollectionCreation-seed#[6052F78A6263A4C7]) [    ] o.a.s.c.c.ZkStateReader Deleting data for [c1]
   [junit4]   2> 1100546 INFO  (TEST-ZkStateReaderTest.testWatchedCollectionCreation-seed#[6052F78A6263A4C7]) [    ] o.a.s.c.c.SolrZkClient makePath: /collections/c1
   [junit4]   2> 1100546 INFO  (zkCallback-1088-thread-1) [    ] o.a.s.c.c.ZkStateReader A collections change: [WatchedEvent state:SyncConnected type:NodeChildrenChanged path:/collections], has occurred - updating...
   [junit4]   2> 1100547 INFO  (TEST-ZkStateReaderTest.testWatchedCollectionCreation-seed#[6052F78A6263A4C7]) [    ] o.a.s.c.o.ZkStateWriter going to create_collection /collections/c1/state.json
   [junit4]   2> 1100548 INFO  (zkCallback-1088-thread-1) [    ] o.a.s.c.c.ZkStateReader A cluster state change: [WatchedEvent state:SyncConnected type:NodeCreated path:/collections/c1/state.json] for collection [c1] has occurred - updating... (live nodes size: [0])
   [junit4]   2> 1100548 INFO  (zkCallback-1088-thread-1) [    ] o.a.s.c.c.ZkStateReader Add data for [c1] ver [0]
   [junit4]   2> 1100599 INFO  (TEST-ZkStateReaderTest.testWatchedCollectionCreation-seed#[6052F78A6263A4C7]) [    ] o.a.s.c.ZkTestServer connecting to 127.0.0.1:34216 34216
   [junit4]   2> 1100606 INFO  (Thread-2297) [    ] o.a.s.c.ZkTestServer connecting to 127.0.0.1:34216 34216
   [junit4]   2> 1100607 INFO  (TEST-ZkStateReaderTest.testWatchedCollectionCreation-seed#[6052F78A6263A4C7]) [    ] o.a.s.SolrTestCaseJ4 ###Ending testWatchedCollectionCreation
   [junit4]   2> 1100610 INFO  (TEST-ZkStateReaderTest.testStateFormatUpdateWithExplicitRefreshLazy-seed#[6052F78A6263A4C7]) [    ] o.a.s.SolrTestCaseJ4 ###Starting testStateFormatUpdateWithExplicitRefreshLazy
   [junit4]   2> 1100611 INFO  (TEST-ZkStateReaderTest.testStateFormatUpdateWithExplicitRefreshLazy-seed#[6052F78A6263A4C7]) [    ] o.a.s.c.ZkTestServer STARTING ZK TEST SERVER
   [junit4]   2> 1100611 INFO  (Thread-2298) [    ] o.a.s.c.ZkTestServer client port:0.0.0.0/0.0.0.0:0
   [junit4]   2> 1100611 INFO  (Thread-2298) [    ] o.a.s.c.ZkTestServer Starting server
   [junit4]   2> 1100711 INFO  (TEST-ZkStateReaderTest.testStateFormatUpdateWithExplicitRefreshLazy-seed#[6052F78A6263A4C7]) [    ] o.a.s.c.ZkTestServer start zk server on port:37082
   [junit4]   2> 1100711 INFO  (TEST-ZkStateReaderTest.testStateFormatUpdateWithExplicitRefreshLazy-seed#[6052F78A6263A4C7]) [    ] o.a.s.c.c.SolrZkClient Using default ZkCredentialsProvider
   [junit4]   2> 1100711 INFO  (TEST-ZkStateReaderTest.testStateFormatUpdateWithExplicitRefreshLazy-seed#[6052F78A6263A4C7]) [    ] o.a.s.c.c.ConnectionManager Waiting for client to connect to ZooKeeper
   [junit4]   2> 1100713 INFO  (zkCallback-1089-thread-1) [    ] o.a.s.c.c.ConnectionManager Watcher org.apache.solr.common.cloud.ConnectionManager@50d380 name:ZooKeeperConnection Watcher:127.0.0.1:37082 got event WatchedEvent state:SyncConnected type:None path:null path:null type:None
   [junit4]   2> 1100713 INFO  (TEST-ZkStateReaderTest.testStateFormatUpdateWithExplicitRefreshLazy-seed#[6052F78A6263A4C7]) [    ] o.a.s.c.c.ConnectionManager Client is connected to ZooKeeper
   [junit4]   2> 1100714 INFO  (TEST-ZkStateReaderTest.testStateFormatUpdateWithExplicitRefreshLazy-seed#[6052F78A6263A4C7]) [    ] o.a.s.c.c.SolrZkClient Using default ZkACLProvider
   [junit4]   2> 1100714 INFO  (TEST-ZkStateReaderTest.testStateFormatUpdateWithExplicitRefreshLazy-seed#[6052F78A6263A4C7]) [    ] o.a.s.c.c.SolrZkClient Using default ZkCredentialsProvider
   [junit4]   2> 1100714 INFO  (TEST-ZkStateReaderTest.testStateFormatUpdateWithExplicitRefreshLazy-seed#[6052F78A6263A4C7]) [    ] o.a.s.c.c.ConnectionManager Waiting for client to connect to ZooKeeper
   [junit4]   2> 1100715 INFO  (zkCallback-1090-thread-1) [    ] o.a.s.c.c.ConnectionManager Watcher org.apache.solr.common.cloud.ConnectionManager@12cca2c name:ZooKeeperConnection Watcher:127.0.0.1:37082 got event WatchedEvent state:SyncConnected type:None path:null path:null type:None
   [junit4]   2> 1100715 INFO  (TEST-ZkStateReaderTest.testStateFormatUpdateWithExplicitRefreshLazy-seed#[6052F78A6263A4C7]) [    ] o.a.s.c.c.ConnectionManager Client is connected to ZooKeeper
   [junit4]   2> 1100715 INFO  (TEST-ZkStateReaderTest.testStateFormatUpdateWithExplicitRefreshLazy-seed#[6052F78A6263A4C7]) [    ] o.a.s.c.c.SolrZkClient Using default ZkACLProvider
   [junit4]   2> 1100715 INFO  (TEST-ZkStateReaderTest.testStateFormatUpdateWithExplicitRefreshLazy-seed#[6052F78A6263A4C7]) [    ] o.a.s.c.c.SolrZkClient makePath: /solr
   [junit4]   2> 1100717 INFO  (TEST-ZkStateReaderTest.testStateFormatUpdateWithExplicitRefreshLazy-seed#[6052F78A6263A4C7]) [    ] o.a.s.c.c.SolrZkClient Using default ZkCredentialsProvider
   [junit4]   2> 1100718 INFO  (TEST-ZkStateReaderTest.testStateFormatUpdateWithExplicitRefreshLazy-seed#[6052F78A6263A4C7]) [    ] o.a.s.c.c.ConnectionManager Waiting for client to connect to ZooKeeper
   [junit4]   2> 1100718 INFO  (zkCallback-1091-thread-1) [    ] o.a.s.c.c.ConnectionManager Watcher org.apache.solr.common.cloud.ConnectionManager@8fd918 name:ZooKeeperConnection Watcher:127.0.0.1:37082/solr got event WatchedEvent state:SyncConnected type:None path:null path:null type:None
   [junit4]   2> 1100718 INFO  (TEST-ZkStateReaderTest.testStateFormatUpdateWithExplicitRefreshLazy-seed#[6052F78A6263A4C7]) [    ] o.a.s.c.c.ConnectionManager Client is connected to ZooKeeper
   [junit4]   2> 1100718 INFO  (TEST-ZkStateReaderTest.testStateFormatUpdateWithExplicitRefreshLazy-seed#[6052F78A6263A4C7]) [    ] o.a.s.c.c.SolrZkClient Using default ZkACLProvider
   [junit4]   2> 1100719 INFO  (TEST-ZkStateReaderTest.testStateFormatUpdateWithExplicitRefreshLazy-seed#[6052F78A6263A4C7]) [    ] o.a.s.c.c.SolrZkClient makePath: /live_nodes
   [junit4]   2> 1100719 INFO  (TEST-ZkStateReaderTest.testStateFormatUpdateWithExplicitRefreshLazy-seed#[6052F78A6263A4C7]) [    ] o.a.s.c.c.SolrZkClient makePath: /collections
   [junit4]   2> 1100720 INFO  (TEST-ZkStateReaderTest.testStateFormatUpdateWithExplicitRefreshLazy-seed#[6052F78A6263A4C7]) [    ] o.a.s.c.c.SolrZkClient makePath: /aliases.json
   [junit4]   2> 1100720 INFO  (TEST-ZkStateReaderTest.testStateFormatUpdateWithExplicitRefreshLazy-seed#[6052F78A6263A4C7]) [    ] o.a.s.c.c.SolrZkClient makePath: /clusterstate.json
   [junit4]   2> 1100721 INFO  (TEST-ZkStateReaderTest.testStateFormatUpdateWithExplicitRefreshLazy-seed#[6052F78A6263A4C7]) [    ] o.a.s.c.c.SolrZkClient makePath: /security.json
   [junit4]   2> 1100722 INFO  (TEST-ZkStateReaderTest.testStateFormatUpdateWithExplicitRefreshLazy-seed#[6052F78A6263A4C7]) [    ] o.a.s.c.c.ZkStateReader Updating cluster state from ZooKeeper... 
   [junit4]   2> 1100722 INFO  (TEST-ZkStateReaderTest.testStateFormatUpdateWithExplicitRefreshLazy-seed#[6052F78A6263A4C7]) [    ] o.a.s.c.c.ZkStateReader Updated live nodes from ZooKeeper... (0) -> (0)
   [junit4]   2> 1100723 INFO  (TEST-ZkStateReaderTest.testStateFormatUpdateWithExplicitRefreshLazy-seed#[6052F78A6263A4C7]) [    ] o.a.s.c.c.SolrZkClient makePath: /collections/c1
   [junit4]   2> 1100723 INFO  (zkCallback-1091-thread-1) [    ] o.a.s.c.c.ZkStateReader A collections change: [WatchedEvent state:SyncConnected type:NodeChildrenChanged path:/collections], has occurred - updating...
   [junit4]   2> 1100724 INFO  (zkCallback-1091-thread-1) [    ] o.a.s.c.c.ZkStateReader A cluster state change: [WatchedEvent state:SyncConnected type:NodeDataChanged path:/clusterstate.json], has occurred - updating... (live nodes size: [0])
   [junit4]   2> 1100730 INFO  (TEST-ZkStateReaderTest.testStateFormatUpdateWithExplicitRefreshLazy-seed#[6052F78A6263A4C7]) [    ] o.a.s.c.o.ZkStateWriter going to create_collection /collections/c1/state.json
   [junit4]   2> 1100731 INFO  (zkCallback-1091-thread-1) [    ] o.a.s.c.c.ZkStateReader A cluster state change: [WatchedEvent state:SyncConnected type:NodeDataChanged path:/clusterstate.json], has occurred - updating... (live nodes size: [0])
   [junit4]   2> 1100732 INFO  (TEST-ZkStateReaderTest.testStateFormatUpdateWithExplicitRefreshLazy-seed#[6052F78A6263A4C7]) [    ] o.a.s.c.ZkTestServer connecting to 127.0.0.1:37082 37082
   [junit4]   2> 1100733 INFO  (Thread-2298) [    ] o.a.s.c.ZkTestServer connecting to 127.0.0.1:37082 37082
   [junit4]   2> 1100734 INFO  (TEST-ZkStateReaderTest.testStateFormatUpdateWithExplicitRefreshLazy-seed#[6052F78A6263A4C7]) [    ] o.a.s.SolrTestCaseJ4 ###Ending testStateFormatUpdateWithExplicitRefreshLazy
   [junit4]   2> 1100735 INFO  (SUITE-ZkStateReaderTest-seed#[6052F78A6263A4C7]-worker) [    ] o.a.s.SolrTestCaseJ4 ###deleteCore
   [junit4]   2> NOTE: leaving temporary files on disk at: /home/jenkins/workspace/Lucene-Solr-master-Linux/solr/build/solr-core/test/J2/temp/solr.cloud.overseer.ZkStateReaderTest_6052F78A6263A4C7-001
   [junit4]   2> May 04, 2016 12:14:49 PM com.carrotsearch.randomizedtesting.ThreadLeakControl checkThreadLeaks
   [junit4]   2> WARNING: Will linger awaiting termination of 8 leaked thread(s).
   [junit4]   2> NOTE: test params are: codec=Asserting(Lucene60): {}, docValues:{}, maxPointsInLeafNode=117, maxMBSortInHeap=6.470206351269685, sim=ClassicSimilarity, locale=zh, timezone=Asia/Khandyga
   [junit4]   2> NOTE: Linux 4.2.0-35-generic i386/Oracle Corporation 9-ea (32-bit)/cpus=12,threads=1,free=157608008,total=320864256
   [junit4]   2> NOTE: All tests run in this JVM: [ShardSplitTest, TestPerFieldSimilarityWithDefaultOverride, TestPHPSerializedResponseWriter, TestFreeTextSuggestions, CurrencyFieldXmlFileTest, TestJsonRequest, TestConfigOverlay, DistributedFacetPivotSmallAdvancedTest, FieldMutatingUpdateProcessorTest, TestBlobHandler, TestUtils, DeleteShardTest, CdcrUpdateLogTest, TestJmxIntegration, CleanupOldIndexTest, SliceStateTest, TestPivotHelperCode, TestSchemaVersionResource, TestRequestStatusCollectionAPI, XmlUpdateRequestHandlerTest, BlockDirectoryTest, LeaderElectionTest, StatelessScriptUpdateProcessorFactoryTest, SuggesterTest, RollingRestartTest, AutoCommitTest, TestManagedResourceStorage, MigrateRouteKeyTest, SpatialRPTFieldTypeTest, TestStandardQParsers, LukeRequestHandlerTest, RemoteQueryErrorTest, TestCoreDiscovery, NoCacheHeaderTest, DocValuesMultiTest, BaseCdcrDistributedZkTest, CoreAdminHandlerTest, ConnectionManagerTest, TestFastWriter, TestTolerantSearch, TestZkChroot, DirectUpdateHandlerOptimizeTest, TestGroupingSearch, TestAuthenticationFramework, SuggesterTSTTest, TestSweetSpotSimilarityFactory, TestSchemaNameResource, SolrCoreCheckLockOnStartupTest, CollectionStateFormat2Test, TestUseDocValuesAsStored, DirectUpdateHandlerTest, FullSolrCloudDistribCmdsTest, RecoveryZkTest, BadComponentTest, TestRecovery, TestSizeLimitedDistributedMap, TestClassicSimilarityFactory, TestJmxMonitoredMap, TestCharFilters, TestSolrDynamicMBean, TestSort, TestIndexSearcher, TestSolrQueryParser, TestMacros, TestManagedSynonymFilterFactory, DistributedQueryComponentCustomSortTest, CircularListTest, HdfsRecoveryZkTest, BitVectorTest, AssignTest, HdfsThreadLeakTest, GraphQueryTest, ZkStateReaderTest]
   [junit4] Completed [279/593 (1!)] on J2 in 2.80s, 6 tests, 1 error <<< FAILURES!

[...truncated 8 lines...]
   [junit4] Suite: org.apache.solr.cloud.OverseerTest
   [junit4]   2> Creating dataDir: /home/jenkins/workspace/Lucene-Solr-master-Linux/solr/build/solr-core/test/J2/temp/solr.cloud.OverseerTest_6052F78A6263A4C7-001/init-core-data-001
   [junit4]   2> 1101783 INFO  (SUITE-OverseerTest-seed#[6052F78A6263A4C7]-worker) [    ] o.a.s.SolrTestCaseJ4 Randomized ssl (false) and clientAuth (false)
   [junit4]   2> 1101783 INFO  (SUITE-OverseerTest-seed#[6052F78A6263A4C7]-worker) [    ] o.a.s.SolrTestCaseJ4 ####initCore
   [junit4]   2> 1101783 INFO  (SUITE-OverseerTest-seed#[6052F78A6263A4C7]-worker) [    ] o.a.s.SolrTestCaseJ4 ####initCore end
   [junit4]   2> 1101803 INFO  (TEST-OverseerTest.testOverseerStatsReset-seed#[6052F78A6263A4C7]) [    ] o.a.s.SolrTestCaseJ4 ###Starting testOverseerStatsReset
   [junit4]   2> 1101803 INFO  (TEST-OverseerTest.testOverseerStatsReset-seed#[6052F78A6263A4C7]) [    ] o.a.s.c.ZkTestServer STARTING ZK TEST SERVER
   [junit4]   2> 1101804 INFO  (Thread-2312) [    ] o.a.s.c.ZkTestServer client port:0.0.0.0/0.0.0.0:0
   [junit4]   2> 1101804 INFO  (Thread-2312) [    ] o.a.s.c.ZkTestServer Starting server
   [junit4]   2> 1101904 INFO  (TEST-OverseerTest.testOverseerStatsReset-seed#[6052F78A6263A4C7]) [    ] o.a.s.c.ZkTestServer start zk server on port:35403
   [junit4]   2> 1101904 INFO  (TEST-OverseerTest.testOverseerStatsReset-seed#[6052F78A6263A4C7]) [    ] o.a.s.c.c.SolrZkClient Using default ZkCredentialsProvider
   [junit4]   2> 1101920 INFO  (TEST-OverseerTest.testOverseerStatsReset-seed#[6052F78A6263A4C7]) [    ] o.a.s.c.c.ConnectionManager Waiting for client to connect to ZooKeeper
   [junit4]   2> 1101934 INFO  (zkCallback-1094-thread-1) [    ] o.a.s.c.c.ConnectionManager Watcher org.apache.solr.common.cloud.ConnectionManager@16b3715 name:ZooKeeperConnection Watcher:127.0.0.1:35403 got event WatchedEvent state:SyncConnected type:None path:null path:null type:None
   [junit4]   2> 1101934 INFO  (TEST-OverseerTest.testOverseerStatsReset-seed#[6052F78A6263A4C7]) [    ] o.a.s.c.c.ConnectionManager Client is connected to ZooKeeper
   [junit4]   2> 1101934 INFO  (TEST-OverseerTest.testOverseerStatsReset-seed#[6052F78A6263A4C7]) [    ] o.a.s.c.c.SolrZkClient Using default ZkACLProvider
   [junit4]   2> 1101935 INFO  (TEST-OverseerTest.testOverseerStatsReset-seed#[6052F78A6263A4C7]) [    ] o.a.s.c.c.SolrZkClient Using default ZkCredentialsProvider
   [junit4]   2> 1101954 INFO  (TEST-OverseerTest.testOverseerStatsReset-seed#[6052F78A6263A4C7]) [    ] o.a.s.c.c.ConnectionManager Waiting for client to connect to ZooKeeper
   [junit4]   2> 1101954 INFO  (zkCallback-1095-thread-1) [    ] o.a.s.c.c.ConnectionManager Watcher org.apache.solr.common.cloud.ConnectionManager@12d1410 name:ZooKeeperConnection Watcher:127.0.0.1:35403 got event WatchedEvent state:SyncConnected type:None path:null path:null type:None
   [junit4]   2> 1101954 INFO  (TEST-OverseerTest.testOverseerStatsReset-seed#[6052F78A6263A4C7]) [    ] o.a.s.c.c.ConnectionManager Client is connected to ZooKeeper
   [junit4]   2> 1101954 INFO  (TEST-OverseerTest.testOverseerStatsReset-seed#[6052F78A6263A4C7]) [    ] o.a.s.c.c.SolrZkClient Using default ZkACLProvider
   [junit4]   2> 1101954 INFO  (TEST-OverseerTest.testOverseerStatsReset-seed#[6052F78A6263A4C7]) [    ] o.a.s.c.c.SolrZkClient makePath: /solr
   [junit4]   2> 1101956 INFO  (TEST-OverseerTest.testOverseerStatsReset-seed#[6052F78A6263A4C7]) [    ] o.a.s.c.c.SolrZkClient Using default ZkCredentialsProvider
   [junit4]   2> 1101965 INFO  (TEST-OverseerTest.testOverseerStatsReset-seed#[6052F78A6263A4C7]) [    ] o.a.s.c.c.ConnectionManager Waiting for client to connect to ZooKeeper
   [junit4]   2> 1101977 INFO  (zkCallback-1096-thread-1) [    ] o.a.s.c.c.ConnectionManager Watcher org.apache.solr.common.cloud.ConnectionManager@1f0eff8 name:ZooKeeperConnection Watcher:127.0.0.1:35403/solr got event WatchedEvent state:SyncConnected type:None path:null path:null type:None
   [junit4]   2> 1101977 INFO  (TEST-OverseerTest.testOverseerStatsReset-seed#[6052F78A6263A4C7]) [    ] o.a.s.c.c.ConnectionManager Client is connected to ZooKeeper
   [junit4]   2> 1101977 INFO  (TEST-OverseerTest.testOverseerStatsReset-seed#[6052F78A6263A4C7]) [    ] o.a.s.c.c.SolrZkClient Using default ZkACLProvider
   [junit4]   2> 1101977 INFO  (TEST-OverseerTest.testOverseerStatsReset-seed#[6052F78A6263A4C7]) [    ] o.a.s.c.c.SolrZkClient makePath: /live_nodes
   [junit4]   2> 1101978 INFO  (TEST-OverseerTest.testOverseerStatsReset-seed#[6052F78A6263A4C7]) [    ] o.a.s.c.c.SolrZkClient makePath: /collections
   [junit4]   2> 1101979 INFO  (TEST-OverseerTest.testOverseerStatsReset-seed#[6052F78A6263A4C7]) [    ] o.a.s.c.c.SolrZkClient makePath: /aliases.json
   [junit4]   2> 1101979 INFO  (TEST-OverseerTest.testOverseerStatsReset-seed#[6052F78A6263A4C7]) [    ] o.a.s.c.c.SolrZkClient makePath: /clusterstate.json
   [junit4]   2> 1101980 INFO  (TEST-OverseerTest.testOverseerStatsReset-seed#[6052F78A6263A4C7]) [    ] o.a.s.c.c.SolrZkClient makePath: /security.json
   [junit4]   2> 1101981 INFO  (TEST-OverseerTest.testOverseerStatsReset-seed#[6052F78A6263A4C7]) [    ] o.a.s.c.c.ZkStateReader Updating cluster state from ZooKeeper... 
   [junit4]   2> 1101981 INFO  (TEST-OverseerTest.testOverseerStatsReset-seed#[6052F78A6263A4C7]) [    ] o.a.s.c.c.ZkStateReader Updated live nodes from ZooKeeper... (0) -> (0)
   [junit4]   2> 1101982 INFO  (TEST-OverseerTest.testOverseerStatsReset-seed#[6052F78A6263A4C7]) [    ] o.a.s.c.c.SolrZkClient Using default ZkCredentialsProvider
   [junit4]   2> 1102002 INFO  (TEST-OverseerTest.testOverseerStatsReset-seed#[6052F78A6263A4C7]) [    ] o.a.s.c.c.ConnectionManager Waiting for client to connect to ZooKeeper
   [junit4]   2> 1102002 INFO  (zkCallback-1097-thread-1) [    ] o.a.s.c.c.ConnectionManager Watcher org.apache.solr.common.cloud.ConnectionManager@190a50d name:ZooKeeperConnection Watcher:127.0.0.1:35403/solr got event WatchedEvent state:SyncConnected type:None path:null path:null type:None
   [junit4]   2> 1102002 INFO  (TEST-OverseerTest.testOverseerStatsReset-seed#[6052F78A6263A4C7]) [    ] o.a.s.c.c.ConnectionManager Client is connected to ZooKeeper
   [junit4]   2> 1102003 INFO  (TEST-OverseerTest.testOverseerStatsReset-seed#[6052F78A6263A4C7]) [    ] o.a.s.c.c.SolrZkClient Using default ZkACLProvider
   [junit4]   2> 1102004 INFO  (TEST-OverseerTest.testOverseerStatsReset-seed#[6052F78A6263A4C7]) [    ] o.a.s.c.c.ZkStateReader Updating cluster state from ZooKeeper... 
   [junit4]   2> 1102004 INFO  (TEST-OverseerTest.testOverseerStatsReset-seed#[6052F78A6263A4C7]) [    ] o.a.s.c.c.ZkStateReader Updated live nodes from ZooKeeper... (0) -> (0)
   [junit4]   2> 1102004 INFO  (TEST-OverseerTest.testOverseerStatsReset-seed#[6052F78A6263A4C7]) [    ] o.a.s.c.c.SolrZkClient makePath: /live_nodes/node1
   [junit4]   2> 1102005 INFO  (zkCallback-1097-thread-1) [    ] o.a.s.c.c.ZkStateReader A live node change: [WatchedEvent state:SyncConnected type:NodeChildrenChanged path:/live_nodes], has occurred - updating... (live nodes size: [0])
   [junit4]   2> 1102005 INFO  (zkCallback-1096-thread-1) [    ] o.a.s.c.c.ZkStateReader A live node change: [WatchedEvent state:SyncConnected type:NodeChildrenChanged path:/live_nodes], has occurred - updating... (live nodes size: [0])
   [junit4]   2> 1102006 INFO  (zkCallback-1097-thread-1) [    ] o.a.s.c.c.ZkStateReader Updated live nodes from ZooKeeper... (0) -> (1)
   [junit4]   2> 1102006 INFO  (zkCallback-1096-thread-1) [    ] o.a.s.c.c.ZkStateReader Updated live nodes from ZooKeeper... (0) -> (1)
   [junit4]   2> 1102006 INFO  (TEST-OverseerTest.testOverseerStatsReset-seed#[6052F78A6263A4C7]) [    ] o.a.s.u.UpdateShardHandler Creating UpdateShardHandler HTTP client with params: 
   [junit4]   2> 1102010 INFO  (TEST-OverseerTest.testOverseerStatsReset-seed#[6052F78A6263A4C7]) [    ] o.a.s.c.c.SolrZkClient makePath: /overseer_elect
   [junit4]   2> 1102011 INFO  (TEST-OverseerTest.testOverseerStatsReset-seed#[6052F78A6263A4C7]) [    ] o.a.s.c.c.SolrZkClient makePath: /overseer_elect/election
   [junit4]   2> 1102011 INFO  (TEST-OverseerTest.testOverseerStatsReset-seed#[6052F78A6263A4C7]) [    ] o.a.s.c.Overseer Overseer (id=null) closing
   [junit4]   2> 1102012 INFO  (TEST-OverseerTest.testOverseerStatsReset-seed#[6052F78A6263A4C7]) [    ] o.a.s.c.LeaderElector Joined leadership election with path: /overseer_elect/election/95837493066661890-127.0.0.1:35403_solr-n_0000000000
   [junit4]   2> 1102014 INFO  (TEST-OverseerTest.testOverseerStatsReset-seed#[6052F78A6263A4C7]) [    ] o.a.s.c.OverseerElectionContext I am going to be the leader 127.0.0.1:35403_solr
   [junit4]   2> 1102014 INFO  (TEST-OverseerTest.testOverseerStatsReset-seed#[6052F78A6263A4C7]) [    ] o.a.s.c.c.SolrZkClient makePath: /overseer_elect/leader
   [junit4]   2> 1102015 INFO  (TEST-OverseerTest.testOverseerStatsReset-seed#[6052F78A6263A4C7]) [    ] o.a.s.c.Overseer Overseer (id=95837493066661890-127.0.0.1:35403_solr-n_0000000000) starting
   [junit4]   2> 1102015 INFO  (TEST-OverseerTest.testOverseerStatsReset-seed#[6052F78A6263A4C7]) [    ] o.a.s.c.c.SolrZkClient makePath: /overseer/queue
   [junit4]   2> 1102016 INFO  (TEST-OverseerTest.testOverseerStatsReset-seed#[6052F78A6263A4C7]) [    ] o.a.s.c.c.SolrZkClient makePath: /overseer/queue-work
   [junit4]   2> 1102017 INFO  (TEST-OverseerTest.testOverseerStatsReset-seed#[6052F78A6263A4C7]) [    ] o.a.s.c.c.SolrZkClient makePath: /overseer/collection-map-failure
   [junit4]   2> 1102018 INFO  (TEST-OverseerTest.testOverseerStatsReset-seed#[6052F78A6263A4C7]) [    ] o.a.s.c.c.SolrZkClient makePath: /overseer/collection-map-running
   [junit4]   2> 1102019 INFO  (TEST-OverseerTest.testOverseerStatsReset-seed#[6052F78A6263A4C7]) [    ] o.a.s.c.c.SolrZkClient makePath: /overseer/collection-map-completed
   [junit4]   2> 1102019 INFO  (TEST-OverseerTest.testOverseerStatsReset-seed#[6052F78A6263A4C7]) [    ] o.a.s.c.c.SolrZkClient makePath: /overseer/collection-queue-work
   [junit4]   2> 1102021 INFO  (TEST-OverseerTest.testOverseerStatsReset-seed#[6052F78A6263A4C7]) [    ] o.a.s.c.OverseerAutoReplicaFailoverThread Starting OverseerAutoReplicaFailoverThread autoReplicaFailoverWorkLoopDelay=10000 autoReplicaFailoverWaitAfterExpiration=30000 autoReplicaFailoverBadNodeExpiration=60000
   [junit4]   2> 1102026 INFO  (OverseerStateUpdate-95837493066661890-127.0.0.1:35403_solr-n_0000000000) [    ] o.a.s.c.Overseer Starting to work on the main queue
   [junit4]   2> 1102027 INFO  (OverseerStateUpdate-95837493066661890-127.0.0.1:35403_solr-n_0000000000) [    ] o.a.s.c.c.ZkStateReader Updated live nodes from ZooKeeper... (1) -> (1)
   [junit4]   2> 1102029 INFO  (OverseerCollectionConfigSetProcessor-95837493066661890-127.0.0.1:35403_solr-n_0000000000) [    ] o.a.s.c.OverseerTaskProcessor Process current queue of overseer operations
   [junit4]   2> 1102041 INFO  (OverseerStateUpdate-95837493066661890-127.0.0.1:35403_solr-n_0000000000) [    ] o.a.s.c.Overseer processMessage: queueSize: 1, message = {
   [junit4]   2>   "operation":"state",
   [junit4]   2>   "state":"active",
   [junit4]   2>   "node_name":"node1",
   [junit4]   2>   "core":"core1",
   [junit4]   2>   "core_node_name":"core_node1",
   [junit4]   2>   "collection":"collection1",
   [junit4]   2>   "numShards":"1",
   [junit4]   2>   "base_url":"http://node1/solr/"} current state version: 0
   [junit4]   2> 1102041 INFO  (OverseerStateUpdate-95837493066661890-127.0.0.1:35403_solr-n_0000000000) [    ] o.a.s.c.o.ReplicaMutator Update state numShards=1 message={
   [junit4]   2>   "operation":"state",
   [junit4]   2>   "state":"active",
   [junit4]   2>   "node_name":"node1",
   [junit4]   2>   "core":"core1",
   [junit4]   2>   "core_node_name":"core_node1",
   [junit4]   2>   "collection":"collection1",
   [junit4]   2>   "numShards":"1",
   [junit4]   2>   "base_url":"http://node1/solr/"}
   [junit4]   2> 1102041 INFO  (OverseerStateUpdate-95837493066661890-127.0.0.1:35403_solr-n_0000000000) [    ] o.a.s.c.o.ClusterStateMutator building a new cName: collection1
   [junit4]   2> 1102041 INFO  (OverseerStateUpdate-95837493066661890-127.0.0.1:35403_solr-n_0000000000) [    ] o.a.s.c.o.ReplicaMutator Assigning new node to shard shard=shard1
   [junit4]   2> 1102042 INFO  (zkCallback-1096-thread-1) [    ] o.a.s.c.c.ZkStateReader A cluster state change: [WatchedEvent state:SyncConnected type:NodeDataChanged path:/clusterstate.json], has occurred - updating... (live nodes size: [1])
   [junit4]   2> 1102042 INFO  (zkCallback-1097-thread-1) [    ] o.a.s.c.c.ZkStateReader A cluster state change: [WatchedEvent state:SyncConnected type:NodeDataChanged path:/clusterstate.json], has occurred - updating... (live nodes size: [1])
   [junit4]   2> 1102553 INFO  (TEST-OverseerTest.testOverseerStatsReset-seed#[6052F78A6263A4C7]) [    ] o.a.s.c.c.SolrZkClient makePath: /collections/collection1/leader_elect/shard1/election
   [junit4]   2> 1102557 INFO  (zkCallback-1097-thread-1) [    ] o.a.s.c.c.ZkStateReader A collections change: [WatchedEvent state:SyncConnected type:NodeChildrenChanged path:/collections], has occurred - updating...
   [junit4]   2> 1102557 INFO  (zkCallback-1096-thread-1) [    ] o.a.s.c.c.ZkStateReader A collections change: [WatchedEvent state:SyncConnected type:NodeChildrenChanged path:/collections], has occurred - updating...
   [junit4]   2> 1102558 INFO  (TEST-OverseerTest.testOverseerStatsReset-seed#[6052F78A6263A4C7]) [    ] o.a.s.c.LeaderElector Joined leadership election with path: /collections/collection1/leader_elect/shard1/election/95837493066661891-node1_core1-n_0000000000
   [junit4]   2> 1102559 INFO  (TEST-OverseerTest.testOverseerStatsReset-seed#[6052F78A6263A4C7]) [    ] o.a.s.c.c.SolrZkClient makePath: /collections/collection1/leaders/shard1
   [junit4]   2> 1102559 INFO  (TEST-OverseerTest.testOverseerStatsReset-seed#[6052F78A6263A4C7]) [    ] o.a.s.c.ShardLeaderElectionContextBase Creating leader registration node /collections/collection1/leaders/shard1/leader after winning as /collections/collection1/leader_elect/shard1/election/95837493066661891-node1_core1-n_0000000000
   [junit4]   2> 1102561 INFO  (TEST-OverseerTest.testOverseerStatsReset-seed#[6052F78A6263A4C7]) [    ] o.a.s.c.Overseer Overseer (id=95837493066661890-127.0.0.1:35403_solr-n_0000000000) closing
   [junit4]   2> 1102561 INFO  (TEST-OverseerTest.testOverseerStatsReset-seed#[6052F78A6263A4C7]) [    ] o.a.s.c.ElectionContext Canceling election /overseer_elect/election/95837493066661890-127.0.0.1:35403_solr-n_0000000000
   [junit4]   2> 1102562 INFO  (OverseerStateUpdate-95837493066661890-127.0.0.1:35403_solr-n_0000000000) [    ] o.a.s.c.Overseer Overseer Loop exiting : 127.0.0.1:35403_solr
   [junit4]   2> 1102562 INFO  (TEST-OverseerTest.testOverseerStatsReset-seed#[6052F78A6263A4C7]) [    ] o.a.s.c.LeaderElector Joined leadership election with path: /overseer_elect/election/95837493066661890-127.0.0.1:35403_solr-n_0000000001
   [junit4]   2> 1102563 INFO  (TEST-OverseerTest.testOverseerStatsReset-seed#[6052F78A6263A4C7]) [    ] o.a.s.c.OverseerElectionContext I am going to be the leader 127.0.0.1:35403_solr
   [junit4]   2> 1102563 INFO  (TEST-OverseerTest.testOverseerStatsReset-seed#[6052F78A6263A4C7]) [    ] o.a.s.c.c.SolrZkClient makePath: /overseer_elect/leader
   [junit4]   2> 1102563 ERROR (TEST-OverseerTest.testOverseerStatsReset-seed#[6052F78A6263A4C7]) [    ] o.a.s.c.LeaderElector node exists
   [junit4]   2> org.apache.zookeeper.KeeperException$NodeExistsException: KeeperErrorCode = NodeExists for /overseer_elect/leader
   [junit4]   2> 	at org.apache.zookeeper.KeeperException.create(KeeperException.java:119)
   [junit4]   2> 	at org.apache.zookeeper.KeeperException.create(KeeperException.java:51)
   [junit4]   2> 	at org.apache.zookeeper.ZooKeeper.create(ZooKeeper.java:783)
   [junit4]   2> 	at org.apache.solr.common.cloud.SolrZkClient$10.execute(SolrZkClient.java:503)
   [junit4]   2> 	at org.apache.solr.common.cloud.ZkCmdExecutor.retryOperation(ZkCmdExecutor.java:60)
   [junit4]   2> 	at org.apache.solr.common.cloud.SolrZkClient.makePath(SolrZkClient.java:500)
   [junit4]   2> 	at org.apache.solr.common.cloud.SolrZkClient.makePath(SolrZkClient.java:458)
   [junit4]   2> 	at org.apache.solr.common.cloud.SolrZkClient.makePath(SolrZkClient.java:445)
   [junit4]   2> 	at org.apache.solr.cloud.OverseerElectionContext.runLeaderProcess(ElectionContext.java:729)
   [junit4]   2> 	at org.apache.solr.cloud.LeaderElector.runIamLeaderProcess(LeaderElector.java:170)
   [junit4]   2> 	at org.apache.solr.cloud.LeaderElector.checkIfIamLeader(LeaderElector.java:135)
   [junit4]   2> 	at org.apache.solr.cloud.LeaderElector.joinElection(LeaderElector.java:307)
   [junit4]   2> 	at org.apache.solr.cloud.LeaderElector.joinElection(LeaderElector.java:216)
   [junit4]   2> 	at org.apache.solr.cloud.OverseerTest.testOverseerStatsReset(OverseerTest.java:754)
   [junit4]   2> 	at jdk.internal.reflect.NativeMethodAccessorImpl.invoke0(java.base@9-ea/Native Method)
   [junit4]   2> 	at jdk.internal.reflect.NativeMethodAccessorImpl.invoke(java.base@9-ea/NativeMethodAccessorImpl.java:62)
   [junit4]   2> 	at jdk.internal.reflect.DelegatingMethodAccessorImpl.invoke(java.base@9-ea/DelegatingMethodAccessorImpl.java:43)
   [junit4]   2> 	at java.lang.reflect.Method.invoke(java.base@9-ea/Method.java:531)
   [junit4]   2> 	at com.carrotsearch.randomizedtesting.RandomizedRunner.invoke(RandomizedRunner.java:1764)
   [junit4]   2> 	at com.carrotsearch.randomizedtesting.RandomizedRunner$8.evaluate(RandomizedRunner.java:871)
   [junit4]   2> 	at com.carrotsearch.randomizedtesting.RandomizedRunner$9.evaluate(RandomizedRunner.java:907)
   [junit4]   2> 	at com.carrotsearch.randomizedtesting.RandomizedRunner$10.evaluate(RandomizedRunner.java:921)
   [junit4]   2> 	at com.carrotsearch.randomizedtesting.rules.SystemPropertiesRestoreRule$1.evaluate(SystemPropertiesRestoreRule.java:57)
   [junit4]   2> 	at org.apache.lucene.util.TestRuleSetupTeardownChained$1.evaluate(TestRuleSetupTeardownChained.java:49)
   [junit4]   2> 	at org.apache.lucene.util.AbstractBeforeAfterRule$1.evaluate(AbstractBeforeAfterRule.java:45)
   [junit4]   2> 	at org.apache.lucene.util.TestRuleThreadAndTestName$1.evaluate(TestRuleThreadAndTestName.java:48)
   [junit4]   2> 	at org.apache.lucene.util.TestRuleIgnoreAfterMaxFailures$1.evaluate(TestRuleIgnoreAfterMaxFailures.java:64)
   [junit4]   2> 	at org.apache.lucene.util.TestRuleMarkFailure$1.evaluate(TestRuleMarkFailure.java:47)
   [junit4]   2> 	at com.carrotsearch.randomizedtesting.rules.StatementAdapter.evaluate(StatementAdapter.java:36)
   [junit4]   2> 	at com.carrotsearch.randomizedtesting.ThreadLeakControl$StatementRunner.run(ThreadLeakControl.java:367)
   [junit4]   2> 	at com.carrotsearch.randomizedtesting.ThreadLeakControl.forkTimeoutingTask(ThreadLeakControl.java:809)
   [junit4]   2> 	at com.carrotsearch.randomizedtesting.ThreadLeakControl$3.evaluate(ThreadLeakControl.java:460)
   [junit4]   2> 	at com.carrotsearch.randomizedtesting.RandomizedRunner.runSingleTest(RandomizedRunner.java:880)
   [junit4]   2> 	at com.carrotsearch.randomizedtesting.RandomizedRunner$5.evaluate(RandomizedRunner.java:781)
   [junit4]   2> 	at com.carrotsearch.randomizedtesting.RandomizedRunner$6.evaluate(RandomizedRunner.java:816)
   [junit4]   2> 	at com.carrotsearch.randomizedtesting.RandomizedRunner$7.evaluate(RandomizedRunner.java:827)
   [junit4]   2> 	at com.carrotsearch.randomizedtesting.rules.StatementAdapter.evaluate(StatementAdapter.java:36)
   [junit4]   2> 	at com.carrotsearch.randomizedtesting.rules.SystemPropertiesRestoreRule$1.evaluate(SystemPropertiesRestoreRule.java:57)
   [junit4]   2> 	at org.apache.lucene.util.AbstractBeforeAfterRule$1.evaluate(AbstractBeforeAfterRule.java:45)
   [junit4]   2> 	at com.carrotsearch.randomizedtesting.rules.StatementAdapter.evaluate(StatementAdapter.java:36)
   [junit4]   2> 	at org.apache.lucene.util.TestRuleStoreClassName$1.evaluate(TestRuleStoreClassName.java:41)
   [junit4]   2> 	at com.carrotsearch.randomizedtesting.rules.NoShadowingOrOverridesOnMethodsRule$1.evaluate(NoShadowingOrOverridesOnMethodsRule.java:40)
   [junit4]   2> 	at com.carrotsearch.randomizedtesting.rules.NoShadowingOrOverridesOnMethodsRule$1.evaluate(NoShadowingOrOverridesOnMethodsRule.java:40)
   [junit4]   2> 	at com.carrotsearch.randomizedtesting.rules.StatementAdapter.evaluate(StatementAdapter.java:36)
   [junit4]   2> 	at com.carrotsearch.randomizedtesting.rules.StatementAdapter.evaluate(StatementAdapter.java:36)
   [junit4]   2> 	at com.carrotsearch.randomizedtesting.rules.StatementAdapter.evaluate(StatementAdapter.java:36)
   [junit4]   2> 	at org.apache.lucene.util.TestRuleAssertionsRequired$1.evaluate(TestRuleAssertionsRequired.java:53)
   [junit4]   2> 	at org.apache.lucene.util.TestRuleMarkFailure$1.evaluate(TestRuleMarkFailure.java:47)
   [junit4]   2> 	at org.apache.lucene.util.TestRuleIgnoreAfterMaxFailures$1.evaluate(TestRuleIgnoreAfterMaxFailures.java:64)
   [junit4]   2> 	at org.apache.lucene.util.TestRuleIgnoreTestSuites$1.evaluate(TestRuleIgnoreTestSuites.java:54)
   [junit4]   2> 	at com.carrotsearch.randomizedtesting.rules.StatementAdapter.evaluate(StatementAdapter.java:36)
   [junit4]   2> 	at com.carrotsearch.randomizedtesting.ThreadLeakControl$StatementRunner.run(ThreadLeakControl.java:367)
   [junit4]   2> 	at java.lang.Thread.run(java.base@9-ea/Thread.java:804)
   [junit4]   2> 1102566 INFO  (TEST-OverseerTest.testOverseerStatsReset-seed#[6052F78A6263A4C7]) [    ] o.a.s.c.ElectionContext Canceling election /overseer_elect/election/95837493066661890-127.0.0.1:35403_solr-n_0000000001
   [junit4]   2> 1102567 INFO  (OverseerExitThread) [    ] o.a.s.c.Overseer I'm exiting , but I'm still the leader
   [junit4]   2> 1102575 INFO  (TEST-OverseerTest.testOverseerStatsReset-seed#[6052F78A6263A4C7]) [    ] o.a.s.c.LeaderElector Joined leadership election with path: /overseer_elect/election/95837493066661890-127.0.0.1:35403_solr-n_0000000002
   [junit4]   2> 1102576 INFO  (TEST-OverseerTest.testOverseerStatsReset-seed#[6052F78A6263A4C7]) [    ] o.a.s.c.OverseerElectionContext I am going to be the leader 127.0.0.1:35403_solr
   [junit4]   2> 1102576 INFO  (TEST-OverseerTest.testOverseerStatsReset-seed#[6052F78A6263A4C7]) [    ] o.a.s.c.c.SolrZkClient makePath: /overseer_elect/leader
   [junit4]   2> 1102576 INFO  (TEST-OverseerTest.testOverseerStatsReset-seed#[6052F78A6263A4C7]) [    ] o.a.s.c.Overseer Overseer (id=95837493066661890-127.0.0.1:35403_solr-n_0000000002) starting
   [junit4]   2> 1102581 INFO  (TEST-OverseerTest.testOverseerStatsReset-seed#[6052F78A6263A4C7]) [    ] o.a.s.c.OverseerAutoReplicaFailoverThread Starting OverseerAutoReplicaFailoverThread autoReplicaFailoverWorkLoopDelay=10000 autoReplicaFailoverWaitAfterExpiration=30000 autoReplicaFailoverBadNodeExpiration=60000
   [junit4]   2> 1102581 INFO  (OverseerCollectionConfigSetProcessor-95837493066661890-127.0.0.1:35403_solr-n_0000000002) [    ] o.a.s.c.OverseerTaskProcessor Process current queue of overseer operations
   [junit4]   2> 1102581 INFO  (OverseerStateUpdate-95837493066661890-127.0.0.1:35403_solr-n_0000000002) [    ] o.a.s.c.Overseer Starting to work on the main queue
   [junit4]   2> 1102581 INFO  (TEST-OverseerTest.testOverseerStatsReset-seed#[6052F78A6263A4C7]) [    ] o.a.s.c.ElectionContext Canceling election /collections/collection1/leader_elect/shard1/election/95837493066661891-node1_core1-n_0000000000
   [junit4]   2> 1102582 INFO  (TEST-OverseerTest.testOverseerStatsReset-seed#[6052F78A6263A4C7]) [    ] o.a.s.c.ShardLeaderElectionContextBase Removing leader registration node on cancel: /collections/collection1/leaders/shard1/leader 1
   [junit4]   2> 1102582 INFO  (zkCallback-1097-thread-1) [    ] o.a.s.c.c.ZkStateReader A live node change: [WatchedEvent state:SyncConnected type:NodeChildrenChanged path:/live_nodes], has occurred - updating... (live nodes size: [1])
   [junit4]   2> 1102582 INFO  (zkCallback-1096-thread-1) [    ] o.a.s.c.c.ZkStateReader A live node change: [WatchedEvent state:SyncConnected type:NodeChildrenChanged path:/live_nodes], has occurred - updating... (live nodes size: [1])
   [junit4]   2> 1102583 INFO  (OverseerStateUpdate-95837493066661890-127.0.0.1:35403_solr-n_0000000002) [    ] o.a.s.c.c.ZkStateReader Updated live nodes from ZooKeeper... (1) -> (0)
   [junit4]   2> 1102584 INFO  (OverseerStateUpdate-95837493066661890-127.0.0.1:35403_solr-n_0000000002) [    ] o.a.s.c.Overseer processMessage: queueSize: 1, message = {
   [junit4]   2>   "operation":"leader",
   [junit4]   2>   "shard":"shard1",
   [junit4]   2>   "collection":"collection1",
   [junit4]   2>   "base_url":"http://node1/solr/",
   [junit4]   2>   "core":"core1",
   [junit4]   2>   "state":"active"} current state version: 1
   [junit4]   2> 1102584 INFO  (zkCallback-1096-thread-2) [    ] o.a.s.c.c.ZkStateReader A cluster state change: [WatchedEvent state:SyncConnected type:NodeDataChanged path:/clusterstate.json], has occurred - updating... (live nodes size: [0])
   [junit4]   2> 1104083 WARN  (zkCallback-1097-thread-1) [    ] o.a.s.c.c.ZkStateReader ZooKeeper watch triggered, but Solr cannot talk to ZK: [KeeperErrorCode = Session expired for /live_nodes]
   [junit4]   2> 1104085 INFO  (TEST-OverseerTest.testOverseerStatsReset-seed#[6052F78A6263A4C7]) [    ] o.a.s.c.ZkTestServer connecting to 127.0.0.1:35403 35403
   [junit4]   2> 1104150 INFO  (Thread-2312) [    ] o.a.s.c.ZkTestServer connecting to 127.0.0.1:35403 35403
   [junit4]   2> 1104152 WARN  (Thread-2312) [    ] o.a.s.c.ZkTestServer Watch limit violations: 
   [junit4]   2> Maximum concurrent create/delete watches above limit:
   [junit4]   2> 
   [junit4]   2> 	2	/solr/aliases.json
   [junit4]   2> 
   [junit4]   2> Maximum concurrent data watches above limit:
   [junit4]   2> 
   [junit4]   2> 	2	/solr/clusterstate.json
   [junit4]   2> 
   [junit4]   2> Maximum concurrent children watches above limit:
   [junit4]   2> 
   [junit4]   2> 	2	/solr/live_nodes
   [junit4]   2> 	2	/solr/collections
   [junit4]   2> 	2	/solr/overseer/queue-work
   [junit4]   2> 	2	/solr/overseer/collection-queue-work
   [junit4]   2> 
   [junit4]   2> 1104152 INFO  (TEST-OverseerTest.testOverseerStatsReset-seed#[6052F78A6263A4C7]) [    ] o.a.s.SolrTestCaseJ4 ###Ending testOverseerStatsReset
   [junit4]   2> 1104152 INFO  (TEST-OverseerTest.testOverseerStatsReset-seed#[6052F78A6263A4C7]) [    ] o.a.s.c.Overseer Overseer (id=95837493066661890-127.0.0.1:35403_solr-n_0000000002) closing
   [junit4]   2> 1104152 INFO  (OverseerStateUpdate-95837493066661890-127.0.0.1:35403_solr-n_0000000002) [    ] o.a.s.c.Overseer Overseer Loop exiting : 127.0.0.1:35403_solr
   [junit4]   2> 1104153 ERROR (OverseerExitThread) [    ] o.a.s.c.Overseer could not read the data
   [junit4]   2> org.apache.zookeeper.KeeperException$SessionExpiredException: KeeperErrorCode = Session expired for /overseer_elect/leader
   [junit4]   2> 	at org.apache.zookeeper.KeeperException.create(KeeperException.java:127)
   [junit4]   2> 	at org.apache.zookeeper.KeeperException.create(KeeperException.java:51)
   [junit4]   2> 	at org.apache.zookeeper.ZooKeeper.getData(ZooKeeper.java:1155)
   [junit4]   2> 	at org.apache.solr.common.cloud.SolrZkClient$7.execute(SolrZkClient.java:348)
   [junit4]   2> 	at org.apache.solr.common.cloud.SolrZkClient$7.execute(SolrZkClient.java:345)
   [junit4]   2> 	at org.apache.solr.common.cloud.ZkCmdExecutor.retryOperation(ZkCmdExecutor.java:60)
   [junit4]   2> 	at org.apache.solr.common.cloud.SolrZkClient.getData(SolrZkClient.java:345)
   [junit4]   2> 	at org.apache.solr.cloud.Overseer$ClusterStateUpdater.checkIfIamStillLeader(Overseer.java:309)
   [junit4]   2> 	at org.apache.solr.cloud.Overseer$ClusterStateUpdater.access$300(Overseer.java:89)
   [junit4]   2> 	at org.apache.solr.cloud.Overseer$ClusterStateUpdater$2.run(Overseer.java:268)
   [junit4]   2> 1104155 INFO  (TEST-OverseerTest.testOverseerFailure-seed#[6052F78A6263A4C7]) [    ] o.a.s.SolrTestCaseJ4 ###Starting testOverseerFailure
   [junit4]   2> 1104156 INFO  (TEST-OverseerTest.testOverseerFailure-seed#[6052F78A6263A4C7]) [    ] o.a.s.c.ZkTestServer STARTING ZK TEST SERVER
   [junit4]   2> 1104156 INFO  (Thread-2313) [    ] o.a.s.c.ZkTestServer client port:0.0.0.0/0.0.0.0:0
   [junit4]   2> 1104156 INFO  (Thread-2313) [    ] o.a.s.c.ZkTestServer Starting server
   [junit4]   2> 1104256 INFO  (TEST-OverseerTest.testOverseerFailure-seed#[6052F78A6263A4C7]) [    ] o.a.s.c.ZkTestServer start zk server on port:40586
   [junit4]   2> 1104256 INFO  (TEST-OverseerTest.testOverseerFailure-seed#[6052F78A6263A4C7]) [    ] o.a.s.c.c.SolrZkClient Using default ZkCredentialsProvider
   [junit4]   2> 1104278 INFO  (TEST-OverseerTest.testOverseerFailure-seed#[6052F78A6263A4C7]) [    ] o.a.s.c.c.ConnectionManager Waiting for client to connect to ZooKeeper
   [junit4]   2> 1104292 INFO  (zkCallback-1100-thread-1) [    ] o.a.s.c.c.ConnectionManager Watcher org.apache.solr.common.cloud.ConnectionManager@56b50b name:ZooKeeperConnection Watcher:127.0.0.1:40586 got event WatchedEvent state:SyncConnected type:None path:null path:null type:None
   [junit4]   2> 1104292 INFO  (TEST-OverseerTest.testOverseerFailure-seed#[6052F78A6263A4C7]) [    ] o.a.s.c.c.ConnectionManager Client is connected to ZooKeeper
   [junit4]   2> 1104293 INFO  (TEST-OverseerTest.testOverseerFailure-seed#[6052F78A6263A4C7]) [    ] o.a.s.c.c.SolrZkClient Using default ZkACLProvider
   [junit4]   2> 1104294 INFO  (TEST-OverseerTest.testOverseerFailure-seed#[6052F78A6263A4C7]) [    ] o.a.s.c.c.SolrZkClient Using default ZkCredentialsProvider
   [junit4]   2> 1104296 INFO  (TEST-OverseerTest.testOverseerFailure-seed#[6052F78A6263A4C7]) [    ] o.a.s.c.c.ConnectionManager Waiting for client to connect to ZooKeeper
   [junit4]   2> 1104305 INFO  (zkCallback-1101-thread-1) [    ] o.a.s.c.c.ConnectionManager Watcher org.apache.solr.common.cloud.ConnectionManager@f9d99b name:ZooKeeperConnection Watcher:127.0.0.1:40586 got event WatchedEvent state:SyncConnected type:None path:null path:null type:None
   [junit4]   2> 1104306 INFO  (TEST-OverseerTest.testOverseerFailure-seed#[6052F78A6263A4C7]) [    ] o.a.s.c.c.ConnectionManager Client is connected to ZooKeeper
   [junit4]   2> 1104306 INFO  (TEST-OverseerTest.testOverseerFailure-seed#[6052F78A6263A4C7]) [    ] o.a.s.c.c.SolrZkClient Using default ZkACLProvider
   [junit4]   2> 1104306 INFO  (TEST-OverseerTest.testOverseerFailure-seed#[6052F78A6263A4C7]) [    ] o.a.s.c.c.SolrZkClient makePath: /solr
   [junit4]   2> 1104317 INFO  (TEST-OverseerTest.testOverseerFailure-seed#[6052F78A6263A4C7]) [    ] o.a.s.c.c.SolrZkClient Using default ZkCredentialsProvider
   [junit4]   2> 1104321 INFO  (TEST-OverseerTest.testOverseerFailure-seed#[6052F78A6263A4C7]) [    ] o.a.s.c.c.ConnectionManager Waiting for client to connect to ZooKeeper
   [junit4]   2> 1104321 INFO  (zkCallback-1102-thread-1) [    ] o.a.s.c.c.ConnectionManager Watcher org.apache.solr.common.cloud.ConnectionManager@54be76 name:ZooKeeperConnection Watcher:127.0.0.1:40586/solr got event WatchedEvent state:SyncConnected type:None path:null path:null type:None
   [junit4]   2> 1104321 INFO  (TEST-OverseerTest.testOverseerFailure-seed#[6052F78A6263A4C7]) [    ] o.a.s.c.c.ConnectionManager Client is connected to ZooKeeper
   [junit4]   2> 1104321 INFO  (TEST-OverseerTest.testOverseerFailure-seed#[6052F78A6263A4C7]) [    ] o.a.s.c.c.SolrZkClient Using default ZkACLProvider
   [junit4]   2> 1104322 INFO  (TEST-OverseerTest.testOverseerFailure-seed#[6052F78A6263A4C7]) [    ] o.a.s.c.c.SolrZkClient makePath: /live_nodes
   [junit4]   2> 1104323 INFO  (TEST-OverseerTest.testOverseerFailure-seed#[6052F78A6263A4C7]) [    ] o.a.s.c.c.SolrZkClient makePath: /collections
   [junit4]   2> 1104323 INFO  (TEST-OverseerTest.testOverseerFailure-seed#[6052F78A6263A4C7]) [    ] o.a.s.c.c.SolrZkClient makePath: /aliases.json
   [junit4]   2> 1104324 INFO  (TEST-OverseerTest.testOverseerFailure-seed#[6052F78A6263A4C7]) [    ] o.a.s.c.c.SolrZkClient makePath: /clusterstate.json
   [junit4]   2> 1104325 INFO  (TEST-OverseerTest.testOverseerFailure-seed#[6052F78A6263A4C7]) [    ] o.a.s.c.c.SolrZkClient makePath: /security.json
   [junit4]   2> 1104325 INFO  (TEST-OverseerTest.testOverseerFailure-seed#[6052F78A6263A4C7]) [    ] o.a.s.c.c.ZkStateReader Updating cluster state from ZooKeeper... 
   [junit4]   2> 1104326 INFO  (TEST-OverseerTest.testOverseerFailure-seed#[6052F78A6263A4C7]) [    ] o.a.s.c.c.ZkStateReader Updated live nodes from ZooKeeper... (0) -> (0)
   [junit4]   2> 1104326 INFO  (TEST-OverseerTest.testOverseerFailure-seed#[6052F78A6263A4C7]) [    ] o.a.s.c.c.SolrZkClient Using default ZkCredentialsProvider
   [junit4]   2> 1104329 INFO  (TEST-OverseerTest.testOverseerFailure-seed#[6052F78A6263A4C7]) [    ] o.a.s.c.c.ConnectionManager Waiting for client to connect to ZooKeeper
   [

[...truncated too long message...]

aderElectionContextBase No version found for ephemeral leader parent node, won't remove previous leader registration.
   [junit4]   2> 1175925 INFO  (TEST-OverseerTest.testShardAssignment-seed#[6052F78A6263A4C7]) [    ] o.a.s.c.ElectionContext Canceling election /collections/collection1/leader_elect/shard3/election/95837497717948420-127.0.0.1_core5-n_0000000001
   [junit4]   2> 1175925 INFO  (TEST-OverseerTest.testShardAssignment-seed#[6052F78A6263A4C7]) [    ] o.a.s.c.ShardLeaderElectionContextBase No version found for ephemeral leader parent node, won't remove previous leader registration.
   [junit4]   2> 1175925 INFO  (TEST-OverseerTest.testShardAssignment-seed#[6052F78A6263A4C7]) [    ] o.a.s.c.ElectionContext Canceling election /collections/collection1/leader_elect/shard2/election/95837497717948420-127.0.0.1_core4-n_0000000001
   [junit4]   2> 1175925 INFO  (TEST-OverseerTest.testShardAssignment-seed#[6052F78A6263A4C7]) [    ] o.a.s.c.ShardLeaderElectionContextBase No version found for ephemeral leader parent node, won't remove previous leader registration.
   [junit4]   2> 1175925 INFO  (TEST-OverseerTest.testShardAssignment-seed#[6052F78A6263A4C7]) [    ] o.a.s.c.ElectionContext Canceling election /collections/collection1/leader_elect/shard1/election/95837497717948420-127.0.0.1_core3-n_0000000000
   [junit4]   2> 1175925 INFO  (TEST-OverseerTest.testShardAssignment-seed#[6052F78A6263A4C7]) [    ] o.a.s.c.ShardLeaderElectionContextBase Removing leader registration node on cancel: /collections/collection1/leaders/shard1/leader 1
   [junit4]   2> 1175925 WARN  (zkCallback-1245-thread-1) [    ] o.a.s.c.LeaderElector Our node is no longer in line to be leader
   [junit4]   2> 1175926 INFO  (TEST-OverseerTest.testShardAssignment-seed#[6052F78A6263A4C7]) [    ] o.a.s.c.ElectionContext Canceling election /collections/collection1/leader_elect/shard3/election/95837497717948420-127.0.0.1_core2-n_0000000000
   [junit4]   2> 1175926 INFO  (TEST-OverseerTest.testShardAssignment-seed#[6052F78A6263A4C7]) [    ] o.a.s.c.ShardLeaderElectionContextBase Removing leader registration node on cancel: /collections/collection1/leaders/shard3/leader 1
   [junit4]   2> 1175926 WARN  (zkCallback-1245-thread-1) [    ] o.a.s.c.LeaderElector Our node is no longer in line to be leader
   [junit4]   2> 1175926 INFO  (TEST-OverseerTest.testShardAssignment-seed#[6052F78A6263A4C7]) [    ] o.a.s.c.ElectionContext Canceling election /collections/collection1/leader_elect/shard2/election/95837497717948420-127.0.0.1_core1-n_0000000000
   [junit4]   2> 1175926 INFO  (TEST-OverseerTest.testShardAssignment-seed#[6052F78A6263A4C7]) [    ] o.a.s.c.ShardLeaderElectionContextBase Removing leader registration node on cancel: /collections/collection1/leaders/shard2/leader 1
   [junit4]   2> 1175926 WARN  (zkCallback-1245-thread-1) [    ] o.a.s.c.LeaderElector Our node is no longer in line to be leader
   [junit4]   2> 1175926 INFO  (zkCallback-1245-thread-1) [    ] o.a.s.c.c.ZkStateReader A live node change: [WatchedEvent state:SyncConnected type:NodeChildrenChanged path:/live_nodes], has occurred - updating... (live nodes size: [1])
   [junit4]   2> 1175926 INFO  (zkCallback-1242-thread-2) [    ] o.a.s.c.c.ZkStateReader A live node change: [WatchedEvent state:SyncConnected type:NodeChildrenChanged path:/live_nodes], has occurred - updating... (live nodes size: [1])
   [junit4]   2> 1175927 INFO  (zkCallback-1242-thread-2) [    ] o.a.s.c.c.ZkStateReader Updated live nodes from ZooKeeper... (1) -> (0)
   [junit4]   2> 1177427 WARN  (zkCallback-1245-thread-1) [    ] o.a.s.c.c.ZkStateReader ZooKeeper watch triggered, but Solr cannot talk to ZK: [KeeperErrorCode = Session expired for /live_nodes]
   [junit4]   2> 1177428 INFO  (TEST-OverseerTest.testShardAssignment-seed#[6052F78A6263A4C7]) [    ] o.a.s.c.ZkTestServer connecting to 127.0.0.1:36000 36000
   [junit4]   2> 1177444 INFO  (Thread-2324) [    ] o.a.s.c.ZkTestServer connecting to 127.0.0.1:36000 36000
   [junit4]   2> 1177446 WARN  (Thread-2324) [    ] o.a.s.c.ZkTestServer Watch limit violations: 
   [junit4]   2> Maximum concurrent create/delete watches above limit:
   [junit4]   2> 
   [junit4]   2> 	3	/solr/aliases.json
   [junit4]   2> 
   [junit4]   2> Maximum concurrent data watches above limit:
   [junit4]   2> 
   [junit4]   2> 	3	/solr/clusterstate.json
   [junit4]   2> 
   [junit4]   2> Maximum concurrent children watches above limit:
   [junit4]   2> 
   [junit4]   2> 	3	/solr/live_nodes
   [junit4]   2> 	3	/solr/collections
   [junit4]   2> 
   [junit4]   2> 1177446 INFO  (TEST-OverseerTest.testShardAssignment-seed#[6052F78A6263A4C7]) [    ] o.a.s.SolrTestCaseJ4 ###Ending testShardAssignment
   [junit4]   2> 1177446 INFO  (TEST-OverseerTest.testShardAssignment-seed#[6052F78A6263A4C7]) [    ] o.a.s.c.Overseer Overseer (id=95837497717948419-127.0.0.1:36000_solr-n_0000000000) closing
   [junit4]   2> 1177446 INFO  (OverseerStateUpdate-95837497717948419-127.0.0.1:36000_solr-n_0000000000) [    ] o.a.s.c.Overseer Overseer Loop exiting : 127.0.0.1:36000_solr
   [junit4]   2> 1177446 ERROR (OverseerExitThread) [    ] o.a.s.c.Overseer could not read the data
   [junit4]   2> org.apache.zookeeper.KeeperException$SessionExpiredException: KeeperErrorCode = Session expired for /overseer_elect/leader
   [junit4]   2> 	at org.apache.zookeeper.KeeperException.create(KeeperException.java:127)
   [junit4]   2> 	at org.apache.zookeeper.KeeperException.create(KeeperException.java:51)
   [junit4]   2> 	at org.apache.zookeeper.ZooKeeper.getData(ZooKeeper.java:1155)
   [junit4]   2> 	at org.apache.solr.common.cloud.SolrZkClient$7.execute(SolrZkClient.java:348)
   [junit4]   2> 	at org.apache.solr.common.cloud.SolrZkClient$7.execute(SolrZkClient.java:345)
   [junit4]   2> 	at org.apache.solr.common.cloud.ZkCmdExecutor.retryOperation(ZkCmdExecutor.java:60)
   [junit4]   2> 	at org.apache.solr.common.cloud.SolrZkClient.getData(SolrZkClient.java:345)
   [junit4]   2> 	at org.apache.solr.cloud.Overseer$ClusterStateUpdater.checkIfIamStillLeader(Overseer.java:309)
   [junit4]   2> 	at org.apache.solr.cloud.Overseer$ClusterStateUpdater.access$300(Overseer.java:89)
   [junit4]   2> 	at org.apache.solr.cloud.Overseer$ClusterStateUpdater$2.run(Overseer.java:268)
   [junit4]   2> 1180447 INFO  (SUITE-OverseerTest-seed#[6052F78A6263A4C7]-worker) [    ] o.a.s.SolrTestCaseJ4 ###deleteCore
   [junit4]   2> NOTE: leaving temporary files on disk at: /home/jenkins/workspace/Lucene-Solr-master-Linux/solr/build/solr-core/test/J2/temp/solr.cloud.OverseerTest_6052F78A6263A4C7-001
   [junit4]   2> NOTE: test params are: codec=Asserting(Lucene60), sim=RandomSimilarity(queryNorm=true,coord=no): {}, locale=nl-AW, timezone=Europe/Tiraspol
   [junit4]   2> NOTE: Linux 4.2.0-35-generic i386/Oracle Corporation 9-ea (32-bit)/cpus=12,threads=1,free=223722016,total=320864256
   [junit4]   2> NOTE: All tests run in this JVM: [ShardSplitTest, TestPerFieldSimilarityWithDefaultOverride, TestPHPSerializedResponseWriter, TestFreeTextSuggestions, CurrencyFieldXmlFileTest, TestJsonRequest, TestConfigOverlay, DistributedFacetPivotSmallAdvancedTest, FieldMutatingUpdateProcessorTest, TestBlobHandler, TestUtils, DeleteShardTest, CdcrUpdateLogTest, TestJmxIntegration, CleanupOldIndexTest, SliceStateTest, TestPivotHelperCode, TestSchemaVersionResource, TestRequestStatusCollectionAPI, XmlUpdateRequestHandlerTest, BlockDirectoryTest, LeaderElectionTest, StatelessScriptUpdateProcessorFactoryTest, SuggesterTest, RollingRestartTest, AutoCommitTest, TestManagedResourceStorage, MigrateRouteKeyTest, SpatialRPTFieldTypeTest, TestStandardQParsers, LukeRequestHandlerTest, RemoteQueryErrorTest, TestCoreDiscovery, NoCacheHeaderTest, DocValuesMultiTest, BaseCdcrDistributedZkTest, CoreAdminHandlerTest, ConnectionManagerTest, TestFastWriter, TestTolerantSearch, TestZkChroot, DirectUpdateHandlerOptimizeTest, TestGroupingSearch, TestAuthenticationFramework, SuggesterTSTTest, TestSweetSpotSimilarityFactory, TestSchemaNameResource, SolrCoreCheckLockOnStartupTest, CollectionStateFormat2Test, TestUseDocValuesAsStored, DirectUpdateHandlerTest, FullSolrCloudDistribCmdsTest, RecoveryZkTest, BadComponentTest, TestRecovery, TestSizeLimitedDistributedMap, TestClassicSimilarityFactory, TestJmxMonitoredMap, TestCharFilters, TestSolrDynamicMBean, TestSort, TestIndexSearcher, TestSolrQueryParser, TestMacros, TestManagedSynonymFilterFactory, DistributedQueryComponentCustomSortTest, CircularListTest, HdfsRecoveryZkTest, BitVectorTest, AssignTest, HdfsThreadLeakTest, GraphQueryTest, ZkStateReaderTest, TestSolrDeletionPolicy1, OverseerTest]
   [junit4] Completed [282/593 (2!)] on J2 in 78.68s, 13 tests, 1 failure, 1 skipped <<< FAILURES!

[...truncated 969 lines...]
BUILD FAILED
/home/jenkins/workspace/Lucene-Solr-master-Linux/build.xml:740: The following error occurred while executing this line:
/home/jenkins/workspace/Lucene-Solr-master-Linux/build.xml:684: The following error occurred while executing this line:
/home/jenkins/workspace/Lucene-Solr-master-Linux/build.xml:59: The following error occurred while executing this line:
/home/jenkins/workspace/Lucene-Solr-master-Linux/solr/build.xml:233: The following error occurred while executing this line:
/home/jenkins/workspace/Lucene-Solr-master-Linux/solr/common-build.xml:529: The following error occurred while executing this line:
/home/jenkins/workspace/Lucene-Solr-master-Linux/lucene/common-build.xml:1457: The following error occurred while executing this line:
/home/jenkins/workspace/Lucene-Solr-master-Linux/lucene/common-build.xml:1014: There were test failures: 593 suites (10 ignored), 2395 tests, 1 error, 1 failure, 116 ignored (70 assumptions) [seed: 6052F78A6263A4C7]

Total time: 59 minutes 32 seconds
Build step 'Invoke Ant' marked build as failure
Archiving artifacts
[WARNINGS] Skipping publisher since build result is FAILURE
Recording test results
Email was triggered for: Failure - Any
Sending email for trigger: Failure - Any