You are viewing a plain text version of this content. The canonical link for it is here.
Posted to notifications@directory.apache.org by Apache Jenkins Server <je...@builds.apache.org> on 2018/08/13 23:05:16 UTC
Jenkins build is still unstable: dir-apacheds-win #634
See <https://builds.apache.org/job/dir-apacheds-win/634/display/redirect?page=changes>
Build failed in Jenkins: dir-apacheds-win #644
Posted by Apache Jenkins Server <je...@builds.apache.org>.
See <https://builds.apache.org/job/dir-apacheds-win/644/display/redirect?page=changes>
Changes:
[elecharny] o Fixed many Sonarlint errors
------------------------------------------
[...truncated 663.77 KB...]
SLF4J: See http://www.slf4j.org/codes.html#multiple_bindings for an explanation.
SLF4J: Actual binding is of type [ch.qos.logback.classic.util.ContextSelectorStaticBinder]
Error: Could not find or load main class org.ops4j.pax.swissbox.framework.RemoteFrameworkImpl
Caused by: java.lang.ClassNotFoundException: org.ops4j.pax.swissbox.framework.RemoteFrameworkImpl
Running org.apache.directory.server.osgi.integ.ServerCoreSharedOsgiTest
SLF4J: Class path contains multiple SLF4J bindings.
SLF4J: Found binding in [jar:file:/f:/jenkins/jenkins-slave/maven-repositories/1/ch/qos/logback/logback-classic/1.2.3/logback-classic-1.2.3.jar!/org/slf4j/impl/StaticLoggerBinder.class]
SLF4J: Found binding in [jar:file:/f:/jenkins/jenkins-slave/maven-repositories/1/org/slf4j/slf4j-log4j12/1.7.25/slf4j-log4j12-1.7.25.jar!/org/slf4j/impl/StaticLoggerBinder.class]
SLF4J: See http://www.slf4j.org/codes.html#multiple_bindings for an explanation.
SLF4J: Actual binding is of type [ch.qos.logback.classic.util.ContextSelectorStaticBinder]
Error: Could not find or load main class org.ops4j.pax.swissbox.framework.RemoteFrameworkImpl
Caused by: java.lang.ClassNotFoundException: org.ops4j.pax.swissbox.framework.RemoteFrameworkImpl
Running org.apache.directory.server.osgi.integ.ServerI18nOsgiTest
SLF4J: Class path contains multiple SLF4J bindings.
SLF4J: Found binding in [jar:file:/f:/jenkins/jenkins-slave/maven-repositories/1/ch/qos/logback/logback-classic/1.2.3/logback-classic-1.2.3.jar!/org/slf4j/impl/StaticLoggerBinder.class]
SLF4J: Found binding in [jar:file:/f:/jenkins/jenkins-slave/maven-repositories/1/org/slf4j/slf4j-log4j12/1.7.25/slf4j-log4j12-1.7.25.jar!/org/slf4j/impl/StaticLoggerBinder.class]
SLF4J: See http://www.slf4j.org/codes.html#multiple_bindings for an explanation.
SLF4J: Actual binding is of type [ch.qos.logback.classic.util.ContextSelectorStaticBinder]
Error: Could not find or load main class org.ops4j.pax.swissbox.framework.RemoteFrameworkImpl
Caused by: java.lang.ClassNotFoundException: org.ops4j.pax.swissbox.framework.RemoteFrameworkImpl
Running org.apache.directory.server.osgi.integ.ServerInterceptorsAdminOsgiTest
SLF4J: Class path contains multiple SLF4J bindings.
SLF4J: Found binding in [jar:file:/f:/jenkins/jenkins-slave/maven-repositories/1/ch/qos/logback/logback-classic/1.2.3/logback-classic-1.2.3.jar!/org/slf4j/impl/StaticLoggerBinder.class]
SLF4J: Found binding in [jar:file:/f:/jenkins/jenkins-slave/maven-repositories/1/org/slf4j/slf4j-log4j12/1.7.25/slf4j-log4j12-1.7.25.jar!/org/slf4j/impl/StaticLoggerBinder.class]
SLF4J: See http://www.slf4j.org/codes.html#multiple_bindings for an explanation.
SLF4J: Actual binding is of type [ch.qos.logback.classic.util.ContextSelectorStaticBinder]
Error: Could not find or load main class org.ops4j.pax.swissbox.framework.RemoteFrameworkImpl
Caused by: java.lang.ClassNotFoundException: org.ops4j.pax.swissbox.framework.RemoteFrameworkImpl
Running org.apache.directory.server.osgi.integ.ServerInterceptorsAuthNOsgiTest
SLF4J: Class path contains multiple SLF4J bindings.
SLF4J: Found binding in [jar:file:/f:/jenkins/jenkins-slave/maven-repositories/1/ch/qos/logback/logback-classic/1.2.3/logback-classic-1.2.3.jar!/org/slf4j/impl/StaticLoggerBinder.class]
SLF4J: Found binding in [jar:file:/f:/jenkins/jenkins-slave/maven-repositories/1/org/slf4j/slf4j-log4j12/1.7.25/slf4j-log4j12-1.7.25.jar!/org/slf4j/impl/StaticLoggerBinder.class]
SLF4J: See http://www.slf4j.org/codes.html#multiple_bindings for an explanation.
SLF4J: Actual binding is of type [ch.qos.logback.classic.util.ContextSelectorStaticBinder]
Error: Could not find or load main class org.ops4j.pax.swissbox.framework.RemoteFrameworkImpl
Caused by: java.lang.ClassNotFoundException: org.ops4j.pax.swissbox.framework.RemoteFrameworkImpl
Running org.apache.directory.server.osgi.integ.ServerInterceptorsAuthZOsgiTest
SLF4J: Class path contains multiple SLF4J bindings.
SLF4J: Found binding in [jar:file:/f:/jenkins/jenkins-slave/maven-repositories/1/ch/qos/logback/logback-classic/1.2.3/logback-classic-1.2.3.jar!/org/slf4j/impl/StaticLoggerBinder.class]
SLF4J: Found binding in [jar:file:/f:/jenkins/jenkins-slave/maven-repositories/1/org/slf4j/slf4j-log4j12/1.7.25/slf4j-log4j12-1.7.25.jar!/org/slf4j/impl/StaticLoggerBinder.class]
SLF4J: See http://www.slf4j.org/codes.html#multiple_bindings for an explanation.
SLF4J: Actual binding is of type [ch.qos.logback.classic.util.ContextSelectorStaticBinder]
Error: Could not find or load main class org.ops4j.pax.swissbox.framework.RemoteFrameworkImpl
Caused by: java.lang.ClassNotFoundException: org.ops4j.pax.swissbox.framework.RemoteFrameworkImpl
Running org.apache.directory.server.osgi.integ.ServerInterceptorsNumberOsgiTest
SLF4J: Class path contains multiple SLF4J bindings.
SLF4J: Found binding in [jar:file:/f:/jenkins/jenkins-slave/maven-repositories/1/ch/qos/logback/logback-classic/1.2.3/logback-classic-1.2.3.jar!/org/slf4j/impl/StaticLoggerBinder.class]
SLF4J: Found binding in [jar:file:/f:/jenkins/jenkins-slave/maven-repositories/1/org/slf4j/slf4j-log4j12/1.7.25/slf4j-log4j12-1.7.25.jar!/org/slf4j/impl/StaticLoggerBinder.class]
SLF4J: See http://www.slf4j.org/codes.html#multiple_bindings for an explanation.
SLF4J: Actual binding is of type [ch.qos.logback.classic.util.ContextSelectorStaticBinder]
Error: Could not find or load main class org.ops4j.pax.swissbox.framework.RemoteFrameworkImpl
Caused by: java.lang.ClassNotFoundException: org.ops4j.pax.swissbox.framework.RemoteFrameworkImpl
Running org.apache.directory.server.osgi.integ.ServerJdbmPartitionOsgiTest
SLF4J: Class path contains multiple SLF4J bindings.
SLF4J: Found binding in [jar:file:/f:/jenkins/jenkins-slave/maven-repositories/1/ch/qos/logback/logback-classic/1.2.3/logback-classic-1.2.3.jar!/org/slf4j/impl/StaticLoggerBinder.class]
SLF4J: Found binding in [jar:file:/f:/jenkins/jenkins-slave/maven-repositories/1/org/slf4j/slf4j-log4j12/1.7.25/slf4j-log4j12-1.7.25.jar!/org/slf4j/impl/StaticLoggerBinder.class]
SLF4J: See http://www.slf4j.org/codes.html#multiple_bindings for an explanation.
SLF4J: Actual binding is of type [ch.qos.logback.classic.util.ContextSelectorStaticBinder]
Error: Could not find or load main class org.ops4j.pax.swissbox.framework.RemoteFrameworkImpl
Caused by: java.lang.ClassNotFoundException: org.ops4j.pax.swissbox.framework.RemoteFrameworkImpl
Running org.apache.directory.server.osgi.integ.ServerMavibotPartitionOsgiTest
SLF4J: Class path contains multiple SLF4J bindings.
SLF4J: Found binding in [jar:file:/f:/jenkins/jenkins-slave/maven-repositories/1/ch/qos/logback/logback-classic/1.2.3/logback-classic-1.2.3.jar!/org/slf4j/impl/StaticLoggerBinder.class]
SLF4J: Found binding in [jar:file:/f:/jenkins/jenkins-slave/maven-repositories/1/org/slf4j/slf4j-log4j12/1.7.25/slf4j-log4j12-1.7.25.jar!/org/slf4j/impl/StaticLoggerBinder.class]
SLF4J: See http://www.slf4j.org/codes.html#multiple_bindings for an explanation.
SLF4J: Actual binding is of type [ch.qos.logback.classic.util.ContextSelectorStaticBinder]
Error: Could not find or load main class org.ops4j.pax.swissbox.framework.RemoteFrameworkImpl
Caused by: java.lang.ClassNotFoundException: org.ops4j.pax.swissbox.framework.RemoteFrameworkImpl
Running org.apache.directory.server.osgi.integ.ServerProtocolKerberosOsgiTest
SLF4J: Class path contains multiple SLF4J bindings.
SLF4J: Found binding in [jar:file:/f:/jenkins/jenkins-slave/maven-repositories/1/ch/qos/logback/logback-classic/1.2.3/logback-classic-1.2.3.jar!/org/slf4j/impl/StaticLoggerBinder.class]
SLF4J: Found binding in [jar:file:/f:/jenkins/jenkins-slave/maven-repositories/1/org/slf4j/slf4j-log4j12/1.7.25/slf4j-log4j12-1.7.25.jar!/org/slf4j/impl/StaticLoggerBinder.class]
SLF4J: See http://www.slf4j.org/codes.html#multiple_bindings for an explanation.
SLF4J: Actual binding is of type [ch.qos.logback.classic.util.ContextSelectorStaticBinder]
Error: Could not find or load main class org.ops4j.pax.swissbox.framework.RemoteFrameworkImpl
Caused by: java.lang.ClassNotFoundException: org.ops4j.pax.swissbox.framework.RemoteFrameworkImpl
Running org.apache.directory.server.osgi.integ.ServerProtocolLdapOsgiTest
SLF4J: Class path contains multiple SLF4J bindings.
SLF4J: Found binding in [jar:file:/f:/jenkins/jenkins-slave/maven-repositories/1/ch/qos/logback/logback-classic/1.2.3/logback-classic-1.2.3.jar!/org/slf4j/impl/StaticLoggerBinder.class]
SLF4J: Found binding in [jar:file:/f:/jenkins/jenkins-slave/maven-repositories/1/org/slf4j/slf4j-log4j12/1.7.25/slf4j-log4j12-1.7.25.jar!/org/slf4j/impl/StaticLoggerBinder.class]
SLF4J: See http://www.slf4j.org/codes.html#multiple_bindings for an explanation.
SLF4J: Actual binding is of type [ch.qos.logback.classic.util.ContextSelectorStaticBinder]
Error: Could not find or load main class org.ops4j.pax.swissbox.framework.RemoteFrameworkImpl
Caused by: java.lang.ClassNotFoundException: org.ops4j.pax.swissbox.framework.RemoteFrameworkImpl
Running org.apache.directory.server.osgi.integ.ServerServiceBuilderOsgiTest
SLF4J: Class path contains multiple SLF4J bindings.
SLF4J: Found binding in [jar:file:/f:/jenkins/jenkins-slave/maven-repositories/1/ch/qos/logback/logback-classic/1.2.3/logback-classic-1.2.3.jar!/org/slf4j/impl/StaticLoggerBinder.class]
SLF4J: Found binding in [jar:file:/f:/jenkins/jenkins-slave/maven-repositories/1/org/slf4j/slf4j-log4j12/1.7.25/slf4j-log4j12-1.7.25.jar!/org/slf4j/impl/StaticLoggerBinder.class]
SLF4J: See http://www.slf4j.org/codes.html#multiple_bindings for an explanation.
SLF4J: Actual binding is of type [ch.qos.logback.classic.util.ContextSelectorStaticBinder]
Error: Could not find or load main class org.ops4j.pax.swissbox.framework.RemoteFrameworkImpl
Caused by: java.lang.ClassNotFoundException: org.ops4j.pax.swissbox.framework.RemoteFrameworkImpl
Results :
Tests run: 0, Failures: 0, Errors: 0, Skipped: 0
[JENKINS] Recording test results
[JENKINS] Archiving disabled
[JENKINS] Archiving disabled
[JENKINS] Archiving disabled
[JENKINS] Archiving disabled
[JENKINS] Archiving disabled
[JENKINS] Archiving disabled
[JENKINS] Archiving disabled
[JENKINS] Archiving disabled
[JENKINS] Archiving disabled
[JENKINS] Archiving disabled
[JENKINS] Archiving disabled
[JENKINS] Archiving disabled
[JENKINS] Archiving disabled
[JENKINS] Archiving disabled
[JENKINS] Archiving disabled
[JENKINS] Archiving disabled
[JENKINS] Archiving disabled
[JENKINS] Archiving disabled
[JENKINS] Archiving disabled
[JENKINS] Archiving disabled
[JENKINS] Archiving disabled
[JENKINS] Archiving disabled
[JENKINS] Archiving disabled
[JENKINS] Archiving disabled
[JENKINS] Archiving disabled
[JENKINS] Archiving disabled
[JENKINS] Archiving disabled
[JENKINS] Archiving disabled
[JENKINS] Archiving disabled
[JENKINS] Archiving disabled
[JENKINS] Archiving disabled
[JENKINS] Archiving disabled
[JENKINS] Archiving disabled
[JENKINS] Archiving disabled
[JENKINS] Archiving disabled
[JENKINS] Archiving disabled
[JENKINS] Archiving disabled
[JENKINS] Archiving disabled
[JENKINS] Archiving disabled
[JENKINS] Archiving disabled
[JENKINS] Archiving disabled
[JENKINS] Archiving disabled
[JENKINS] Archiving disabled
[JENKINS] Archiving disabled
[JENKINS] Archiving disabled
[JENKINS] Archiving disabled
[JENKINS] Archiving disabled
[JENKINS] Archiving disabled
[JENKINS] Archiving disabled
[JENKINS] Archiving disabled
[JENKINS] Archiving disabled
[JENKINS] Archiving disabled
[JENKINS] Archiving disabled
[JENKINS] Archiving disabled
[JENKINS] Archiving disabled
[JENKINS] Archiving disabled
[JENKINS] Archiving disabled
[JENKINS] Archiving disabled
[INFO] ------------------------------------------------------------------------
[INFO] Reactor Summary:
[INFO]
[INFO] ApacheDS ........................................... SUCCESS [ 5.158 s]
[INFO] ApacheDS I18n ...................................... SUCCESS [ 4.746 s]
[INFO] ApacheDS Core Constants ............................ SUCCESS [ 2.748 s]
[INFO] ApacheDS Core API .................................. SUCCESS [ 54.168 s]
[INFO] ApacheDS Core Shared ............................... SUCCESS [ 4.212 s]
[INFO] ApacheDS Interceptors .............................. SUCCESS [ 1.179 s]
[INFO] ApacheDS AdministrativePoint Interceptor ........... SUCCESS [ 3.974 s]
[INFO] ApacheDS Authentication Interceptor ................ SUCCESS [ 6.109 s]
[INFO] ApacheDS Interceptor to increment numeric attributes SUCCESS [ 3.199 s]
[INFO] ApacheDS Authorization Interceptor ................. SUCCESS [ 7.737 s]
[INFO] ApacheDS ChangeLog Interceptor ..................... SUCCESS [ 5.895 s]
[INFO] ApacheDS Collective Attribute Interceptor .......... SUCCESS [ 3.078 s]
[INFO] ApacheDS Event Interceptor ......................... SUCCESS [ 3.216 s]
[INFO] ApacheDS Exception Interceptor ..................... SUCCESS [ 3.095 s]
[INFO] ApacheDS Journal Interceptor ....................... SUCCESS [ 3.066 s]
[INFO] ApacheDS Normalization Interceptor ................. SUCCESS [ 5.331 s]
[INFO] ApacheDS Operational Attribute Interceptor ......... SUCCESS [ 3.169 s]
[INFO] ApacheDS Referral Interceptor ...................... SUCCESS [ 3.087 s]
[INFO] ApacheDS Schema Interceptor ........................ SUCCESS [ 10.308 s]
[INFO] ApacheDS Subtree Interceptor ....................... SUCCESS [ 11.025 s]
[INFO] ApacheDS Triggers Interceptor ...................... SUCCESS [ 3.695 s]
[INFO] ApacheDS Core ...................................... SUCCESS [ 7.115 s]
[INFO] ApacheDS Core AVL .................................. SUCCESS [ 8.044 s]
[INFO] ApacheDS Generalized (X) DBM Partition ............. SUCCESS [ 17.319 s]
[INFO] ApacheDS LDIF Partition ............................ SUCCESS [ 11.839 s]
[INFO] ApacheDS JDBM Partition ............................ SUCCESS [ 27.829 s]
[INFO] ApacheDS Mavibot Partition ......................... SUCCESS [ 13.061 s]
[INFO] ApacheDS Core Annotations .......................... SUCCESS [ 39.277 s]
[INFO] ApacheDS Core JNDI ................................. SUCCESS [ 5.150 s]
[INFO] ApacheDS Protocol Kerberos Codec ................... SUCCESS [ 15.903 s]
[INFO] ApacheDS Interceptors for Kerberos ................. SUCCESS [ 3.724 s]
[INFO] ApacheDS Protocol Dhcp ............................. SUCCESS [ 5.091 s]
[INFO] ApacheDS Protocol Shared ........................... SUCCESS [ 3.969 s]
[INFO] ApacheDS Protocol Dns .............................. SUCCESS [ 7.870 s]
[INFO] ApacheDS Protocol Kerberos ......................... SUCCESS [ 6.686 s]
[INFO] ApacheDS Protocol Ldap ............................. SUCCESS [ 15.485 s]
[INFO] ApacheDS Protocol Ntp .............................. SUCCESS [ 5.279 s]
[INFO] Apacheds Server Annotations ........................ SUCCESS [ 39.643 s]
[INFO] ApacheDS Server Config ............................. SUCCESS [ 31.906 s]
[INFO] ApacheDS Server JNDI ............................... SUCCESS [ 5.325 s]
[INFO] ApacheDS Test Framework ............................ SUCCESS [01:20 min]
[INFO] ApacheDS All ....................................... SUCCESS [ 6.509 s]
[INFO] ApacheDS Logger Interceptor ........................ SUCCESS [ 3.071 s]
[INFO] ApacheDS Password Hashing Interceptor .............. SUCCESS [ 3.396 s]
[INFO] ApacheDS Core Integration .......................... SUCCESS [10:04 min]
[INFO] ApacheDS Protocol Kerberos Test .................... SUCCESS [ 31.257 s]
[INFO] ApacheDS Server Integration ........................ SUCCESS [10:19 min]
[INFO] ApacheDS DirectoryService-WebApp bridge ............ SUCCESS [ 2.801 s]
[INFO] ApacheDS Jetty HTTP Server Integration ............. SUCCESS [ 3.912 s]
[INFO] ApacheDS Service Builder ........................... SUCCESS [ 11.237 s]
[INFO] Apache Directory LDAP Client API test .............. SUCCESS [05:15 min]
[INFO] kerberos-client .................................... SUCCESS [ 20.964 s]
[INFO] ApacheDS Service ................................... SUCCESS [ 35.299 s]
[INFO] ApacheDS Wrapper ................................... SUCCESS [ 2.501 s]
[INFO] ApacheDS Installers Maven Plugin ................... SUCCESS [ 6.651 s]
[INFO] ApacheDS Installers ................................ SUCCESS [ 1.412 s]
[INFO] ApacheDS OSGi Integration Tests .................... FAILURE [04:52 min]
[INFO] ------------------------------------------------------------------------
[INFO] BUILD FAILURE
[INFO] ------------------------------------------------------------------------
[INFO] Total time: 44:11 min
[INFO] Finished at: 2018-08-28T00:03:40+00:00
[INFO] Final Memory: 87M/288M
[INFO] ------------------------------------------------------------------------
Waiting for Jenkins to finish collecting data
[ERROR] Failed to execute goal org.apache.maven.plugins:maven-surefire-plugin:2.19.1:test (default-test) on project apacheds-osgi-integ: ExecutionException The forked VM terminated without properly saying goodbye. VM crash or System.exit called?
[ERROR] Command was cmd.exe /X /C "F:\jenkins\tools\java\latest\bin\java -Xmx1024m -jar F:\jenkins\jenkins-slave\workspace\dir-apacheds-win\osgi-integ\target\surefire\surefirebooter13576358049944152546.jar F:\jenkins\jenkins-slave\workspace\dir-apacheds-win\osgi-integ\target\surefire\surefire17080675374282128955tmp F:\jenkins\jenkins-slave\workspace\dir-apacheds-win\osgi-integ\target\surefire\surefire_015327537229277815154tmp"
[ERROR] -> [Help 1]
[ERROR]
[ERROR] To see the full stack trace of the errors, re-run Maven with the -e switch.
[ERROR] Re-run Maven using the -X switch to enable full debug logging.
[ERROR]
[ERROR] For more information about the errors and possible solutions, please read the following articles:
[ERROR] [Help 1] http://cwiki.apache.org/confluence/display/MAVEN/MojoFailureException
[ERROR]
[ERROR] After correcting the problems, you can resume the build with the command
[ERROR] mvn <goals> -rf :apacheds-osgi-integ
channel stopped
Build failed in Jenkins: dir-apacheds-win #643
Posted by Apache Jenkins Server <je...@builds.apache.org>.
See <https://builds.apache.org/job/dir-apacheds-win/643/display/redirect?page=changes>
Changes:
[elecharny] rolled back to surefire 2.19 for osgi-test, to speedup them. Bumped up
------------------------------------------
[...truncated 711.91 KB...]
SLF4J: See http://www.slf4j.org/codes.html#multiple_bindings for an explanation.
SLF4J: Actual binding is of type [ch.qos.logback.classic.util.ContextSelectorStaticBinder]
Error: Could not find or load main class org.ops4j.pax.swissbox.framework.RemoteFrameworkImpl
Caused by: java.lang.ClassNotFoundException: org.ops4j.pax.swissbox.framework.RemoteFrameworkImpl
Running org.apache.directory.server.osgi.integ.ServerCoreSharedOsgiTest
SLF4J: Class path contains multiple SLF4J bindings.
SLF4J: Found binding in [jar:file:/f:/jenkins/jenkins-slave/maven-repositories/1/ch/qos/logback/logback-classic/1.2.3/logback-classic-1.2.3.jar!/org/slf4j/impl/StaticLoggerBinder.class]
SLF4J: Found binding in [jar:file:/f:/jenkins/jenkins-slave/maven-repositories/1/org/slf4j/slf4j-log4j12/1.7.25/slf4j-log4j12-1.7.25.jar!/org/slf4j/impl/StaticLoggerBinder.class]
SLF4J: See http://www.slf4j.org/codes.html#multiple_bindings for an explanation.
SLF4J: Actual binding is of type [ch.qos.logback.classic.util.ContextSelectorStaticBinder]
Error: Could not find or load main class org.ops4j.pax.swissbox.framework.RemoteFrameworkImpl
Caused by: java.lang.ClassNotFoundException: org.ops4j.pax.swissbox.framework.RemoteFrameworkImpl
Running org.apache.directory.server.osgi.integ.ServerI18nOsgiTest
SLF4J: Class path contains multiple SLF4J bindings.
SLF4J: Found binding in [jar:file:/f:/jenkins/jenkins-slave/maven-repositories/1/ch/qos/logback/logback-classic/1.2.3/logback-classic-1.2.3.jar!/org/slf4j/impl/StaticLoggerBinder.class]
SLF4J: Found binding in [jar:file:/f:/jenkins/jenkins-slave/maven-repositories/1/org/slf4j/slf4j-log4j12/1.7.25/slf4j-log4j12-1.7.25.jar!/org/slf4j/impl/StaticLoggerBinder.class]
SLF4J: See http://www.slf4j.org/codes.html#multiple_bindings for an explanation.
SLF4J: Actual binding is of type [ch.qos.logback.classic.util.ContextSelectorStaticBinder]
Error: Could not find or load main class org.ops4j.pax.swissbox.framework.RemoteFrameworkImpl
Caused by: java.lang.ClassNotFoundException: org.ops4j.pax.swissbox.framework.RemoteFrameworkImpl
Running org.apache.directory.server.osgi.integ.ServerInterceptorsAdminOsgiTest
SLF4J: Class path contains multiple SLF4J bindings.
SLF4J: Found binding in [jar:file:/f:/jenkins/jenkins-slave/maven-repositories/1/ch/qos/logback/logback-classic/1.2.3/logback-classic-1.2.3.jar!/org/slf4j/impl/StaticLoggerBinder.class]
SLF4J: Found binding in [jar:file:/f:/jenkins/jenkins-slave/maven-repositories/1/org/slf4j/slf4j-log4j12/1.7.25/slf4j-log4j12-1.7.25.jar!/org/slf4j/impl/StaticLoggerBinder.class]
SLF4J: See http://www.slf4j.org/codes.html#multiple_bindings for an explanation.
SLF4J: Actual binding is of type [ch.qos.logback.classic.util.ContextSelectorStaticBinder]
Error: Could not find or load main class org.ops4j.pax.swissbox.framework.RemoteFrameworkImpl
Caused by: java.lang.ClassNotFoundException: org.ops4j.pax.swissbox.framework.RemoteFrameworkImpl
Running org.apache.directory.server.osgi.integ.ServerInterceptorsAuthNOsgiTest
SLF4J: Class path contains multiple SLF4J bindings.
SLF4J: Found binding in [jar:file:/f:/jenkins/jenkins-slave/maven-repositories/1/ch/qos/logback/logback-classic/1.2.3/logback-classic-1.2.3.jar!/org/slf4j/impl/StaticLoggerBinder.class]
SLF4J: Found binding in [jar:file:/f:/jenkins/jenkins-slave/maven-repositories/1/org/slf4j/slf4j-log4j12/1.7.25/slf4j-log4j12-1.7.25.jar!/org/slf4j/impl/StaticLoggerBinder.class]
SLF4J: See http://www.slf4j.org/codes.html#multiple_bindings for an explanation.
SLF4J: Actual binding is of type [ch.qos.logback.classic.util.ContextSelectorStaticBinder]
Error: Could not find or load main class org.ops4j.pax.swissbox.framework.RemoteFrameworkImpl
Caused by: java.lang.ClassNotFoundException: org.ops4j.pax.swissbox.framework.RemoteFrameworkImpl
Running org.apache.directory.server.osgi.integ.ServerInterceptorsAuthZOsgiTest
SLF4J: Class path contains multiple SLF4J bindings.
SLF4J: Found binding in [jar:file:/f:/jenkins/jenkins-slave/maven-repositories/1/ch/qos/logback/logback-classic/1.2.3/logback-classic-1.2.3.jar!/org/slf4j/impl/StaticLoggerBinder.class]
SLF4J: Found binding in [jar:file:/f:/jenkins/jenkins-slave/maven-repositories/1/org/slf4j/slf4j-log4j12/1.7.25/slf4j-log4j12-1.7.25.jar!/org/slf4j/impl/StaticLoggerBinder.class]
SLF4J: See http://www.slf4j.org/codes.html#multiple_bindings for an explanation.
SLF4J: Actual binding is of type [ch.qos.logback.classic.util.ContextSelectorStaticBinder]
Error: Could not find or load main class org.ops4j.pax.swissbox.framework.RemoteFrameworkImpl
Caused by: java.lang.ClassNotFoundException: org.ops4j.pax.swissbox.framework.RemoteFrameworkImpl
Running org.apache.directory.server.osgi.integ.ServerInterceptorsNumberOsgiTest
SLF4J: Class path contains multiple SLF4J bindings.
SLF4J: Found binding in [jar:file:/f:/jenkins/jenkins-slave/maven-repositories/1/ch/qos/logback/logback-classic/1.2.3/logback-classic-1.2.3.jar!/org/slf4j/impl/StaticLoggerBinder.class]
SLF4J: Found binding in [jar:file:/f:/jenkins/jenkins-slave/maven-repositories/1/org/slf4j/slf4j-log4j12/1.7.25/slf4j-log4j12-1.7.25.jar!/org/slf4j/impl/StaticLoggerBinder.class]
SLF4J: See http://www.slf4j.org/codes.html#multiple_bindings for an explanation.
SLF4J: Actual binding is of type [ch.qos.logback.classic.util.ContextSelectorStaticBinder]
Error: Could not find or load main class org.ops4j.pax.swissbox.framework.RemoteFrameworkImpl
Caused by: java.lang.ClassNotFoundException: org.ops4j.pax.swissbox.framework.RemoteFrameworkImpl
Running org.apache.directory.server.osgi.integ.ServerJdbmPartitionOsgiTest
SLF4J: Class path contains multiple SLF4J bindings.
SLF4J: Found binding in [jar:file:/f:/jenkins/jenkins-slave/maven-repositories/1/ch/qos/logback/logback-classic/1.2.3/logback-classic-1.2.3.jar!/org/slf4j/impl/StaticLoggerBinder.class]
SLF4J: Found binding in [jar:file:/f:/jenkins/jenkins-slave/maven-repositories/1/org/slf4j/slf4j-log4j12/1.7.25/slf4j-log4j12-1.7.25.jar!/org/slf4j/impl/StaticLoggerBinder.class]
SLF4J: See http://www.slf4j.org/codes.html#multiple_bindings for an explanation.
SLF4J: Actual binding is of type [ch.qos.logback.classic.util.ContextSelectorStaticBinder]
Error: Could not find or load main class org.ops4j.pax.swissbox.framework.RemoteFrameworkImpl
Caused by: java.lang.ClassNotFoundException: org.ops4j.pax.swissbox.framework.RemoteFrameworkImpl
Running org.apache.directory.server.osgi.integ.ServerMavibotPartitionOsgiTest
SLF4J: Class path contains multiple SLF4J bindings.
SLF4J: Found binding in [jar:file:/f:/jenkins/jenkins-slave/maven-repositories/1/ch/qos/logback/logback-classic/1.2.3/logback-classic-1.2.3.jar!/org/slf4j/impl/StaticLoggerBinder.class]
SLF4J: Found binding in [jar:file:/f:/jenkins/jenkins-slave/maven-repositories/1/org/slf4j/slf4j-log4j12/1.7.25/slf4j-log4j12-1.7.25.jar!/org/slf4j/impl/StaticLoggerBinder.class]
SLF4J: See http://www.slf4j.org/codes.html#multiple_bindings for an explanation.
SLF4J: Actual binding is of type [ch.qos.logback.classic.util.ContextSelectorStaticBinder]
Error: Could not find or load main class org.ops4j.pax.swissbox.framework.RemoteFrameworkImpl
Caused by: java.lang.ClassNotFoundException: org.ops4j.pax.swissbox.framework.RemoteFrameworkImpl
Running org.apache.directory.server.osgi.integ.ServerProtocolKerberosOsgiTest
SLF4J: Class path contains multiple SLF4J bindings.
SLF4J: Found binding in [jar:file:/f:/jenkins/jenkins-slave/maven-repositories/1/ch/qos/logback/logback-classic/1.2.3/logback-classic-1.2.3.jar!/org/slf4j/impl/StaticLoggerBinder.class]
SLF4J: Found binding in [jar:file:/f:/jenkins/jenkins-slave/maven-repositories/1/org/slf4j/slf4j-log4j12/1.7.25/slf4j-log4j12-1.7.25.jar!/org/slf4j/impl/StaticLoggerBinder.class]
SLF4J: See http://www.slf4j.org/codes.html#multiple_bindings for an explanation.
SLF4J: Actual binding is of type [ch.qos.logback.classic.util.ContextSelectorStaticBinder]
Error: Could not find or load main class org.ops4j.pax.swissbox.framework.RemoteFrameworkImpl
Caused by: java.lang.ClassNotFoundException: org.ops4j.pax.swissbox.framework.RemoteFrameworkImpl
Running org.apache.directory.server.osgi.integ.ServerProtocolLdapOsgiTest
SLF4J: Class path contains multiple SLF4J bindings.
SLF4J: Found binding in [jar:file:/f:/jenkins/jenkins-slave/maven-repositories/1/ch/qos/logback/logback-classic/1.2.3/logback-classic-1.2.3.jar!/org/slf4j/impl/StaticLoggerBinder.class]
SLF4J: Found binding in [jar:file:/f:/jenkins/jenkins-slave/maven-repositories/1/org/slf4j/slf4j-log4j12/1.7.25/slf4j-log4j12-1.7.25.jar!/org/slf4j/impl/StaticLoggerBinder.class]
SLF4J: See http://www.slf4j.org/codes.html#multiple_bindings for an explanation.
SLF4J: Actual binding is of type [ch.qos.logback.classic.util.ContextSelectorStaticBinder]
Error: Could not find or load main class org.ops4j.pax.swissbox.framework.RemoteFrameworkImpl
Caused by: java.lang.ClassNotFoundException: org.ops4j.pax.swissbox.framework.RemoteFrameworkImpl
Running org.apache.directory.server.osgi.integ.ServerServiceBuilderOsgiTest
SLF4J: Class path contains multiple SLF4J bindings.
SLF4J: Found binding in [jar:file:/f:/jenkins/jenkins-slave/maven-repositories/1/ch/qos/logback/logback-classic/1.2.3/logback-classic-1.2.3.jar!/org/slf4j/impl/StaticLoggerBinder.class]
SLF4J: Found binding in [jar:file:/f:/jenkins/jenkins-slave/maven-repositories/1/org/slf4j/slf4j-log4j12/1.7.25/slf4j-log4j12-1.7.25.jar!/org/slf4j/impl/StaticLoggerBinder.class]
SLF4J: See http://www.slf4j.org/codes.html#multiple_bindings for an explanation.
SLF4J: Actual binding is of type [ch.qos.logback.classic.util.ContextSelectorStaticBinder]
Error: Could not find or load main class org.ops4j.pax.swissbox.framework.RemoteFrameworkImpl
Caused by: java.lang.ClassNotFoundException: org.ops4j.pax.swissbox.framework.RemoteFrameworkImpl
Results :
Tests run: 0, Failures: 0, Errors: 0, Skipped: 0
[JENKINS] Recording test results
[JENKINS] Archiving disabled
[JENKINS] Archiving disabled
[JENKINS] Archiving disabled
[JENKINS] Archiving disabled
[JENKINS] Archiving disabled
[JENKINS] Archiving disabled
[JENKINS] Archiving disabled
[JENKINS] Archiving disabled
[JENKINS] Archiving disabled
[JENKINS] Archiving disabled
[JENKINS] Archiving disabled
[JENKINS] Archiving disabled
[JENKINS] Archiving disabled
[JENKINS] Archiving disabled
[JENKINS] Archiving disabled
[JENKINS] Archiving disabled
[JENKINS] Archiving disabled
[JENKINS] Archiving disabled
[JENKINS] Archiving disabled
[JENKINS] Archiving disabled
[JENKINS] Archiving disabled
[JENKINS] Archiving disabled
[JENKINS] Archiving disabled
[JENKINS] Archiving disabled
[JENKINS] Archiving disabled
[JENKINS] Archiving disabled
[JENKINS] Archiving disabled
[JENKINS] Archiving disabled
[JENKINS] Archiving disabled
[JENKINS] Archiving disabled
[JENKINS] Archiving disabled
[JENKINS] Archiving disabled
[JENKINS] Archiving disabled
[JENKINS] Archiving disabled
[JENKINS] Archiving disabled
[JENKINS] Archiving disabled
[JENKINS] Archiving disabled
[JENKINS] Archiving disabled
[JENKINS] Archiving disabled
[JENKINS] Archiving disabled
[JENKINS] Archiving disabled
[JENKINS] Archiving disabled
[JENKINS] Archiving disabled
[JENKINS] Archiving disabled
[JENKINS] Archiving disabled
[JENKINS] Archiving disabled
[JENKINS] Archiving disabled
[JENKINS] Archiving disabled
[JENKINS] Archiving disabled
[JENKINS] Archiving disabled
[JENKINS] Archiving disabled
[JENKINS] Archiving disabled
[JENKINS] Archiving disabled
[JENKINS] Archiving disabled
[JENKINS] Archiving disabled
[JENKINS] Archiving disabled
[JENKINS] Archiving disabled
[JENKINS] Archiving disabled
[INFO] ------------------------------------------------------------------------
[INFO] Reactor Summary:
[INFO]
[INFO] ApacheDS ........................................... SUCCESS [ 16.055 s]
[INFO] ApacheDS I18n ...................................... SUCCESS [ 6.290 s]
[INFO] ApacheDS Core Constants ............................ SUCCESS [ 2.487 s]
[INFO] ApacheDS Core API .................................. SUCCESS [ 58.720 s]
[INFO] ApacheDS Core Shared ............................... SUCCESS [ 4.292 s]
[INFO] ApacheDS Interceptors .............................. SUCCESS [ 1.198 s]
[INFO] ApacheDS AdministrativePoint Interceptor ........... SUCCESS [ 3.768 s]
[INFO] ApacheDS Authentication Interceptor ................ SUCCESS [ 5.789 s]
[INFO] ApacheDS Interceptor to increment numeric attributes SUCCESS [ 3.271 s]
[INFO] ApacheDS Authorization Interceptor ................. SUCCESS [ 6.769 s]
[INFO] ApacheDS ChangeLog Interceptor ..................... SUCCESS [ 5.353 s]
[INFO] ApacheDS Collective Attribute Interceptor .......... SUCCESS [ 3.075 s]
[INFO] ApacheDS Event Interceptor ......................... SUCCESS [ 3.454 s]
[INFO] ApacheDS Exception Interceptor ..................... SUCCESS [ 3.073 s]
[INFO] ApacheDS Journal Interceptor ....................... SUCCESS [ 3.312 s]
[INFO] ApacheDS Normalization Interceptor ................. SUCCESS [ 5.142 s]
[INFO] ApacheDS Operational Attribute Interceptor ......... SUCCESS [ 3.315 s]
[INFO] ApacheDS Referral Interceptor ...................... SUCCESS [ 3.134 s]
[INFO] ApacheDS Schema Interceptor ........................ SUCCESS [ 10.672 s]
[INFO] ApacheDS Subtree Interceptor ....................... SUCCESS [ 10.824 s]
[INFO] ApacheDS Triggers Interceptor ...................... SUCCESS [ 4.517 s]
[INFO] ApacheDS Core ...................................... SUCCESS [ 7.169 s]
[INFO] ApacheDS Core AVL .................................. SUCCESS [ 8.302 s]
[INFO] ApacheDS Generalized (X) DBM Partition ............. SUCCESS [ 18.346 s]
[INFO] ApacheDS LDIF Partition ............................ SUCCESS [ 13.180 s]
[INFO] ApacheDS JDBM Partition ............................ SUCCESS [ 28.948 s]
[INFO] ApacheDS Mavibot Partition ......................... SUCCESS [ 13.584 s]
[INFO] ApacheDS Core Annotations .......................... SUCCESS [ 40.920 s]
[INFO] ApacheDS Core JNDI ................................. SUCCESS [ 5.764 s]
[INFO] ApacheDS Protocol Kerberos Codec ................... SUCCESS [ 18.704 s]
[INFO] ApacheDS Interceptors for Kerberos ................. SUCCESS [ 3.815 s]
[INFO] ApacheDS Protocol Dhcp ............................. SUCCESS [ 5.968 s]
[INFO] ApacheDS Protocol Shared ........................... SUCCESS [ 3.952 s]
[INFO] ApacheDS Protocol Dns .............................. SUCCESS [ 8.630 s]
[INFO] ApacheDS Protocol Kerberos ......................... SUCCESS [ 7.128 s]
[INFO] ApacheDS Protocol Ldap ............................. SUCCESS [ 16.584 s]
[INFO] ApacheDS Protocol Ntp .............................. SUCCESS [ 5.785 s]
[INFO] Apacheds Server Annotations ........................ SUCCESS [ 40.330 s]
[INFO] ApacheDS Server Config ............................. SUCCESS [ 33.604 s]
[INFO] ApacheDS Server JNDI ............................... SUCCESS [ 5.442 s]
[INFO] ApacheDS Test Framework ............................ SUCCESS [01:20 min]
[INFO] ApacheDS All ....................................... SUCCESS [ 7.640 s]
[INFO] ApacheDS Logger Interceptor ........................ SUCCESS [ 3.192 s]
[INFO] ApacheDS Password Hashing Interceptor .............. SUCCESS [ 4.002 s]
[INFO] ApacheDS Core Integration .......................... SUCCESS [10:04 min]
[INFO] ApacheDS Protocol Kerberos Test .................... SUCCESS [ 31.202 s]
[INFO] ApacheDS Server Integration ........................ SUCCESS [11:16 min]
[INFO] ApacheDS DirectoryService-WebApp bridge ............ SUCCESS [ 2.824 s]
[INFO] ApacheDS Jetty HTTP Server Integration ............. SUCCESS [ 4.219 s]
[INFO] ApacheDS Service Builder ........................... SUCCESS [ 11.879 s]
[INFO] Apache Directory LDAP Client API test .............. SUCCESS [05:04 min]
[INFO] kerberos-client .................................... SUCCESS [ 19.318 s]
[INFO] ApacheDS Service ................................... SUCCESS [ 35.374 s]
[INFO] ApacheDS Wrapper ................................... SUCCESS [ 2.545 s]
[INFO] ApacheDS Installers Maven Plugin ................... SUCCESS [ 9.713 s]
[INFO] ApacheDS Installers ................................ SUCCESS [ 1.554 s]
[INFO] ApacheDS OSGi Integration Tests .................... FAILURE [04:55 min]
[INFO] ------------------------------------------------------------------------
[INFO] BUILD FAILURE
[INFO] ------------------------------------------------------------------------
[INFO] Total time: 45:30 min
[INFO] Finished at: 2018-08-27T23:18:21+00:00
[INFO] Final Memory: 93M/281M
[INFO] ------------------------------------------------------------------------
Waiting for Jenkins to finish collecting data
[ERROR] Failed to execute goal org.apache.maven.plugins:maven-surefire-plugin:2.19.1:test (default-test) on project apacheds-osgi-integ: ExecutionException The forked VM terminated without properly saying goodbye. VM crash or System.exit called?
[ERROR] Command was cmd.exe /X /C "F:\jenkins\tools\java\latest\bin\java -Xmx1024m -jar F:\jenkins\jenkins-slave\workspace\dir-apacheds-win\osgi-integ\target\surefire\surefirebooter5745404382498409086.jar F:\jenkins\jenkins-slave\workspace\dir-apacheds-win\osgi-integ\target\surefire\surefire10913310192495335190tmp F:\jenkins\jenkins-slave\workspace\dir-apacheds-win\osgi-integ\target\surefire\surefire_08988731443339229099tmp"
[ERROR] -> [Help 1]
[ERROR]
[ERROR] To see the full stack trace of the errors, re-run Maven with the -e switch.
[ERROR] Re-run Maven using the -X switch to enable full debug logging.
[ERROR]
[ERROR] For more information about the errors and possible solutions, please read the following articles:
[ERROR] [Help 1] http://cwiki.apache.org/confluence/display/MAVEN/MojoFailureException
[ERROR]
[ERROR] After correcting the problems, you can resume the build with the command
[ERROR] mvn <goals> -rf :apacheds-osgi-integ
channel stopped
Jenkins build is still unstable: dir-apacheds-win #642
Posted by Apache Jenkins Server <je...@builds.apache.org>.
See <https://builds.apache.org/job/dir-apacheds-win/642/display/redirect?page=changes>
Jenkins build is still unstable: dir-apacheds-win #641
Posted by Apache Jenkins Server <je...@builds.apache.org>.
See <https://builds.apache.org/job/dir-apacheds-win/641/display/redirect?page=changes>
Jenkins build is still unstable: dir-apacheds-win #640
Posted by Apache Jenkins Server <je...@builds.apache.org>.
See <https://builds.apache.org/job/dir-apacheds-win/640/display/redirect?page=changes>
Jenkins build is still unstable: dir-apacheds-win #639
Posted by Apache Jenkins Server <je...@builds.apache.org>.
See <https://builds.apache.org/job/dir-apacheds-win/639/display/redirect?page=changes>
Jenkins build is still unstable: dir-apacheds-win #638
Posted by Apache Jenkins Server <je...@builds.apache.org>.
See <https://builds.apache.org/job/dir-apacheds-win/638/display/redirect?page=changes>
Jenkins build is still unstable: dir-apacheds-win #637
Posted by Apache Jenkins Server <je...@builds.apache.org>.
See <https://builds.apache.org/job/dir-apacheds-win/637/display/redirect?page=changes>
Jenkins build is still unstable: dir-apacheds-win #636
Posted by Apache Jenkins Server <je...@builds.apache.org>.
See <https://builds.apache.org/job/dir-apacheds-win/636/display/redirect?page=changes>
Jenkins build is still unstable: dir-apacheds-win #635
Posted by Apache Jenkins Server <je...@builds.apache.org>.
See <https://builds.apache.org/job/dir-apacheds-win/635/display/redirect?page=changes>