You are viewing a plain text version of this content. The canonical link for it is here.
Posted to builds@beam.apache.org by Apache Jenkins Server <je...@builds.apache.org> on 2023/08/05 20:57:53 UTC

Build failed in Jenkins: beam_PostCommit_XVR_Spark3 #3423

See <https://ci-beam.apache.org/job/beam_PostCommit_XVR_Spark3/3423/display/redirect?page=changes>

Changes:

[noreply] Fix google-api-services-bigquery to match new google-cloud-bigquery


------------------------------------------
[...truncated 950.71 KB...]
_ _ _ _ _ _ _ _ _ _ _ _ _ _ _ _ _ _ _ _ _ _ _ _ _ _ _ _ _ _ _ _ _ _ _ _ _ _ _ _ 
apache_beam/pvalue.py:137: in __or__
    return self.pipeline.apply(ptransform, self)
apache_beam/pipeline.py:712: in apply
    pvalueish_result = self.runner.apply(transform, pvalueish, self._options)
apache_beam/runners/runner.py:185: in apply
    return m(transform, input, options)
apache_beam/runners/runner.py:215: in apply_PTransform
    return transform.expand(input)
apache_beam/transforms/external.py:678: in expand
    with ExternalTransform.service(expansion_service) as service:
/usr/lib/python3.8/contextlib.py:113: in __enter__
    return next(self.gen)
apache_beam/transforms/external.py:733: in service
    with expansion_service as stub:
apache_beam/transforms/external.py:944: in __enter__
    self._service = self._service_provider.__enter__()
apache_beam/utils/subprocess_server.py:72: in __enter__
    return self.start()
_ _ _ _ _ _ _ _ _ _ _ _ _ _ _ _ _ _ _ _ _ _ _ _ _ _ _ _ _ _ _ _ _ _ _ _ _ _ _ _ 

self = <apache_beam.utils.subprocess_server.JavaJarServer object at 0x7f43d0348220>

    def start(self):
      try:
        endpoint = self.start_process()
        wait_secs = .1
        channel_options = [("grpc.max_receive_message_length", -1),
                           ("grpc.max_send_message_length", -1)]
        channel = grpc.insecure_channel(endpoint, options=channel_options)
        channel_ready = grpc.channel_ready_future(channel)
        while True:
          if self._process is not None and self._process.poll() is not None:
            _LOGGER.error("Starting job service with %s", self._process.args)
>           raise RuntimeError(
                'Service failed to start up with error %s' % self._process.poll())
E               RuntimeError: Service failed to start up with error 1

apache_beam/utils/subprocess_server.py:88: RuntimeError
------------------------------ Captured log call -------------------------------
INFO     apache_beam.utils.subprocess_server:subprocess_server.py:239 Using pre-built snapshot at <https://ci-beam.apache.org/job/beam_PostCommit_XVR_Spark3/ws/src/sdks/java/extensions/sql/expansion-service/build/libs/beam-sdks-java-extensions-sql-expansion-service-2.50.0-SNAPSHOT.jar>
INFO     root:external.py:929 Starting a JAR-based expansion service from JAR <https://ci-beam.apache.org/job/beam_PostCommit_XVR_Spark3/ws/src/sdks/java/extensions/sql/expansion-service/build/libs/beam-sdks-java-extensions-sql-expansion-service-2.50.0-SNAPSHOT.jar> 
INFO     apache_beam.utils.subprocess_server:subprocess_server.py:116 Starting service with ['java' '-jar' '<https://ci-beam.apache.org/job/beam_PostCommit_XVR_Spark3/ws/src/sdks/java/extensions/sql/expansion-service/build/libs/beam-sdks-java-extensions-sql-expansion-service-2.50.0-SNAPSHOT.jar'> '40069' '--filesToStage=<https://ci-beam.apache.org/job/beam_PostCommit_XVR_Spark3/ws/src/sdks/java/extensions/sql/expansion-service/build/libs/beam-sdks-java-extensions-sql-expansion-service-2.50.0-SNAPSHOT.jar']>
INFO     apache_beam.utils.subprocess_server:subprocess_server.py:126 Error: Invalid or corrupt jarfile <https://ci-beam.apache.org/job/beam_PostCommit_XVR_Spark3/ws/src/sdks/java/extensions/sql/expansion-service/build/libs/beam-sdks-java-extensions-sql-expansion-service-2.50.0-SNAPSHOT.jar>
ERROR    apache_beam.utils.subprocess_server:subprocess_server.py:87 Starting job service with ['java', '-jar', '<https://ci-beam.apache.org/job/beam_PostCommit_XVR_Spark3/ws/src/sdks/java/extensions/sql/expansion-service/build/libs/beam-sdks-java-extensions-sql-expansion-service-2.50.0-SNAPSHOT.jar',> '40069', '--filesToStage=<https://ci-beam.apache.org/job/beam_PostCommit_XVR_Spark3/ws/src/sdks/java/extensions/sql/expansion-service/build/libs/beam-sdks-java-extensions-sql-expansion-service-2.50.0-SNAPSHOT.jar']>
ERROR    apache_beam.utils.subprocess_server:subprocess_server.py:101 Error bringing up service
Traceback (most recent call last):
  File "<https://ci-beam.apache.org/job/beam_PostCommit_XVR_Spark3/ws/src/sdks/python/apache_beam/utils/subprocess_server.py",> line 88, in start
    raise RuntimeError(
RuntimeError: Service failed to start up with error 1
_________________ SqlTransformTest.test_zetasql_generate_data __________________

self = <apache_beam.transforms.sql_test.SqlTransformTest testMethod=test_zetasql_generate_data>

    def test_zetasql_generate_data(self):
      with TestPipeline() as p:
>       out = p | SqlTransform(
            """SELECT
              CAST(1 AS INT64) AS `int`,
              CAST('foo' AS STRING) AS `str`,
              CAST(3.14  AS FLOAT64) AS `flt`""",
            dialect="zetasql")

apache_beam/transforms/sql_test.py:154: 
_ _ _ _ _ _ _ _ _ _ _ _ _ _ _ _ _ _ _ _ _ _ _ _ _ _ _ _ _ _ _ _ _ _ _ _ _ _ _ _ 
apache_beam/transforms/ptransform.py:614: in __ror__
    result = p.apply(self, pvalueish, label)
apache_beam/pipeline.py:712: in apply
    pvalueish_result = self.runner.apply(transform, pvalueish, self._options)
apache_beam/runners/runner.py:185: in apply
    return m(transform, input, options)
apache_beam/runners/runner.py:215: in apply_PTransform
    return transform.expand(input)
apache_beam/transforms/external.py:678: in expand
    with ExternalTransform.service(expansion_service) as service:
/usr/lib/python3.8/contextlib.py:113: in __enter__
    return next(self.gen)
apache_beam/transforms/external.py:733: in service
    with expansion_service as stub:
apache_beam/transforms/external.py:944: in __enter__
    self._service = self._service_provider.__enter__()
apache_beam/utils/subprocess_server.py:72: in __enter__
    return self.start()
_ _ _ _ _ _ _ _ _ _ _ _ _ _ _ _ _ _ _ _ _ _ _ _ _ _ _ _ _ _ _ _ _ _ _ _ _ _ _ _ 

self = <apache_beam.utils.subprocess_server.JavaJarServer object at 0x7f43cfe79af0>

    def start(self):
      try:
        endpoint = self.start_process()
        wait_secs = .1
        channel_options = [("grpc.max_receive_message_length", -1),
                           ("grpc.max_send_message_length", -1)]
        channel = grpc.insecure_channel(endpoint, options=channel_options)
        channel_ready = grpc.channel_ready_future(channel)
        while True:
          if self._process is not None and self._process.poll() is not None:
            _LOGGER.error("Starting job service with %s", self._process.args)
>           raise RuntimeError(
                'Service failed to start up with error %s' % self._process.poll())
E               RuntimeError: Service failed to start up with error 1

apache_beam/utils/subprocess_server.py:88: RuntimeError
------------------------------ Captured log call -------------------------------
INFO     apache_beam.utils.subprocess_server:subprocess_server.py:239 Using pre-built snapshot at <https://ci-beam.apache.org/job/beam_PostCommit_XVR_Spark3/ws/src/sdks/java/extensions/sql/expansion-service/build/libs/beam-sdks-java-extensions-sql-expansion-service-2.50.0-SNAPSHOT.jar>
INFO     root:external.py:929 Starting a JAR-based expansion service from JAR <https://ci-beam.apache.org/job/beam_PostCommit_XVR_Spark3/ws/src/sdks/java/extensions/sql/expansion-service/build/libs/beam-sdks-java-extensions-sql-expansion-service-2.50.0-SNAPSHOT.jar> 
INFO     apache_beam.utils.subprocess_server:subprocess_server.py:116 Starting service with ['java' '-jar' '<https://ci-beam.apache.org/job/beam_PostCommit_XVR_Spark3/ws/src/sdks/java/extensions/sql/expansion-service/build/libs/beam-sdks-java-extensions-sql-expansion-service-2.50.0-SNAPSHOT.jar'> '57899' '--filesToStage=<https://ci-beam.apache.org/job/beam_PostCommit_XVR_Spark3/ws/src/sdks/java/extensions/sql/expansion-service/build/libs/beam-sdks-java-extensions-sql-expansion-service-2.50.0-SNAPSHOT.jar']>
INFO     apache_beam.utils.subprocess_server:subprocess_server.py:126 Error: Invalid or corrupt jarfile <https://ci-beam.apache.org/job/beam_PostCommit_XVR_Spark3/ws/src/sdks/java/extensions/sql/expansion-service/build/libs/beam-sdks-java-extensions-sql-expansion-service-2.50.0-SNAPSHOT.jar>
ERROR    apache_beam.utils.subprocess_server:subprocess_server.py:87 Starting job service with ['java', '-jar', '<https://ci-beam.apache.org/job/beam_PostCommit_XVR_Spark3/ws/src/sdks/java/extensions/sql/expansion-service/build/libs/beam-sdks-java-extensions-sql-expansion-service-2.50.0-SNAPSHOT.jar',> '57899', '--filesToStage=<https://ci-beam.apache.org/job/beam_PostCommit_XVR_Spark3/ws/src/sdks/java/extensions/sql/expansion-service/build/libs/beam-sdks-java-extensions-sql-expansion-service-2.50.0-SNAPSHOT.jar']>
ERROR    apache_beam.utils.subprocess_server:subprocess_server.py:101 Error bringing up service
Traceback (most recent call last):
  File "<https://ci-beam.apache.org/job/beam_PostCommit_XVR_Spark3/ws/src/sdks/python/apache_beam/utils/subprocess_server.py",> line 88, in start
    raise RuntimeError(
RuntimeError: Service failed to start up with error 1
=============================== warnings summary ===============================
../../build/gradleenv/1922375555/lib/python3.8/site-packages/hdfs/config.py:15
  <https://ci-beam.apache.org/job/beam_PostCommit_XVR_Spark3/ws/src/build/gradleenv/1922375555/lib/python3.8/site-packages/hdfs/config.py>:15: DeprecationWarning: the imp module is deprecated in favour of importlib; see the module's documentation for alternative uses
    from imp import load_source

../../build/gradleenv/1922375555/lib/python3.8/site-packages/google/rpc/__init__.py:18
  <https://ci-beam.apache.org/job/beam_PostCommit_XVR_Spark3/ws/src/build/gradleenv/1922375555/lib/python3.8/site-packages/google/rpc/__init__.py>:18: DeprecationWarning: pkg_resources is deprecated as an API. See https://setuptools.pypa.io/en/latest/pkg_resources.html
    import pkg_resources

../../build/gradleenv/1922375555/lib/python3.8/site-packages/pkg_resources/__init__.py:2871: 20 warnings
  <https://ci-beam.apache.org/job/beam_PostCommit_XVR_Spark3/ws/src/build/gradleenv/1922375555/lib/python3.8/site-packages/pkg_resources/__init__.py>:2871: DeprecationWarning: Deprecated call to `pkg_resources.declare_namespace('google')`.
  Implementing implicit namespace packages (as specified in PEP 420) is preferred to `pkg_resources.declare_namespace`. See https://setuptools.pypa.io/en/latest/references/keywords.html#keyword-namespace-packages
    declare_namespace(pkg)

../../build/gradleenv/1922375555/lib/python3.8/site-packages/pkg_resources/__init__.py:2871: 16 warnings
  <https://ci-beam.apache.org/job/beam_PostCommit_XVR_Spark3/ws/src/build/gradleenv/1922375555/lib/python3.8/site-packages/pkg_resources/__init__.py>:2871: DeprecationWarning: Deprecated call to `pkg_resources.declare_namespace('google.cloud')`.
  Implementing implicit namespace packages (as specified in PEP 420) is preferred to `pkg_resources.declare_namespace`. See https://setuptools.pypa.io/en/latest/references/keywords.html#keyword-namespace-packages
    declare_namespace(pkg)

../../build/gradleenv/1922375555/lib/python3.8/site-packages/pkg_resources/__init__.py:2350
../../build/gradleenv/1922375555/lib/python3.8/site-packages/pkg_resources/__init__.py:2350
../../build/gradleenv/1922375555/lib/python3.8/site-packages/pkg_resources/__init__.py:2350
../../build/gradleenv/1922375555/lib/python3.8/site-packages/pkg_resources/__init__.py:2350
  <https://ci-beam.apache.org/job/beam_PostCommit_XVR_Spark3/ws/src/build/gradleenv/1922375555/lib/python3.8/site-packages/pkg_resources/__init__.py>:2350: DeprecationWarning: Deprecated call to `pkg_resources.declare_namespace('google')`.
  Implementing implicit namespace packages (as specified in PEP 420) is preferred to `pkg_resources.declare_namespace`. See https://setuptools.pypa.io/en/latest/references/keywords.html#keyword-namespace-packages
    declare_namespace(parent)

../../build/gradleenv/1922375555/lib/python3.8/site-packages/pkg_resources/__init__.py:2871
  <https://ci-beam.apache.org/job/beam_PostCommit_XVR_Spark3/ws/src/build/gradleenv/1922375555/lib/python3.8/site-packages/pkg_resources/__init__.py>:2871: DeprecationWarning: Deprecated call to `pkg_resources.declare_namespace('google.logging')`.
  Implementing implicit namespace packages (as specified in PEP 420) is preferred to `pkg_resources.declare_namespace`. See https://setuptools.pypa.io/en/latest/references/keywords.html#keyword-namespace-packages
    declare_namespace(pkg)

../../build/gradleenv/1922375555/lib/python3.8/site-packages/pkg_resources/__init__.py:2871
  <https://ci-beam.apache.org/job/beam_PostCommit_XVR_Spark3/ws/src/build/gradleenv/1922375555/lib/python3.8/site-packages/pkg_resources/__init__.py>:2871: DeprecationWarning: Deprecated call to `pkg_resources.declare_namespace('google.iam')`.
  Implementing implicit namespace packages (as specified in PEP 420) is preferred to `pkg_resources.declare_namespace`. See https://setuptools.pypa.io/en/latest/references/keywords.html#keyword-namespace-packages
    declare_namespace(pkg)

../../build/gradleenv/1922375555/lib/python3.8/site-packages/google/rpc/__init__.py:20
  <https://ci-beam.apache.org/job/beam_PostCommit_XVR_Spark3/ws/src/build/gradleenv/1922375555/lib/python3.8/site-packages/google/rpc/__init__.py>:20: DeprecationWarning: Deprecated call to `pkg_resources.declare_namespace('google.rpc')`.
  Implementing implicit namespace packages (as specified in PEP 420) is preferred to `pkg_resources.declare_namespace`. See https://setuptools.pypa.io/en/latest/references/keywords.html#keyword-namespace-packages
    pkg_resources.declare_namespace(__name__)

apache_beam/typehints/pandas_type_compatibility_test.py:67
  <https://ci-beam.apache.org/job/beam_PostCommit_XVR_Spark3/ws/src/sdks/python/apache_beam/typehints/pandas_type_compatibility_test.py>:67: FutureWarning: pandas.Int64Index is deprecated and will be removed from pandas in a future version. Use pandas.Index with the appropriate dtype instead.
    }).set_index(pd.Int64Index(range(123, 223), name='an_index')),

apache_beam/typehints/pandas_type_compatibility_test.py:90
  <https://ci-beam.apache.org/job/beam_PostCommit_XVR_Spark3/ws/src/sdks/python/apache_beam/typehints/pandas_type_compatibility_test.py>:90: FutureWarning: pandas.Int64Index is deprecated and will be removed from pandas in a future version. Use pandas.Index with the appropriate dtype instead.
    pd.Int64Index(range(123, 223), name='an_index'),

apache_beam/typehints/pandas_type_compatibility_test.py:91
  <https://ci-beam.apache.org/job/beam_PostCommit_XVR_Spark3/ws/src/sdks/python/apache_beam/typehints/pandas_type_compatibility_test.py>:91: FutureWarning: pandas.Int64Index is deprecated and will be removed from pandas in a future version. Use pandas.Index with the appropriate dtype instead.
    pd.Int64Index(range(475, 575), name='another_index'),

apache_beam/transforms/sql_test.py::SqlTransformTest::test_agg
apache_beam/transforms/sql_test.py::SqlTransformTest::test_filter
apache_beam/transforms/sql_test.py::SqlTransformTest::test_generate_data
apache_beam/transforms/sql_test.py::SqlTransformTest::test_map
apache_beam/transforms/sql_test.py::SqlTransformTest::test_project
apache_beam/transforms/sql_test.py::SqlTransformTest::test_row
apache_beam/transforms/sql_test.py::SqlTransformTest::test_tagged_join
apache_beam/transforms/sql_test.py::SqlTransformTest::test_windowing_before_sql
apache_beam/transforms/sql_test.py::SqlTransformTest::test_zetasql_generate_data
  <https://ci-beam.apache.org/job/beam_PostCommit_XVR_Spark3/ws/src/sdks/python/apache_beam/transforms/external.py>:676: BeamDeprecationWarning: options is deprecated since First stable release. References to <pipeline>.options will not be supported
    self._expansion_service, pipeline.options)

-- Docs: https://docs.pytest.org/en/stable/how-to/capture-warnings.html
- generated xml file: <https://ci-beam.apache.org/job/beam_PostCommit_XVR_Spark3/ws/src/sdks/python/pytest_xlangSqlValidateRunner.xml> -
=========================== short test summary info ============================
FAILED apache_beam/transforms/sql_test.py::SqlTransformTest::test_agg - RuntimeError: Service failed to start up with error 1
FAILED apache_beam/transforms/sql_test.py::SqlTransformTest::test_filter - RuntimeError: Service failed to start up with error 1
FAILED apache_beam/transforms/sql_test.py::SqlTransformTest::test_generate_data - RuntimeError: Service failed to start up with error 1
FAILED apache_beam/transforms/sql_test.py::SqlTransformTest::test_map - RuntimeError: Service failed to start up with error 1
FAILED apache_beam/transforms/sql_test.py::SqlTransformTest::test_project - RuntimeError: Service failed to start up with error 1
FAILED apache_beam/transforms/sql_test.py::SqlTransformTest::test_row - RuntimeError: Service failed to start up with error 1
FAILED apache_beam/transforms/sql_test.py::SqlTransformTest::test_tagged_join - RuntimeError: Service failed to start up with error 1
FAILED apache_beam/transforms/sql_test.py::SqlTransformTest::test_windowing_before_sql - RuntimeError: Service failed to start up with error 1
FAILED apache_beam/transforms/sql_test.py::SqlTransformTest::test_zetasql_generate_data - RuntimeError: Service failed to start up with error 1
========= 9 failed, 14 skipped, 6945 deselected, 57 warnings in 10.49s =========

> Task :runners:spark:3:job-server:validatesCrossLanguageRunnerPythonUsingSql FAILED

> Task :runners:spark:3:job-server:sparkJobServerCleanup
Stopping job server pid: 3300921.

> Task :runners:spark:3:job-server:validatesCrossLanguageRunnerCleanup
Stopping expansion service pid: 3302084.
Stopping expansion service pid: 3302085.

FAILURE: Build completed with 2 failures.

1: Task failed with an exception.
-----------
* Where:
Build file '<https://ci-beam.apache.org/job/beam_PostCommit_XVR_Spark3/ws/src/sdks/go/test/build.gradle'> line: 217

* What went wrong:
Execution failed for task ':runners:spark:3:job-server:validatesCrossLanguageRunnerGoUsingJava'.
> Process 'command 'sh'' finished with non-zero exit value 1

* Try:
> Run with --stacktrace option to get the stack trace.
> Run with --info or --debug option to get more log output.
==============================================================================

2: Task failed with an exception.
-----------
* What went wrong:
Execution failed for task ':runners:spark:3:job-server:validatesCrossLanguageRunnerPythonUsingSql'.
> Process 'command 'sh'' finished with non-zero exit value 1

* Try:
> Run with --stacktrace option to get the stack trace.
> Run with --info or --debug option to get more log output.
==============================================================================

* Get more help at https://help.gradle.org

Deprecated Gradle features were used in this build, making it incompatible with Gradle 8.0.

You can use '--warning-mode all' to show the individual deprecation warnings and determine if they come from your own scripts or plugins.

See https://docs.gradle.org/7.6.2/userguide/command_line_interface.html#sec:command_line_warnings

Execution optimizations have been disabled for 1 invalid unit(s) of work during this build to ensure correctness.
Please consult deprecation warnings for more details.

BUILD FAILED in 32m 21s
274 actionable tasks: 183 executed, 79 from cache, 12 up-to-date

Publishing build scan...
https://ge.apache.org/s/55l3mle7zndgc

Build step 'Invoke Gradle script' changed build result to FAILURE
Build step 'Invoke Gradle script' marked build as failure

---------------------------------------------------------------------
To unsubscribe, e-mail: builds-unsubscribe@beam.apache.org
For additional commands, e-mail: builds-help@beam.apache.org


Jenkins build is back to normal : beam_PostCommit_XVR_Spark3 #3431

Posted by Apache Jenkins Server <je...@builds.apache.org>.
See <https://ci-beam.apache.org/job/beam_PostCommit_XVR_Spark3/3431/display/redirect>


---------------------------------------------------------------------
To unsubscribe, e-mail: builds-unsubscribe@beam.apache.org
For additional commands, e-mail: builds-help@beam.apache.org


Build failed in Jenkins: beam_PostCommit_XVR_Spark3 #3430

Posted by Apache Jenkins Server <je...@builds.apache.org>.
See <https://ci-beam.apache.org/job/beam_PostCommit_XVR_Spark3/3430/display/redirect?page=changes>

Changes:

[noreply] Bump golang.org/x/oauth2 from 0.10.0 to 0.11.0 in /sdks (#27870)


------------------------------------------
[...truncated 1.21 MB...]
self = <apache_beam.transforms.sql_test.SqlTransformTest testMethod=test_windowing_before_sql>

    def test_windowing_before_sql(self):
      with TestPipeline() as p:
        out = (
>           p | beam.Create([
                SimpleRow(5, "foo", 1.),
                SimpleRow(15, "bar", 2.),
                SimpleRow(25, "baz", 3.)
            ])
            | beam.Map(lambda v: beam.window.TimestampedValue(v, v.id)).
            with_output_types(SimpleRow)
            | beam.WindowInto(
                beam.window.FixedWindows(10)).with_output_types(SimpleRow)
            | SqlTransform("SELECT COUNT(*) as `count` FROM PCOLLECTION"))

apache_beam/transforms/sql_test.py:165: 
_ _ _ _ _ _ _ _ _ _ _ _ _ _ _ _ _ _ _ _ _ _ _ _ _ _ _ _ _ _ _ _ _ _ _ _ _ _ _ _ 
apache_beam/pvalue.py:137: in __or__
    return self.pipeline.apply(ptransform, self)
apache_beam/pipeline.py:712: in apply
    pvalueish_result = self.runner.apply(transform, pvalueish, self._options)
apache_beam/runners/runner.py:185: in apply
    return m(transform, input, options)
apache_beam/runners/runner.py:215: in apply_PTransform
    return transform.expand(input)
apache_beam/transforms/external.py:678: in expand
    with ExternalTransform.service(expansion_service) as service:
/usr/lib/python3.8/contextlib.py:113: in __enter__
    return next(self.gen)
apache_beam/transforms/external.py:733: in service
    with expansion_service as stub:
apache_beam/transforms/external.py:944: in __enter__
    self._service = self._service_provider.__enter__()
apache_beam/utils/subprocess_server.py:72: in __enter__
    return self.start()
_ _ _ _ _ _ _ _ _ _ _ _ _ _ _ _ _ _ _ _ _ _ _ _ _ _ _ _ _ _ _ _ _ _ _ _ _ _ _ _ 

self = <apache_beam.utils.subprocess_server.JavaJarServer object at 0x7f28b98c7a00>

    def start(self):
      try:
        endpoint = self.start_process()
        wait_secs = .1
        channel_options = [("grpc.max_receive_message_length", -1),
                           ("grpc.max_send_message_length", -1)]
        channel = grpc.insecure_channel(endpoint, options=channel_options)
        channel_ready = grpc.channel_ready_future(channel)
        while True:
          if self._process is not None and self._process.poll() is not None:
            _LOGGER.error("Starting job service with %s", self._process.args)
>           raise RuntimeError(
                'Service failed to start up with error %s' % self._process.poll())
E               RuntimeError: Service failed to start up with error 1

apache_beam/utils/subprocess_server.py:88: RuntimeError
------------------------------ Captured log call -------------------------------
INFO     apache_beam.utils.subprocess_server:subprocess_server.py:239 Using pre-built snapshot at <https://ci-beam.apache.org/job/beam_PostCommit_XVR_Spark3/ws/src/sdks/java/extensions/sql/expansion-service/build/libs/beam-sdks-java-extensions-sql-expansion-service-2.50.0-SNAPSHOT.jar>
INFO     root:external.py:929 Starting a JAR-based expansion service from JAR <https://ci-beam.apache.org/job/beam_PostCommit_XVR_Spark3/ws/src/sdks/java/extensions/sql/expansion-service/build/libs/beam-sdks-java-extensions-sql-expansion-service-2.50.0-SNAPSHOT.jar> 
INFO     apache_beam.utils.subprocess_server:subprocess_server.py:116 Starting service with ['java' '-jar' '<https://ci-beam.apache.org/job/beam_PostCommit_XVR_Spark3/ws/src/sdks/java/extensions/sql/expansion-service/build/libs/beam-sdks-java-extensions-sql-expansion-service-2.50.0-SNAPSHOT.jar'> '37403' '--filesToStage=<https://ci-beam.apache.org/job/beam_PostCommit_XVR_Spark3/ws/src/sdks/java/extensions/sql/expansion-service/build/libs/beam-sdks-java-extensions-sql-expansion-service-2.50.0-SNAPSHOT.jar']>
INFO     apache_beam.utils.subprocess_server:subprocess_server.py:126 Error: Invalid or corrupt jarfile <https://ci-beam.apache.org/job/beam_PostCommit_XVR_Spark3/ws/src/sdks/java/extensions/sql/expansion-service/build/libs/beam-sdks-java-extensions-sql-expansion-service-2.50.0-SNAPSHOT.jar>
ERROR    apache_beam.utils.subprocess_server:subprocess_server.py:87 Starting job service with ['java', '-jar', '<https://ci-beam.apache.org/job/beam_PostCommit_XVR_Spark3/ws/src/sdks/java/extensions/sql/expansion-service/build/libs/beam-sdks-java-extensions-sql-expansion-service-2.50.0-SNAPSHOT.jar',> '37403', '--filesToStage=<https://ci-beam.apache.org/job/beam_PostCommit_XVR_Spark3/ws/src/sdks/java/extensions/sql/expansion-service/build/libs/beam-sdks-java-extensions-sql-expansion-service-2.50.0-SNAPSHOT.jar']>
ERROR    apache_beam.utils.subprocess_server:subprocess_server.py:101 Error bringing up service
Traceback (most recent call last):
  File "<https://ci-beam.apache.org/job/beam_PostCommit_XVR_Spark3/ws/src/sdks/python/apache_beam/utils/subprocess_server.py",> line 88, in start
    raise RuntimeError(
RuntimeError: Service failed to start up with error 1
_________________ SqlTransformTest.test_zetasql_generate_data __________________

self = <apache_beam.transforms.sql_test.SqlTransformTest testMethod=test_zetasql_generate_data>

    def test_zetasql_generate_data(self):
      with TestPipeline() as p:
>       out = p | SqlTransform(
            """SELECT
              CAST(1 AS INT64) AS `int`,
              CAST('foo' AS STRING) AS `str`,
              CAST(3.14  AS FLOAT64) AS `flt`""",
            dialect="zetasql")

apache_beam/transforms/sql_test.py:154: 
_ _ _ _ _ _ _ _ _ _ _ _ _ _ _ _ _ _ _ _ _ _ _ _ _ _ _ _ _ _ _ _ _ _ _ _ _ _ _ _ 
apache_beam/transforms/ptransform.py:614: in __ror__
    result = p.apply(self, pvalueish, label)
apache_beam/pipeline.py:712: in apply
    pvalueish_result = self.runner.apply(transform, pvalueish, self._options)
apache_beam/runners/runner.py:185: in apply
    return m(transform, input, options)
apache_beam/runners/runner.py:215: in apply_PTransform
    return transform.expand(input)
apache_beam/transforms/external.py:678: in expand
    with ExternalTransform.service(expansion_service) as service:
/usr/lib/python3.8/contextlib.py:113: in __enter__
    return next(self.gen)
apache_beam/transforms/external.py:733: in service
    with expansion_service as stub:
apache_beam/transforms/external.py:944: in __enter__
    self._service = self._service_provider.__enter__()
apache_beam/utils/subprocess_server.py:72: in __enter__
    return self.start()
_ _ _ _ _ _ _ _ _ _ _ _ _ _ _ _ _ _ _ _ _ _ _ _ _ _ _ _ _ _ _ _ _ _ _ _ _ _ _ _ 

self = <apache_beam.utils.subprocess_server.JavaJarServer object at 0x7f28b92e9400>

    def start(self):
      try:
        endpoint = self.start_process()
        wait_secs = .1
        channel_options = [("grpc.max_receive_message_length", -1),
                           ("grpc.max_send_message_length", -1)]
        channel = grpc.insecure_channel(endpoint, options=channel_options)
        channel_ready = grpc.channel_ready_future(channel)
        while True:
          if self._process is not None and self._process.poll() is not None:
            _LOGGER.error("Starting job service with %s", self._process.args)
>           raise RuntimeError(
                'Service failed to start up with error %s' % self._process.poll())
E               RuntimeError: Service failed to start up with error 1

apache_beam/utils/subprocess_server.py:88: RuntimeError
------------------------------ Captured log call -------------------------------
INFO     apache_beam.utils.subprocess_server:subprocess_server.py:239 Using pre-built snapshot at <https://ci-beam.apache.org/job/beam_PostCommit_XVR_Spark3/ws/src/sdks/java/extensions/sql/expansion-service/build/libs/beam-sdks-java-extensions-sql-expansion-service-2.50.0-SNAPSHOT.jar>
INFO     root:external.py:929 Starting a JAR-based expansion service from JAR <https://ci-beam.apache.org/job/beam_PostCommit_XVR_Spark3/ws/src/sdks/java/extensions/sql/expansion-service/build/libs/beam-sdks-java-extensions-sql-expansion-service-2.50.0-SNAPSHOT.jar> 
INFO     apache_beam.utils.subprocess_server:subprocess_server.py:116 Starting service with ['java' '-jar' '<https://ci-beam.apache.org/job/beam_PostCommit_XVR_Spark3/ws/src/sdks/java/extensions/sql/expansion-service/build/libs/beam-sdks-java-extensions-sql-expansion-service-2.50.0-SNAPSHOT.jar'> '43695' '--filesToStage=<https://ci-beam.apache.org/job/beam_PostCommit_XVR_Spark3/ws/src/sdks/java/extensions/sql/expansion-service/build/libs/beam-sdks-java-extensions-sql-expansion-service-2.50.0-SNAPSHOT.jar']>
INFO     apache_beam.utils.subprocess_server:subprocess_server.py:126 Error: Invalid or corrupt jarfile <https://ci-beam.apache.org/job/beam_PostCommit_XVR_Spark3/ws/src/sdks/java/extensions/sql/expansion-service/build/libs/beam-sdks-java-extensions-sql-expansion-service-2.50.0-SNAPSHOT.jar>
ERROR    apache_beam.utils.subprocess_server:subprocess_server.py:87 Starting job service with ['java', '-jar', '<https://ci-beam.apache.org/job/beam_PostCommit_XVR_Spark3/ws/src/sdks/java/extensions/sql/expansion-service/build/libs/beam-sdks-java-extensions-sql-expansion-service-2.50.0-SNAPSHOT.jar',> '43695', '--filesToStage=<https://ci-beam.apache.org/job/beam_PostCommit_XVR_Spark3/ws/src/sdks/java/extensions/sql/expansion-service/build/libs/beam-sdks-java-extensions-sql-expansion-service-2.50.0-SNAPSHOT.jar']>
ERROR    apache_beam.utils.subprocess_server:subprocess_server.py:101 Error bringing up service
Traceback (most recent call last):
  File "<https://ci-beam.apache.org/job/beam_PostCommit_XVR_Spark3/ws/src/sdks/python/apache_beam/utils/subprocess_server.py",> line 88, in start
    raise RuntimeError(
RuntimeError: Service failed to start up with error 1
=============================== warnings summary ===============================
../../build/gradleenv/1922375555/lib/python3.8/site-packages/hdfs/config.py:15
  <https://ci-beam.apache.org/job/beam_PostCommit_XVR_Spark3/ws/src/build/gradleenv/1922375555/lib/python3.8/site-packages/hdfs/config.py>:15: DeprecationWarning: the imp module is deprecated in favour of importlib; see the module's documentation for alternative uses
    from imp import load_source

../../build/gradleenv/1922375555/lib/python3.8/site-packages/google/rpc/__init__.py:18
  <https://ci-beam.apache.org/job/beam_PostCommit_XVR_Spark3/ws/src/build/gradleenv/1922375555/lib/python3.8/site-packages/google/rpc/__init__.py>:18: DeprecationWarning: pkg_resources is deprecated as an API. See https://setuptools.pypa.io/en/latest/pkg_resources.html
    import pkg_resources

../../build/gradleenv/1922375555/lib/python3.8/site-packages/pkg_resources/__init__.py:2871: 20 warnings
  <https://ci-beam.apache.org/job/beam_PostCommit_XVR_Spark3/ws/src/build/gradleenv/1922375555/lib/python3.8/site-packages/pkg_resources/__init__.py>:2871: DeprecationWarning: Deprecated call to `pkg_resources.declare_namespace('google')`.
  Implementing implicit namespace packages (as specified in PEP 420) is preferred to `pkg_resources.declare_namespace`. See https://setuptools.pypa.io/en/latest/references/keywords.html#keyword-namespace-packages
    declare_namespace(pkg)

../../build/gradleenv/1922375555/lib/python3.8/site-packages/pkg_resources/__init__.py:2871: 16 warnings
  <https://ci-beam.apache.org/job/beam_PostCommit_XVR_Spark3/ws/src/build/gradleenv/1922375555/lib/python3.8/site-packages/pkg_resources/__init__.py>:2871: DeprecationWarning: Deprecated call to `pkg_resources.declare_namespace('google.cloud')`.
  Implementing implicit namespace packages (as specified in PEP 420) is preferred to `pkg_resources.declare_namespace`. See https://setuptools.pypa.io/en/latest/references/keywords.html#keyword-namespace-packages
    declare_namespace(pkg)

../../build/gradleenv/1922375555/lib/python3.8/site-packages/pkg_resources/__init__.py:2350
../../build/gradleenv/1922375555/lib/python3.8/site-packages/pkg_resources/__init__.py:2350
../../build/gradleenv/1922375555/lib/python3.8/site-packages/pkg_resources/__init__.py:2350
../../build/gradleenv/1922375555/lib/python3.8/site-packages/pkg_resources/__init__.py:2350
  <https://ci-beam.apache.org/job/beam_PostCommit_XVR_Spark3/ws/src/build/gradleenv/1922375555/lib/python3.8/site-packages/pkg_resources/__init__.py>:2350: DeprecationWarning: Deprecated call to `pkg_resources.declare_namespace('google')`.
  Implementing implicit namespace packages (as specified in PEP 420) is preferred to `pkg_resources.declare_namespace`. See https://setuptools.pypa.io/en/latest/references/keywords.html#keyword-namespace-packages
    declare_namespace(parent)

../../build/gradleenv/1922375555/lib/python3.8/site-packages/pkg_resources/__init__.py:2871
  <https://ci-beam.apache.org/job/beam_PostCommit_XVR_Spark3/ws/src/build/gradleenv/1922375555/lib/python3.8/site-packages/pkg_resources/__init__.py>:2871: DeprecationWarning: Deprecated call to `pkg_resources.declare_namespace('google.logging')`.
  Implementing implicit namespace packages (as specified in PEP 420) is preferred to `pkg_resources.declare_namespace`. See https://setuptools.pypa.io/en/latest/references/keywords.html#keyword-namespace-packages
    declare_namespace(pkg)

../../build/gradleenv/1922375555/lib/python3.8/site-packages/pkg_resources/__init__.py:2871
  <https://ci-beam.apache.org/job/beam_PostCommit_XVR_Spark3/ws/src/build/gradleenv/1922375555/lib/python3.8/site-packages/pkg_resources/__init__.py>:2871: DeprecationWarning: Deprecated call to `pkg_resources.declare_namespace('google.iam')`.
  Implementing implicit namespace packages (as specified in PEP 420) is preferred to `pkg_resources.declare_namespace`. See https://setuptools.pypa.io/en/latest/references/keywords.html#keyword-namespace-packages
    declare_namespace(pkg)

../../build/gradleenv/1922375555/lib/python3.8/site-packages/google/rpc/__init__.py:20
  <https://ci-beam.apache.org/job/beam_PostCommit_XVR_Spark3/ws/src/build/gradleenv/1922375555/lib/python3.8/site-packages/google/rpc/__init__.py>:20: DeprecationWarning: Deprecated call to `pkg_resources.declare_namespace('google.rpc')`.
  Implementing implicit namespace packages (as specified in PEP 420) is preferred to `pkg_resources.declare_namespace`. See https://setuptools.pypa.io/en/latest/references/keywords.html#keyword-namespace-packages
    pkg_resources.declare_namespace(__name__)

apache_beam/typehints/pandas_type_compatibility_test.py:67
  <https://ci-beam.apache.org/job/beam_PostCommit_XVR_Spark3/ws/src/sdks/python/apache_beam/typehints/pandas_type_compatibility_test.py>:67: FutureWarning: pandas.Int64Index is deprecated and will be removed from pandas in a future version. Use pandas.Index with the appropriate dtype instead.
    }).set_index(pd.Int64Index(range(123, 223), name='an_index')),

apache_beam/typehints/pandas_type_compatibility_test.py:90
  <https://ci-beam.apache.org/job/beam_PostCommit_XVR_Spark3/ws/src/sdks/python/apache_beam/typehints/pandas_type_compatibility_test.py>:90: FutureWarning: pandas.Int64Index is deprecated and will be removed from pandas in a future version. Use pandas.Index with the appropriate dtype instead.
    pd.Int64Index(range(123, 223), name='an_index'),

apache_beam/typehints/pandas_type_compatibility_test.py:91
  <https://ci-beam.apache.org/job/beam_PostCommit_XVR_Spark3/ws/src/sdks/python/apache_beam/typehints/pandas_type_compatibility_test.py>:91: FutureWarning: pandas.Int64Index is deprecated and will be removed from pandas in a future version. Use pandas.Index with the appropriate dtype instead.
    pd.Int64Index(range(475, 575), name='another_index'),

apache_beam/transforms/sql_test.py::SqlTransformTest::test_agg
apache_beam/transforms/sql_test.py::SqlTransformTest::test_filter
apache_beam/transforms/sql_test.py::SqlTransformTest::test_generate_data
apache_beam/transforms/sql_test.py::SqlTransformTest::test_map
apache_beam/transforms/sql_test.py::SqlTransformTest::test_project
apache_beam/transforms/sql_test.py::SqlTransformTest::test_row
apache_beam/transforms/sql_test.py::SqlTransformTest::test_tagged_join
apache_beam/transforms/sql_test.py::SqlTransformTest::test_windowing_before_sql
apache_beam/transforms/sql_test.py::SqlTransformTest::test_zetasql_generate_data
  <https://ci-beam.apache.org/job/beam_PostCommit_XVR_Spark3/ws/src/sdks/python/apache_beam/transforms/external.py>:676: BeamDeprecationWarning: options is deprecated since First stable release. References to <pipeline>.options will not be supported
    self._expansion_service, pipeline.options)

-- Docs: https://docs.pytest.org/en/stable/how-to/capture-warnings.html
- generated xml file: <https://ci-beam.apache.org/job/beam_PostCommit_XVR_Spark3/ws/src/sdks/python/pytest_xlangSqlValidateRunner.xml> -
=========================== short test summary info ============================
FAILED apache_beam/transforms/sql_test.py::SqlTransformTest::test_agg - RuntimeError: Service failed to start up with error 1
FAILED apache_beam/transforms/sql_test.py::SqlTransformTest::test_filter - RuntimeError: Service failed to start up with error 1
FAILED apache_beam/transforms/sql_test.py::SqlTransformTest::test_generate_data - RuntimeError: Service failed to start up with error 1
FAILED apache_beam/transforms/sql_test.py::SqlTransformTest::test_map - RuntimeError: Service failed to start up with error 1
FAILED apache_beam/transforms/sql_test.py::SqlTransformTest::test_project - RuntimeError: Service failed to start up with error 1
FAILED apache_beam/transforms/sql_test.py::SqlTransformTest::test_row - RuntimeError: Service failed to start up with error 1
FAILED apache_beam/transforms/sql_test.py::SqlTransformTest::test_tagged_join - RuntimeError: Service failed to start up with error 1
FAILED apache_beam/transforms/sql_test.py::SqlTransformTest::test_windowing_before_sql - RuntimeError: Service failed to start up with error 1
FAILED apache_beam/transforms/sql_test.py::SqlTransformTest::test_zetasql_generate_data - RuntimeError: Service failed to start up with error 1
========= 9 failed, 14 skipped, 6945 deselected, 57 warnings in 13.33s =========

> Task :runners:spark:3:job-server:validatesCrossLanguageRunnerPythonUsingSql FAILED

> Task :runners:spark:3:job-server:sparkJobServerCleanup
Stopping job server pid: 746642.

> Task :runners:spark:3:job-server:validatesCrossLanguageRunnerCleanup
Stopping expansion service pid: 753820.
Stopping expansion service pid: 753821.

FAILURE: Build failed with an exception.

* What went wrong:
Execution failed for task ':runners:spark:3:job-server:validatesCrossLanguageRunnerPythonUsingSql'.
> Process 'command 'sh'' finished with non-zero exit value 1

* Try:
> Run with --stacktrace option to get the stack trace.
> Run with --info or --debug option to get more log output.

* Get more help at https://help.gradle.org

Deprecated Gradle features were used in this build, making it incompatible with Gradle 8.0.

You can use '--warning-mode all' to show the individual deprecation warnings and determine if they come from your own scripts or plugins.

See https://docs.gradle.org/7.6.2/userguide/command_line_interface.html#sec:command_line_warnings

Execution optimizations have been disabled for 1 invalid unit(s) of work during this build to ensure correctness.
Please consult deprecation warnings for more details.

BUILD FAILED in 36m 42s
274 actionable tasks: 178 executed, 84 from cache, 12 up-to-date

Publishing build scan...
https://ge.apache.org/s/cqowt76jfbzje

Build step 'Invoke Gradle script' changed build result to FAILURE
Build step 'Invoke Gradle script' marked build as failure

---------------------------------------------------------------------
To unsubscribe, e-mail: builds-unsubscribe@beam.apache.org
For additional commands, e-mail: builds-help@beam.apache.org


Build failed in Jenkins: beam_PostCommit_XVR_Spark3 #3429

Posted by Apache Jenkins Server <je...@builds.apache.org>.
See <https://ci-beam.apache.org/job/beam_PostCommit_XVR_Spark3/3429/display/redirect>

Changes:


------------------------------------------
[...truncated 867.59 KB...]
        urn: "beam:coders:javasdk:0.1"
        payload: "\202SNAPPY\000\000\000\000\001\000\000\000\001\000\000\001\213\311\005\320\254\355\000\005sr\000Corg.apache.beam.sdk.values.ValueWithRecordId$B\022\000LCoder{\343\376bQ\014\204>\002\000\002L\000\007i\t\025\034t\000+Lorg/\t\\\000/\001\\\024/sdk/c\0012(s/ByteArray\005B\014;L\000\n\005u\005\016\010t\000\"n;\000\005$\020;xr\000*N\274\000\t`(.Structured\005/8s\277\022\016\325\3246\021\002\000\000xr\000 j9\000\005/\034C\335\325\211\256\274~\370\001/\020psr\000)j1\0006\312\000\034\351\277\005|\263\3746\333\001:\010r\000&j8\000\024Atomic\005o\034\307\354\265\314\205tPF\0015 q\000~\000\003sr\000-N;\000$io.kafka.K\001\006\000R%\227\005B<I\320\251Y\032\341{#\002\000\001L\000\007kv\005\025\010t\000$nH\001\000K\t&\000;\025s\000\"Ns\000-P\r- j\000\275\271\035\243\3126\002!\353\010\010ke)\277\001\264\000\0022\303\001\005\022\025Y\000(jY\000\030Nullabl)\372\034E\333\0336>\220\247\007\005\307]\022.O\000\001\014,\006sq\000~\000\016q\000~\000\020"
      >
    >
  >
  coders: <
    key: "EDTnMHNhmAVarIntCoder"
    value: <
      spec: <
        urn: "beam:coders:javasdk:0.1"
        payload: "\202SNAPPY\000\000\000\000\001\000\000\000\001\000\000\000\210\330\001\350\254\355\000\005sr\000&org.apache.beam.sdk.coders.VarIntCoder\300K2\332\251KVh\002\000\000xrr5\000\024Atomic\0055 \307\354\265\314\205tPF\002\0055\000*jj\000$Structured\0059\034s\277\022\016\325\3246\021\t9\000 j9\000\005/0C\335\325\211\256\274~\370\002\000\000xp"
      >
    >
  >
  coders: <
    key: "c0"
    value: <
      spec: <
        urn: "beam:coder:bytes:v1"
      >
    >
  >
  coders: <
    key: "c1"
    value: <
      spec: <
        urn: "beam:coder:global_window:v1"
      >
    >
  >
  coders: <
    key: "c2"
    value: <
      spec: <
        urn: "beam:go:coder:custom:v1"
        payload: "Cgd2YXJpbnR6EgIIAhpdCklnaXRodWIuY29tL2FwYWNoZS9iZWFtL3Nka3MvdjIvZ28vcGtnL2JlYW0vY29yZS9ydW50aW1lL2NvZGVyeC5lbmNWYXJJbnRaEhAIFiIECBlADyoGCBQSAggIImkKSWdpdGh1Yi5jb20vYXBhY2hlL2JlYW0vc2Rrcy92Mi9nby9wa2cvYmVhbS9jb3JlL3J1bnRpbWUvY29kZXJ4LmRlY1ZhckludFoSHAgWIgQIGUADIgYIFBICCAgqBAgZQA8qBAgZQAE="
      >
    >
  >
  coders: <
    key: "c3"
    value: <
      spec: <
        urn: "beam:coder:length_prefix:v1"
      >
      component_coder_ids: "c2"
    >
  >
  coders: <
    key: "c4"
    value: <
      spec: <
        urn: "beam:coder:kv:v1"
      >
      component_coder_ids: "c0"
      component_coder_ids: "c0"
    >
  >
  environments: <
    key: "EDTnMHNhmAbeam:env:docker:v1"
    value: <
      urn: "beam:env:docker:v1"
      payload: "\n apache/beam_java8_sdk:2.50.0.dev"
      capabilities: "beam:coder:bytes:v1"
      capabilities: "beam:coder:bool:v1"
      capabilities: "beam:coder:varint:v1"
      capabilities: "beam:coder:string_utf8:v1"
      capabilities: "beam:coder:iterable:v1"
      capabilities: "beam:coder:timer:v1"
      capabilities: "beam:coder:kv:v1"
      capabilities: "beam:coder:length_prefix:v1"
      capabilities: "beam:coder:global_window:v1"
      capabilities: "beam:coder:interval_window:v1"
      capabilities: "beam:coder:custom_window:v1"
      capabilities: "beam:coder:windowed_value:v1"
      capabilities: "beam:coder:double:v1"
      capabilities: "beam:coder:row:v1"
      capabilities: "beam:coder:param_windowed_value:v1"
      capabilities: "beam:coder:state_backed_iterable:v1"
      capabilities: "beam:coder:sharded_key:v1"
      capabilities: "beam:coder:nullable:v1"
      capabilities: "beam:protocol:multi_core_bundle_processing:v1"
      capabilities: "beam:protocol:progress_reporting:v1"
      capabilities: "beam:protocol:harness_monitoring_infos:v1"
      capabilities: "beam:protocol:control_request_elements_embedding:v1"
      capabilities: "beam:protocol:state_caching:v1"
      capabilities: "beam:version:sdk_base:apache/beam_java8_sdk:2.50.0.dev"
      capabilities: "beam:transform:sdf_truncate_sized_restrictions:v1"
      capabilities: "beam:transform:to_string:v1"
      capabilities: "beam:protocol:data_sampling:v1"
      dependencies: <
        type_urn: "beam:artifact:type:file:v1"
        type_payload: "\nL/tmp/artifacts/icedtea-sound-uoIQCGhMffp0D_gc1dkBtXBGXr18Bkb5Qx-e-CvP00s.jar\022@ba821008684c7dfa740ff81cd5d901b570465ebd7c0646f9431f9ef82bcfd34b"
        role_urn: "beam:artifact:role:staging_to:v1"
        role_payload: "\n=icedtea-sound-uoIQCGhMffp0D_gc1dkBtXBGXr18Bkb5Qx-e-CvP00s.jar"
      >
      dependencies: <
        type_urn: "beam:artifact:type:file:v1"
        type_payload: "\nF/tmp/artifacts/jaccess-T1qVdaqZDj2uNq1tdHEk1lwFMYQiwMhYa0jqGU9fUMg.jar\022@4f5a9575aa990e3dae36ad6d747124d65c05318422c0c8586b48ea194f5f50c8"
        role_urn: "beam:artifact:role:staging_to:v1"
        role_payload: "\n7jaccess-T1qVdaqZDj2uNq1tdHEk1lwFMYQiwMhYa0jqGU9fUMg.jar"
      >
      dependencies: <
        type_urn: "beam:artifact:type:file:v1"
        type_payload: "\nI/tmp/artifacts/localedata-dQT9YOGvbd1zEqcZsyJ1W4l8jNhxoX3b1nmMhdIbCb8.jar\022@7504fd60e1af6ddd7312a719b322755b897c8cd871a17ddbd6798c85d21b09bf"
        role_urn: "beam:artifact:role:staging_to:v1"
        role_payload: "\n:localedata-dQT9YOGvbd1zEqcZsyJ1W4l8jNhxoX3b1nmMhdIbCb8.jar"
      >
      dependencies: <
        type_urn: "beam:artifact:type:file:v1"
        type_payload: "\nF/tmp/artifacts/nashorn-gZxbPAWCb1KP7OCbxUu1prmT4YMEDX-mGdJFjkB3pfs.jar\022@819c5b3c05826f528fece09bc54bb5a6b993e183040d7fa619d2458e4077a5fb"
        role_urn: "beam:artifact:role:staging_to:v1"
        role_payload: "\n7nashorn-gZxbPAWCb1KP7OCbxUu1prmT4YMEDX-mGdJFjkB3pfs.jar"
      >
      dependencies: <
        type_urn: "beam:artifact:type:file:v1"
        type_payload: "\nG/tmp/artifacts/cldrdata-_GVjPlS0invvNh7wlTfv_CNVOxTj3Y-xvSW1Xw2r_-4.jar\022@fc65633e54b48a7bef361ef09537effc23553b14e3dd8fb1bd25b55f0dabffee"
        role_urn: "beam:artifact:role:staging_to:v1"
        role_payload: "\n8cldrdata-_GVjPlS0invvNh7wlTfv_CNVOxTj3Y-xvSW1Xw2r_-4.jar"
      >
      dependencies: <
        type_urn: "beam:artifact:type:file:v1"
        type_payload: "\nD/tmp/artifacts/dnsns-lI-xDSEZtu3C8A4-qt_7RcyP_ql7OU0LNZreNR5piTU.jar\022@948fb10d2119b6edc2f00e3eaadffb45cc8ffea97b394d0b359ade351e698935"
        role_urn: "beam:artifact:role:staging_to:v1"
        role_payload: "\n5dnsns-lI-xDSEZtu3C8A4-qt_7RcyP_ql7OU0LNZreNR5piTU.jar"
      >
      dependencies: <
        type_urn: "beam:artifact:type:file:v1"
        type_payload: "\nr/tmp/artifacts/beam-sdks-java-io-expansion-service-2.50.0-SNAPSHOT-laIirfe5DlRWhs4zZLc6h83GKIwlrr_6yWHJyx9K9JQ.jar\022@95a222adf7b90e545686ce3364b73a87cdc6288c25aebffac961c9cb1f4af494"
        role_urn: "beam:artifact:role:staging_to:v1"
        role_payload: "\ncbeam-sdks-java-io-expansion-service-2.50.0-SNAPSHOT-laIirfe5DlRWhs4zZLc6h83GKIwlrr_6yWHJyx9K9JQ.jar"
      >
    >
  >
  environments: <
    key: "go"
    value: <
      urn: "beam:env:docker:v1"
      payload: "\n\026apache/beam_go_sdk:dev"
      capabilities: "beam:protocol:progress_reporting:v1"
      capabilities: "beam:protocol:multi_core_bundle_processing:v1"
      capabilities: "beam:transform:sdf_truncate_sized_restrictions:v1"
      capabilities: "beam:protocol:worker_status:v1"
      capabilities: "beam:protocol:monitoring_info_short_ids:v1"
      capabilities: "beam:version:sdk_base:go:apache/beam_go_sdk:2.50.0.dev"
      capabilities: "beam:coder:bytes:v1"
      capabilities: "beam:coder:bool:v1"
      capabilities: "beam:coder:varint:v1"
      capabilities: "beam:coder:double:v1"
      capabilities: "beam:coder:string_utf8:v1"
      capabilities: "beam:coder:length_prefix:v1"
      capabilities: "beam:coder:kv:v1"
      capabilities: "beam:coder:iterable:v1"
      capabilities: "beam:coder:state_backed_iterable:v1"
      capabilities: "beam:coder:windowed_value:v1"
      capabilities: "beam:coder:global_window:v1"
      capabilities: "beam:coder:interval_window:v1"
      capabilities: "beam:coder:row:v1"
      capabilities: "beam:coder:nullable:v1"
      capabilities: "beam:coder:timer:v1"
      dependencies: <
        type_urn: "beam:artifact:type:file:v1"
        role_urn: "beam:artifact:role:go_worker_binary:v1"
      >
    >
  >
>
root_transform_ids: "e4"
root_transform_ids: "s1"
root_transform_ids: "e5"
root_transform_ids: "s3"
2023/08/07 08:38:37 Cross-compiling <https://ci-beam.apache.org/job/beam_PostCommit_XVR_Spark3/ws/src/sdks/go/test/integration/io/xlang/kafka/kafka_test.go> with GOOS=linux GOARCH=amd64 CGO_ENABLED=0 as /tmp/worker-2-1691397517858109839
2023/08/07 08:38:41 Prepared job with id: go-testkafkaio_basicreadwrite-587_8c123c86-25c7-42ff-92c8-cd85d04cc413 and staging token: go-testkafkaio_basicreadwrite-587_8c123c86-25c7-42ff-92c8-cd85d04cc413
2023/08/07 08:38:41 Staged binary artifact with token: 
2023/08/07 08:38:41 Submitted job: go0testkafkaio0basicreadwrite0587-jenkins-0807083841-bcc62de1_32d612e2-5197-4bc0-b7fd-d80ec9c1014c
2023/08/07 08:38:41 Job state: STOPPED
2023/08/07 08:38:41 Job state: STARTING
2023/08/07 08:38:41 Job state: RUNNING
2023/08/07 08:39:05 Job state: DONE
--- PASS: TestKafkaIO_BasicReadWrite (54.08s)
PASS
ok  	github.com/apache/beam/sdks/v2/go/test/integration/io/xlang/kafka	60.145s
FAIL

> Task :runners:spark:3:job-server:validatesCrossLanguageRunnerGoUsingJava FAILED
> Task :runners:spark:3:job-server:validatesCrossLanguageRunnerJavaUsingPython
INFO:root:No image given, using default Python SDK image
INFO:root:Python SDK container image set to "apache/beam_python3.8_sdk:2.49.0" for Docker environment
INFO:__main__:Listening for expansion requests at 42283
INFO:root:Missing pipeline option (runner). Executing pipeline using the default runner: DirectRunner.
INFO:__main__:Shutting down expansion service.
INFO:apache_beam.runners.portability.stager:Executing command: ['/home/jenkins/.apache_beam/cache/venvs/py-3.8-beam-2.49.0-743bdccef67087512a7a190820e727aab7bdcb14/bin/python', '-m', 'pip', 'download', '--dest', '/tmp/dataflow-requirements-cache', '-r', '/tmp/tmpqvxyloc2/tmp_requirements.txt', '--exists-action', 'i', '--no-deps', '--implementation', 'cp', '--abi', 'cp38', '--platform', 'manylinux2014_x86_64']
INFO:root:No image given, using default Python SDK image
INFO:root:Python SDK container image set to "apache/beam_python3.8_sdk:2.49.0" for Docker environment
INFO:__main__:Listening for expansion requests at 41655
INFO:root:Missing pipeline option (runner). Executing pipeline using the default runner: DirectRunner.
INFO:__main__:Shutting down expansion service.

> Task :runners:spark:3:job-server:validatesCrossLanguageRunnerPythonUsingJava
> Task :runners:spark:3:job-server:validatesCrossLanguageRunnerPythonUsingSql FAILED
> Task :runners:spark:3:job-server:sparkJobServerCleanup
> Task :runners:spark:3:job-server:validatesCrossLanguageRunnerCleanup

FAILURE: Build completed with 2 failures.

1: Task failed with an exception.
-----------
* Where:
Build file '<https://ci-beam.apache.org/job/beam_PostCommit_XVR_Spark3/ws/src/sdks/go/test/build.gradle'> line: 217

* What went wrong:
Execution failed for task ':runners:spark:3:job-server:validatesCrossLanguageRunnerGoUsingJava'.
> Process 'command 'sh'' finished with non-zero exit value 1

* Try:
> Run with --stacktrace option to get the stack trace.
> Run with --info or --debug option to get more log output.
==============================================================================

2: Task failed with an exception.
-----------
* What went wrong:
Execution failed for task ':runners:spark:3:job-server:validatesCrossLanguageRunnerPythonUsingSql'.
> Process 'command 'sh'' finished with non-zero exit value 1

* Try:
> Run with --stacktrace option to get the stack trace.
> Run with --info or --debug option to get more log output.
==============================================================================

* Get more help at https://help.gradle.org

Deprecated Gradle features were used in this build, making it incompatible with Gradle 8.0.

You can use '--warning-mode all' to show the individual deprecation warnings and determine if they come from your own scripts or plugins.

See https://docs.gradle.org/7.6.2/userguide/command_line_interface.html#sec:command_line_warnings

Execution optimizations have been disabled for 1 invalid unit(s) of work during this build to ensure correctness.
Please consult deprecation warnings for more details.

BUILD FAILED in 33m 4s
274 actionable tasks: 178 executed, 84 from cache, 12 up-to-date

Publishing build scan...
https://ge.apache.org/s/mo23xw23ste4a

Build step 'Invoke Gradle script' changed build result to FAILURE
Build step 'Invoke Gradle script' marked build as failure

---------------------------------------------------------------------
To unsubscribe, e-mail: builds-unsubscribe@beam.apache.org
For additional commands, e-mail: builds-help@beam.apache.org


Build failed in Jenkins: beam_PostCommit_XVR_Spark3 #3428

Posted by Apache Jenkins Server <je...@builds.apache.org>.
See <https://ci-beam.apache.org/job/beam_PostCommit_XVR_Spark3/3428/display/redirect?page=changes>

Changes:

[noreply] Fix broken url for 'Tour of Beam' (#27412)


------------------------------------------
[...truncated 988.79 KB...]
_ _ _ _ _ _ _ _ _ _ _ _ _ _ _ _ _ _ _ _ _ _ _ _ _ _ _ _ _ _ _ _ _ _ _ _ _ _ _ _ 
apache_beam/pvalue.py:137: in __or__
    return self.pipeline.apply(ptransform, self)
apache_beam/pipeline.py:712: in apply
    pvalueish_result = self.runner.apply(transform, pvalueish, self._options)
apache_beam/runners/runner.py:185: in apply
    return m(transform, input, options)
apache_beam/runners/runner.py:215: in apply_PTransform
    return transform.expand(input)
apache_beam/transforms/external.py:678: in expand
    with ExternalTransform.service(expansion_service) as service:
/usr/lib/python3.8/contextlib.py:113: in __enter__
    return next(self.gen)
apache_beam/transforms/external.py:733: in service
    with expansion_service as stub:
apache_beam/transforms/external.py:944: in __enter__
    self._service = self._service_provider.__enter__()
apache_beam/utils/subprocess_server.py:72: in __enter__
    return self.start()
_ _ _ _ _ _ _ _ _ _ _ _ _ _ _ _ _ _ _ _ _ _ _ _ _ _ _ _ _ _ _ _ _ _ _ _ _ _ _ _ 

self = <apache_beam.utils.subprocess_server.JavaJarServer object at 0x7fa3c32f5730>

    def start(self):
      try:
        endpoint = self.start_process()
        wait_secs = .1
        channel_options = [("grpc.max_receive_message_length", -1),
                           ("grpc.max_send_message_length", -1)]
        channel = grpc.insecure_channel(endpoint, options=channel_options)
        channel_ready = grpc.channel_ready_future(channel)
        while True:
          if self._process is not None and self._process.poll() is not None:
            _LOGGER.error("Starting job service with %s", self._process.args)
>           raise RuntimeError(
                'Service failed to start up with error %s' % self._process.poll())
E               RuntimeError: Service failed to start up with error 1

apache_beam/utils/subprocess_server.py:88: RuntimeError
------------------------------ Captured log call -------------------------------
INFO     apache_beam.utils.subprocess_server:subprocess_server.py:239 Using pre-built snapshot at <https://ci-beam.apache.org/job/beam_PostCommit_XVR_Spark3/ws/src/sdks/java/extensions/sql/expansion-service/build/libs/beam-sdks-java-extensions-sql-expansion-service-2.50.0-SNAPSHOT.jar>
INFO     root:external.py:929 Starting a JAR-based expansion service from JAR <https://ci-beam.apache.org/job/beam_PostCommit_XVR_Spark3/ws/src/sdks/java/extensions/sql/expansion-service/build/libs/beam-sdks-java-extensions-sql-expansion-service-2.50.0-SNAPSHOT.jar> 
INFO     apache_beam.utils.subprocess_server:subprocess_server.py:116 Starting service with ['java' '-jar' '<https://ci-beam.apache.org/job/beam_PostCommit_XVR_Spark3/ws/src/sdks/java/extensions/sql/expansion-service/build/libs/beam-sdks-java-extensions-sql-expansion-service-2.50.0-SNAPSHOT.jar'> '36081' '--filesToStage=<https://ci-beam.apache.org/job/beam_PostCommit_XVR_Spark3/ws/src/sdks/java/extensions/sql/expansion-service/build/libs/beam-sdks-java-extensions-sql-expansion-service-2.50.0-SNAPSHOT.jar']>
INFO     apache_beam.utils.subprocess_server:subprocess_server.py:126 Error: Invalid or corrupt jarfile <https://ci-beam.apache.org/job/beam_PostCommit_XVR_Spark3/ws/src/sdks/java/extensions/sql/expansion-service/build/libs/beam-sdks-java-extensions-sql-expansion-service-2.50.0-SNAPSHOT.jar>
ERROR    apache_beam.utils.subprocess_server:subprocess_server.py:87 Starting job service with ['java', '-jar', '<https://ci-beam.apache.org/job/beam_PostCommit_XVR_Spark3/ws/src/sdks/java/extensions/sql/expansion-service/build/libs/beam-sdks-java-extensions-sql-expansion-service-2.50.0-SNAPSHOT.jar',> '36081', '--filesToStage=<https://ci-beam.apache.org/job/beam_PostCommit_XVR_Spark3/ws/src/sdks/java/extensions/sql/expansion-service/build/libs/beam-sdks-java-extensions-sql-expansion-service-2.50.0-SNAPSHOT.jar']>
ERROR    apache_beam.utils.subprocess_server:subprocess_server.py:101 Error bringing up service
Traceback (most recent call last):
  File "<https://ci-beam.apache.org/job/beam_PostCommit_XVR_Spark3/ws/src/sdks/python/apache_beam/utils/subprocess_server.py",> line 88, in start
    raise RuntimeError(
RuntimeError: Service failed to start up with error 1
_________________ SqlTransformTest.test_zetasql_generate_data __________________

self = <apache_beam.transforms.sql_test.SqlTransformTest testMethod=test_zetasql_generate_data>

    def test_zetasql_generate_data(self):
      with TestPipeline() as p:
>       out = p | SqlTransform(
            """SELECT
              CAST(1 AS INT64) AS `int`,
              CAST('foo' AS STRING) AS `str`,
              CAST(3.14  AS FLOAT64) AS `flt`""",
            dialect="zetasql")

apache_beam/transforms/sql_test.py:154: 
_ _ _ _ _ _ _ _ _ _ _ _ _ _ _ _ _ _ _ _ _ _ _ _ _ _ _ _ _ _ _ _ _ _ _ _ _ _ _ _ 
apache_beam/transforms/ptransform.py:614: in __ror__
    result = p.apply(self, pvalueish, label)
apache_beam/pipeline.py:712: in apply
    pvalueish_result = self.runner.apply(transform, pvalueish, self._options)
apache_beam/runners/runner.py:185: in apply
    return m(transform, input, options)
apache_beam/runners/runner.py:215: in apply_PTransform
    return transform.expand(input)
apache_beam/transforms/external.py:678: in expand
    with ExternalTransform.service(expansion_service) as service:
/usr/lib/python3.8/contextlib.py:113: in __enter__
    return next(self.gen)
apache_beam/transforms/external.py:733: in service
    with expansion_service as stub:
apache_beam/transforms/external.py:944: in __enter__
    self._service = self._service_provider.__enter__()
apache_beam/utils/subprocess_server.py:72: in __enter__
    return self.start()
_ _ _ _ _ _ _ _ _ _ _ _ _ _ _ _ _ _ _ _ _ _ _ _ _ _ _ _ _ _ _ _ _ _ _ _ _ _ _ _ 

self = <apache_beam.utils.subprocess_server.JavaJarServer object at 0x7fa3c2e99f70>

    def start(self):
      try:
        endpoint = self.start_process()
        wait_secs = .1
        channel_options = [("grpc.max_receive_message_length", -1),
                           ("grpc.max_send_message_length", -1)]
        channel = grpc.insecure_channel(endpoint, options=channel_options)
        channel_ready = grpc.channel_ready_future(channel)
        while True:
          if self._process is not None and self._process.poll() is not None:
            _LOGGER.error("Starting job service with %s", self._process.args)
>           raise RuntimeError(
                'Service failed to start up with error %s' % self._process.poll())
E               RuntimeError: Service failed to start up with error 1

apache_beam/utils/subprocess_server.py:88: RuntimeError
------------------------------ Captured log call -------------------------------
INFO     apache_beam.utils.subprocess_server:subprocess_server.py:239 Using pre-built snapshot at <https://ci-beam.apache.org/job/beam_PostCommit_XVR_Spark3/ws/src/sdks/java/extensions/sql/expansion-service/build/libs/beam-sdks-java-extensions-sql-expansion-service-2.50.0-SNAPSHOT.jar>
INFO     root:external.py:929 Starting a JAR-based expansion service from JAR <https://ci-beam.apache.org/job/beam_PostCommit_XVR_Spark3/ws/src/sdks/java/extensions/sql/expansion-service/build/libs/beam-sdks-java-extensions-sql-expansion-service-2.50.0-SNAPSHOT.jar> 
INFO     apache_beam.utils.subprocess_server:subprocess_server.py:116 Starting service with ['java' '-jar' '<https://ci-beam.apache.org/job/beam_PostCommit_XVR_Spark3/ws/src/sdks/java/extensions/sql/expansion-service/build/libs/beam-sdks-java-extensions-sql-expansion-service-2.50.0-SNAPSHOT.jar'> '58397' '--filesToStage=<https://ci-beam.apache.org/job/beam_PostCommit_XVR_Spark3/ws/src/sdks/java/extensions/sql/expansion-service/build/libs/beam-sdks-java-extensions-sql-expansion-service-2.50.0-SNAPSHOT.jar']>
INFO     apache_beam.utils.subprocess_server:subprocess_server.py:126 Error: Invalid or corrupt jarfile <https://ci-beam.apache.org/job/beam_PostCommit_XVR_Spark3/ws/src/sdks/java/extensions/sql/expansion-service/build/libs/beam-sdks-java-extensions-sql-expansion-service-2.50.0-SNAPSHOT.jar>
ERROR    apache_beam.utils.subprocess_server:subprocess_server.py:87 Starting job service with ['java', '-jar', '<https://ci-beam.apache.org/job/beam_PostCommit_XVR_Spark3/ws/src/sdks/java/extensions/sql/expansion-service/build/libs/beam-sdks-java-extensions-sql-expansion-service-2.50.0-SNAPSHOT.jar',> '58397', '--filesToStage=<https://ci-beam.apache.org/job/beam_PostCommit_XVR_Spark3/ws/src/sdks/java/extensions/sql/expansion-service/build/libs/beam-sdks-java-extensions-sql-expansion-service-2.50.0-SNAPSHOT.jar']>
ERROR    apache_beam.utils.subprocess_server:subprocess_server.py:101 Error bringing up service
Traceback (most recent call last):
  File "<https://ci-beam.apache.org/job/beam_PostCommit_XVR_Spark3/ws/src/sdks/python/apache_beam/utils/subprocess_server.py",> line 88, in start
    raise RuntimeError(
RuntimeError: Service failed to start up with error 1
=============================== warnings summary ===============================
../../build/gradleenv/1922375555/lib/python3.8/site-packages/hdfs/config.py:15
  <https://ci-beam.apache.org/job/beam_PostCommit_XVR_Spark3/ws/src/build/gradleenv/1922375555/lib/python3.8/site-packages/hdfs/config.py>:15: DeprecationWarning: the imp module is deprecated in favour of importlib; see the module's documentation for alternative uses
    from imp import load_source

../../build/gradleenv/1922375555/lib/python3.8/site-packages/google/rpc/__init__.py:18
  <https://ci-beam.apache.org/job/beam_PostCommit_XVR_Spark3/ws/src/build/gradleenv/1922375555/lib/python3.8/site-packages/google/rpc/__init__.py>:18: DeprecationWarning: pkg_resources is deprecated as an API. See https://setuptools.pypa.io/en/latest/pkg_resources.html
    import pkg_resources

../../build/gradleenv/1922375555/lib/python3.8/site-packages/pkg_resources/__init__.py:2871: 20 warnings
  <https://ci-beam.apache.org/job/beam_PostCommit_XVR_Spark3/ws/src/build/gradleenv/1922375555/lib/python3.8/site-packages/pkg_resources/__init__.py>:2871: DeprecationWarning: Deprecated call to `pkg_resources.declare_namespace('google')`.
  Implementing implicit namespace packages (as specified in PEP 420) is preferred to `pkg_resources.declare_namespace`. See https://setuptools.pypa.io/en/latest/references/keywords.html#keyword-namespace-packages
    declare_namespace(pkg)

../../build/gradleenv/1922375555/lib/python3.8/site-packages/pkg_resources/__init__.py:2871: 16 warnings
  <https://ci-beam.apache.org/job/beam_PostCommit_XVR_Spark3/ws/src/build/gradleenv/1922375555/lib/python3.8/site-packages/pkg_resources/__init__.py>:2871: DeprecationWarning: Deprecated call to `pkg_resources.declare_namespace('google.cloud')`.
  Implementing implicit namespace packages (as specified in PEP 420) is preferred to `pkg_resources.declare_namespace`. See https://setuptools.pypa.io/en/latest/references/keywords.html#keyword-namespace-packages
    declare_namespace(pkg)

../../build/gradleenv/1922375555/lib/python3.8/site-packages/pkg_resources/__init__.py:2350
../../build/gradleenv/1922375555/lib/python3.8/site-packages/pkg_resources/__init__.py:2350
../../build/gradleenv/1922375555/lib/python3.8/site-packages/pkg_resources/__init__.py:2350
../../build/gradleenv/1922375555/lib/python3.8/site-packages/pkg_resources/__init__.py:2350
  <https://ci-beam.apache.org/job/beam_PostCommit_XVR_Spark3/ws/src/build/gradleenv/1922375555/lib/python3.8/site-packages/pkg_resources/__init__.py>:2350: DeprecationWarning: Deprecated call to `pkg_resources.declare_namespace('google')`.
  Implementing implicit namespace packages (as specified in PEP 420) is preferred to `pkg_resources.declare_namespace`. See https://setuptools.pypa.io/en/latest/references/keywords.html#keyword-namespace-packages
    declare_namespace(parent)

../../build/gradleenv/1922375555/lib/python3.8/site-packages/pkg_resources/__init__.py:2871
  <https://ci-beam.apache.org/job/beam_PostCommit_XVR_Spark3/ws/src/build/gradleenv/1922375555/lib/python3.8/site-packages/pkg_resources/__init__.py>:2871: DeprecationWarning: Deprecated call to `pkg_resources.declare_namespace('google.logging')`.
  Implementing implicit namespace packages (as specified in PEP 420) is preferred to `pkg_resources.declare_namespace`. See https://setuptools.pypa.io/en/latest/references/keywords.html#keyword-namespace-packages
    declare_namespace(pkg)

../../build/gradleenv/1922375555/lib/python3.8/site-packages/pkg_resources/__init__.py:2871
  <https://ci-beam.apache.org/job/beam_PostCommit_XVR_Spark3/ws/src/build/gradleenv/1922375555/lib/python3.8/site-packages/pkg_resources/__init__.py>:2871: DeprecationWarning: Deprecated call to `pkg_resources.declare_namespace('google.iam')`.
  Implementing implicit namespace packages (as specified in PEP 420) is preferred to `pkg_resources.declare_namespace`. See https://setuptools.pypa.io/en/latest/references/keywords.html#keyword-namespace-packages
    declare_namespace(pkg)

../../build/gradleenv/1922375555/lib/python3.8/site-packages/google/rpc/__init__.py:20
  <https://ci-beam.apache.org/job/beam_PostCommit_XVR_Spark3/ws/src/build/gradleenv/1922375555/lib/python3.8/site-packages/google/rpc/__init__.py>:20: DeprecationWarning: Deprecated call to `pkg_resources.declare_namespace('google.rpc')`.
  Implementing implicit namespace packages (as specified in PEP 420) is preferred to `pkg_resources.declare_namespace`. See https://setuptools.pypa.io/en/latest/references/keywords.html#keyword-namespace-packages
    pkg_resources.declare_namespace(__name__)

apache_beam/typehints/pandas_type_compatibility_test.py:67
  <https://ci-beam.apache.org/job/beam_PostCommit_XVR_Spark3/ws/src/sdks/python/apache_beam/typehints/pandas_type_compatibility_test.py>:67: FutureWarning: pandas.Int64Index is deprecated and will be removed from pandas in a future version. Use pandas.Index with the appropriate dtype instead.
    }).set_index(pd.Int64Index(range(123, 223), name='an_index')),

apache_beam/typehints/pandas_type_compatibility_test.py:90
  <https://ci-beam.apache.org/job/beam_PostCommit_XVR_Spark3/ws/src/sdks/python/apache_beam/typehints/pandas_type_compatibility_test.py>:90: FutureWarning: pandas.Int64Index is deprecated and will be removed from pandas in a future version. Use pandas.Index with the appropriate dtype instead.
    pd.Int64Index(range(123, 223), name='an_index'),

apache_beam/typehints/pandas_type_compatibility_test.py:91
  <https://ci-beam.apache.org/job/beam_PostCommit_XVR_Spark3/ws/src/sdks/python/apache_beam/typehints/pandas_type_compatibility_test.py>:91: FutureWarning: pandas.Int64Index is deprecated and will be removed from pandas in a future version. Use pandas.Index with the appropriate dtype instead.
    pd.Int64Index(range(475, 575), name='another_index'),

apache_beam/transforms/sql_test.py::SqlTransformTest::test_agg
apache_beam/transforms/sql_test.py::SqlTransformTest::test_filter
apache_beam/transforms/sql_test.py::SqlTransformTest::test_generate_data
apache_beam/transforms/sql_test.py::SqlTransformTest::test_map
apache_beam/transforms/sql_test.py::SqlTransformTest::test_project
apache_beam/transforms/sql_test.py::SqlTransformTest::test_row
apache_beam/transforms/sql_test.py::SqlTransformTest::test_tagged_join
apache_beam/transforms/sql_test.py::SqlTransformTest::test_windowing_before_sql
apache_beam/transforms/sql_test.py::SqlTransformTest::test_zetasql_generate_data
  <https://ci-beam.apache.org/job/beam_PostCommit_XVR_Spark3/ws/src/sdks/python/apache_beam/transforms/external.py>:676: BeamDeprecationWarning: options is deprecated since First stable release. References to <pipeline>.options will not be supported
    self._expansion_service, pipeline.options)

-- Docs: https://docs.pytest.org/en/stable/how-to/capture-warnings.html
- generated xml file: <https://ci-beam.apache.org/job/beam_PostCommit_XVR_Spark3/ws/src/sdks/python/pytest_xlangSqlValidateRunner.xml> -
=========================== short test summary info ============================
FAILED apache_beam/transforms/sql_test.py::SqlTransformTest::test_agg - RuntimeError: Service failed to start up with error 1
FAILED apache_beam/transforms/sql_test.py::SqlTransformTest::test_filter - RuntimeError: Service failed to start up with error 1
FAILED apache_beam/transforms/sql_test.py::SqlTransformTest::test_generate_data - RuntimeError: Service failed to start up with error 1
FAILED apache_beam/transforms/sql_test.py::SqlTransformTest::test_map - RuntimeError: Service failed to start up with error 1
FAILED apache_beam/transforms/sql_test.py::SqlTransformTest::test_project - RuntimeError: Service failed to start up with error 1
FAILED apache_beam/transforms/sql_test.py::SqlTransformTest::test_row - RuntimeError: Service failed to start up with error 1
FAILED apache_beam/transforms/sql_test.py::SqlTransformTest::test_tagged_join - RuntimeError: Service failed to start up with error 1
FAILED apache_beam/transforms/sql_test.py::SqlTransformTest::test_windowing_before_sql - RuntimeError: Service failed to start up with error 1
FAILED apache_beam/transforms/sql_test.py::SqlTransformTest::test_zetasql_generate_data - RuntimeError: Service failed to start up with error 1
========= 9 failed, 14 skipped, 6945 deselected, 57 warnings in 9.98s ==========

> Task :runners:spark:3:job-server:validatesCrossLanguageRunnerPythonUsingSql FAILED

> Task :runners:spark:3:job-server:sparkJobServerCleanup
Stopping job server pid: 1243728.

> Task :runners:spark:3:job-server:validatesCrossLanguageRunnerCleanup
Stopping expansion service pid: 1249601.
Stopping expansion service pid: 1249602.

FAILURE: Build completed with 2 failures.

1: Task failed with an exception.
-----------
* Where:
Build file '<https://ci-beam.apache.org/job/beam_PostCommit_XVR_Spark3/ws/src/sdks/go/test/build.gradle'> line: 217

* What went wrong:
Execution failed for task ':runners:spark:3:job-server:validatesCrossLanguageRunnerGoUsingJava'.
> Process 'command 'sh'' finished with non-zero exit value 1

* Try:
> Run with --stacktrace option to get the stack trace.
> Run with --info or --debug option to get more log output.
==============================================================================

2: Task failed with an exception.
-----------
* What went wrong:
Execution failed for task ':runners:spark:3:job-server:validatesCrossLanguageRunnerPythonUsingSql'.
> Process 'command 'sh'' finished with non-zero exit value 1

* Try:
> Run with --stacktrace option to get the stack trace.
> Run with --info or --debug option to get more log output.
==============================================================================

* Get more help at https://help.gradle.org

Deprecated Gradle features were used in this build, making it incompatible with Gradle 8.0.

You can use '--warning-mode all' to show the individual deprecation warnings and determine if they come from your own scripts or plugins.

See https://docs.gradle.org/7.6.2/userguide/command_line_interface.html#sec:command_line_warnings

Execution optimizations have been disabled for 1 invalid unit(s) of work during this build to ensure correctness.
Please consult deprecation warnings for more details.

BUILD FAILED in 30m 50s
274 actionable tasks: 178 executed, 84 from cache, 12 up-to-date

Publishing build scan...
https://ge.apache.org/s/4wwwwjqh7oku4

Build step 'Invoke Gradle script' changed build result to FAILURE
Build step 'Invoke Gradle script' marked build as failure

---------------------------------------------------------------------
To unsubscribe, e-mail: builds-unsubscribe@beam.apache.org
For additional commands, e-mail: builds-help@beam.apache.org


Build failed in Jenkins: beam_PostCommit_XVR_Spark3 #3427

Posted by Apache Jenkins Server <je...@builds.apache.org>.
See <https://ci-beam.apache.org/job/beam_PostCommit_XVR_Spark3/3427/display/redirect>

Changes:


------------------------------------------
[...truncated 947.87 KB...]
_ _ _ _ _ _ _ _ _ _ _ _ _ _ _ _ _ _ _ _ _ _ _ _ _ _ _ _ _ _ _ _ _ _ _ _ _ _ _ _ 
apache_beam/pvalue.py:137: in __or__
    return self.pipeline.apply(ptransform, self)
apache_beam/pipeline.py:712: in apply
    pvalueish_result = self.runner.apply(transform, pvalueish, self._options)
apache_beam/runners/runner.py:185: in apply
    return m(transform, input, options)
apache_beam/runners/runner.py:215: in apply_PTransform
    return transform.expand(input)
apache_beam/transforms/external.py:678: in expand
    with ExternalTransform.service(expansion_service) as service:
/usr/lib/python3.8/contextlib.py:113: in __enter__
    return next(self.gen)
apache_beam/transforms/external.py:733: in service
    with expansion_service as stub:
apache_beam/transforms/external.py:944: in __enter__
    self._service = self._service_provider.__enter__()
apache_beam/utils/subprocess_server.py:72: in __enter__
    return self.start()
_ _ _ _ _ _ _ _ _ _ _ _ _ _ _ _ _ _ _ _ _ _ _ _ _ _ _ _ _ _ _ _ _ _ _ _ _ _ _ _ 

self = <apache_beam.utils.subprocess_server.JavaJarServer object at 0x7f60d6b4f0d0>

    def start(self):
      try:
        endpoint = self.start_process()
        wait_secs = .1
        channel_options = [("grpc.max_receive_message_length", -1),
                           ("grpc.max_send_message_length", -1)]
        channel = grpc.insecure_channel(endpoint, options=channel_options)
        channel_ready = grpc.channel_ready_future(channel)
        while True:
          if self._process is not None and self._process.poll() is not None:
            _LOGGER.error("Starting job service with %s", self._process.args)
>           raise RuntimeError(
                'Service failed to start up with error %s' % self._process.poll())
E               RuntimeError: Service failed to start up with error 1

apache_beam/utils/subprocess_server.py:88: RuntimeError
------------------------------ Captured log call -------------------------------
INFO     apache_beam.utils.subprocess_server:subprocess_server.py:239 Using pre-built snapshot at <https://ci-beam.apache.org/job/beam_PostCommit_XVR_Spark3/ws/src/sdks/java/extensions/sql/expansion-service/build/libs/beam-sdks-java-extensions-sql-expansion-service-2.50.0-SNAPSHOT.jar>
INFO     root:external.py:929 Starting a JAR-based expansion service from JAR <https://ci-beam.apache.org/job/beam_PostCommit_XVR_Spark3/ws/src/sdks/java/extensions/sql/expansion-service/build/libs/beam-sdks-java-extensions-sql-expansion-service-2.50.0-SNAPSHOT.jar> 
INFO     apache_beam.utils.subprocess_server:subprocess_server.py:116 Starting service with ['java' '-jar' '<https://ci-beam.apache.org/job/beam_PostCommit_XVR_Spark3/ws/src/sdks/java/extensions/sql/expansion-service/build/libs/beam-sdks-java-extensions-sql-expansion-service-2.50.0-SNAPSHOT.jar'> '44317' '--filesToStage=<https://ci-beam.apache.org/job/beam_PostCommit_XVR_Spark3/ws/src/sdks/java/extensions/sql/expansion-service/build/libs/beam-sdks-java-extensions-sql-expansion-service-2.50.0-SNAPSHOT.jar']>
INFO     apache_beam.utils.subprocess_server:subprocess_server.py:126 Error: Invalid or corrupt jarfile <https://ci-beam.apache.org/job/beam_PostCommit_XVR_Spark3/ws/src/sdks/java/extensions/sql/expansion-service/build/libs/beam-sdks-java-extensions-sql-expansion-service-2.50.0-SNAPSHOT.jar>
ERROR    apache_beam.utils.subprocess_server:subprocess_server.py:87 Starting job service with ['java', '-jar', '<https://ci-beam.apache.org/job/beam_PostCommit_XVR_Spark3/ws/src/sdks/java/extensions/sql/expansion-service/build/libs/beam-sdks-java-extensions-sql-expansion-service-2.50.0-SNAPSHOT.jar',> '44317', '--filesToStage=<https://ci-beam.apache.org/job/beam_PostCommit_XVR_Spark3/ws/src/sdks/java/extensions/sql/expansion-service/build/libs/beam-sdks-java-extensions-sql-expansion-service-2.50.0-SNAPSHOT.jar']>
ERROR    apache_beam.utils.subprocess_server:subprocess_server.py:101 Error bringing up service
Traceback (most recent call last):
  File "<https://ci-beam.apache.org/job/beam_PostCommit_XVR_Spark3/ws/src/sdks/python/apache_beam/utils/subprocess_server.py",> line 88, in start
    raise RuntimeError(
RuntimeError: Service failed to start up with error 1
_________________ SqlTransformTest.test_zetasql_generate_data __________________

self = <apache_beam.transforms.sql_test.SqlTransformTest testMethod=test_zetasql_generate_data>

    def test_zetasql_generate_data(self):
      with TestPipeline() as p:
>       out = p | SqlTransform(
            """SELECT
              CAST(1 AS INT64) AS `int`,
              CAST('foo' AS STRING) AS `str`,
              CAST(3.14  AS FLOAT64) AS `flt`""",
            dialect="zetasql")

apache_beam/transforms/sql_test.py:154: 
_ _ _ _ _ _ _ _ _ _ _ _ _ _ _ _ _ _ _ _ _ _ _ _ _ _ _ _ _ _ _ _ _ _ _ _ _ _ _ _ 
apache_beam/transforms/ptransform.py:614: in __ror__
    result = p.apply(self, pvalueish, label)
apache_beam/pipeline.py:712: in apply
    pvalueish_result = self.runner.apply(transform, pvalueish, self._options)
apache_beam/runners/runner.py:185: in apply
    return m(transform, input, options)
apache_beam/runners/runner.py:215: in apply_PTransform
    return transform.expand(input)
apache_beam/transforms/external.py:678: in expand
    with ExternalTransform.service(expansion_service) as service:
/usr/lib/python3.8/contextlib.py:113: in __enter__
    return next(self.gen)
apache_beam/transforms/external.py:733: in service
    with expansion_service as stub:
apache_beam/transforms/external.py:944: in __enter__
    self._service = self._service_provider.__enter__()
apache_beam/utils/subprocess_server.py:72: in __enter__
    return self.start()
_ _ _ _ _ _ _ _ _ _ _ _ _ _ _ _ _ _ _ _ _ _ _ _ _ _ _ _ _ _ _ _ _ _ _ _ _ _ _ _ 

self = <apache_beam.utils.subprocess_server.JavaJarServer object at 0x7f60d67bf130>

    def start(self):
      try:
        endpoint = self.start_process()
        wait_secs = .1
        channel_options = [("grpc.max_receive_message_length", -1),
                           ("grpc.max_send_message_length", -1)]
        channel = grpc.insecure_channel(endpoint, options=channel_options)
        channel_ready = grpc.channel_ready_future(channel)
        while True:
          if self._process is not None and self._process.poll() is not None:
            _LOGGER.error("Starting job service with %s", self._process.args)
>           raise RuntimeError(
                'Service failed to start up with error %s' % self._process.poll())
E               RuntimeError: Service failed to start up with error 1

apache_beam/utils/subprocess_server.py:88: RuntimeError
------------------------------ Captured log call -------------------------------
INFO     apache_beam.utils.subprocess_server:subprocess_server.py:239 Using pre-built snapshot at <https://ci-beam.apache.org/job/beam_PostCommit_XVR_Spark3/ws/src/sdks/java/extensions/sql/expansion-service/build/libs/beam-sdks-java-extensions-sql-expansion-service-2.50.0-SNAPSHOT.jar>
INFO     root:external.py:929 Starting a JAR-based expansion service from JAR <https://ci-beam.apache.org/job/beam_PostCommit_XVR_Spark3/ws/src/sdks/java/extensions/sql/expansion-service/build/libs/beam-sdks-java-extensions-sql-expansion-service-2.50.0-SNAPSHOT.jar> 
INFO     apache_beam.utils.subprocess_server:subprocess_server.py:116 Starting service with ['java' '-jar' '<https://ci-beam.apache.org/job/beam_PostCommit_XVR_Spark3/ws/src/sdks/java/extensions/sql/expansion-service/build/libs/beam-sdks-java-extensions-sql-expansion-service-2.50.0-SNAPSHOT.jar'> '59891' '--filesToStage=<https://ci-beam.apache.org/job/beam_PostCommit_XVR_Spark3/ws/src/sdks/java/extensions/sql/expansion-service/build/libs/beam-sdks-java-extensions-sql-expansion-service-2.50.0-SNAPSHOT.jar']>
INFO     apache_beam.utils.subprocess_server:subprocess_server.py:126 Error: Invalid or corrupt jarfile <https://ci-beam.apache.org/job/beam_PostCommit_XVR_Spark3/ws/src/sdks/java/extensions/sql/expansion-service/build/libs/beam-sdks-java-extensions-sql-expansion-service-2.50.0-SNAPSHOT.jar>
ERROR    apache_beam.utils.subprocess_server:subprocess_server.py:87 Starting job service with ['java', '-jar', '<https://ci-beam.apache.org/job/beam_PostCommit_XVR_Spark3/ws/src/sdks/java/extensions/sql/expansion-service/build/libs/beam-sdks-java-extensions-sql-expansion-service-2.50.0-SNAPSHOT.jar',> '59891', '--filesToStage=<https://ci-beam.apache.org/job/beam_PostCommit_XVR_Spark3/ws/src/sdks/java/extensions/sql/expansion-service/build/libs/beam-sdks-java-extensions-sql-expansion-service-2.50.0-SNAPSHOT.jar']>
ERROR    apache_beam.utils.subprocess_server:subprocess_server.py:101 Error bringing up service
Traceback (most recent call last):
  File "<https://ci-beam.apache.org/job/beam_PostCommit_XVR_Spark3/ws/src/sdks/python/apache_beam/utils/subprocess_server.py",> line 88, in start
    raise RuntimeError(
RuntimeError: Service failed to start up with error 1
=============================== warnings summary ===============================
../../build/gradleenv/1922375555/lib/python3.8/site-packages/hdfs/config.py:15
  <https://ci-beam.apache.org/job/beam_PostCommit_XVR_Spark3/ws/src/build/gradleenv/1922375555/lib/python3.8/site-packages/hdfs/config.py>:15: DeprecationWarning: the imp module is deprecated in favour of importlib; see the module's documentation for alternative uses
    from imp import load_source

../../build/gradleenv/1922375555/lib/python3.8/site-packages/google/rpc/__init__.py:18
  <https://ci-beam.apache.org/job/beam_PostCommit_XVR_Spark3/ws/src/build/gradleenv/1922375555/lib/python3.8/site-packages/google/rpc/__init__.py>:18: DeprecationWarning: pkg_resources is deprecated as an API. See https://setuptools.pypa.io/en/latest/pkg_resources.html
    import pkg_resources

../../build/gradleenv/1922375555/lib/python3.8/site-packages/pkg_resources/__init__.py:2871: 20 warnings
  <https://ci-beam.apache.org/job/beam_PostCommit_XVR_Spark3/ws/src/build/gradleenv/1922375555/lib/python3.8/site-packages/pkg_resources/__init__.py>:2871: DeprecationWarning: Deprecated call to `pkg_resources.declare_namespace('google')`.
  Implementing implicit namespace packages (as specified in PEP 420) is preferred to `pkg_resources.declare_namespace`. See https://setuptools.pypa.io/en/latest/references/keywords.html#keyword-namespace-packages
    declare_namespace(pkg)

../../build/gradleenv/1922375555/lib/python3.8/site-packages/pkg_resources/__init__.py:2871: 16 warnings
  <https://ci-beam.apache.org/job/beam_PostCommit_XVR_Spark3/ws/src/build/gradleenv/1922375555/lib/python3.8/site-packages/pkg_resources/__init__.py>:2871: DeprecationWarning: Deprecated call to `pkg_resources.declare_namespace('google.cloud')`.
  Implementing implicit namespace packages (as specified in PEP 420) is preferred to `pkg_resources.declare_namespace`. See https://setuptools.pypa.io/en/latest/references/keywords.html#keyword-namespace-packages
    declare_namespace(pkg)

../../build/gradleenv/1922375555/lib/python3.8/site-packages/pkg_resources/__init__.py:2350
../../build/gradleenv/1922375555/lib/python3.8/site-packages/pkg_resources/__init__.py:2350
../../build/gradleenv/1922375555/lib/python3.8/site-packages/pkg_resources/__init__.py:2350
../../build/gradleenv/1922375555/lib/python3.8/site-packages/pkg_resources/__init__.py:2350
  <https://ci-beam.apache.org/job/beam_PostCommit_XVR_Spark3/ws/src/build/gradleenv/1922375555/lib/python3.8/site-packages/pkg_resources/__init__.py>:2350: DeprecationWarning: Deprecated call to `pkg_resources.declare_namespace('google')`.
  Implementing implicit namespace packages (as specified in PEP 420) is preferred to `pkg_resources.declare_namespace`. See https://setuptools.pypa.io/en/latest/references/keywords.html#keyword-namespace-packages
    declare_namespace(parent)

../../build/gradleenv/1922375555/lib/python3.8/site-packages/pkg_resources/__init__.py:2871
  <https://ci-beam.apache.org/job/beam_PostCommit_XVR_Spark3/ws/src/build/gradleenv/1922375555/lib/python3.8/site-packages/pkg_resources/__init__.py>:2871: DeprecationWarning: Deprecated call to `pkg_resources.declare_namespace('google.logging')`.
  Implementing implicit namespace packages (as specified in PEP 420) is preferred to `pkg_resources.declare_namespace`. See https://setuptools.pypa.io/en/latest/references/keywords.html#keyword-namespace-packages
    declare_namespace(pkg)

../../build/gradleenv/1922375555/lib/python3.8/site-packages/pkg_resources/__init__.py:2871
  <https://ci-beam.apache.org/job/beam_PostCommit_XVR_Spark3/ws/src/build/gradleenv/1922375555/lib/python3.8/site-packages/pkg_resources/__init__.py>:2871: DeprecationWarning: Deprecated call to `pkg_resources.declare_namespace('google.iam')`.
  Implementing implicit namespace packages (as specified in PEP 420) is preferred to `pkg_resources.declare_namespace`. See https://setuptools.pypa.io/en/latest/references/keywords.html#keyword-namespace-packages
    declare_namespace(pkg)

../../build/gradleenv/1922375555/lib/python3.8/site-packages/google/rpc/__init__.py:20
  <https://ci-beam.apache.org/job/beam_PostCommit_XVR_Spark3/ws/src/build/gradleenv/1922375555/lib/python3.8/site-packages/google/rpc/__init__.py>:20: DeprecationWarning: Deprecated call to `pkg_resources.declare_namespace('google.rpc')`.
  Implementing implicit namespace packages (as specified in PEP 420) is preferred to `pkg_resources.declare_namespace`. See https://setuptools.pypa.io/en/latest/references/keywords.html#keyword-namespace-packages
    pkg_resources.declare_namespace(__name__)

apache_beam/typehints/pandas_type_compatibility_test.py:67
  <https://ci-beam.apache.org/job/beam_PostCommit_XVR_Spark3/ws/src/sdks/python/apache_beam/typehints/pandas_type_compatibility_test.py>:67: FutureWarning: pandas.Int64Index is deprecated and will be removed from pandas in a future version. Use pandas.Index with the appropriate dtype instead.
    }).set_index(pd.Int64Index(range(123, 223), name='an_index')),

apache_beam/typehints/pandas_type_compatibility_test.py:90
  <https://ci-beam.apache.org/job/beam_PostCommit_XVR_Spark3/ws/src/sdks/python/apache_beam/typehints/pandas_type_compatibility_test.py>:90: FutureWarning: pandas.Int64Index is deprecated and will be removed from pandas in a future version. Use pandas.Index with the appropriate dtype instead.
    pd.Int64Index(range(123, 223), name='an_index'),

apache_beam/typehints/pandas_type_compatibility_test.py:91
  <https://ci-beam.apache.org/job/beam_PostCommit_XVR_Spark3/ws/src/sdks/python/apache_beam/typehints/pandas_type_compatibility_test.py>:91: FutureWarning: pandas.Int64Index is deprecated and will be removed from pandas in a future version. Use pandas.Index with the appropriate dtype instead.
    pd.Int64Index(range(475, 575), name='another_index'),

apache_beam/transforms/sql_test.py::SqlTransformTest::test_agg
apache_beam/transforms/sql_test.py::SqlTransformTest::test_filter
apache_beam/transforms/sql_test.py::SqlTransformTest::test_generate_data
apache_beam/transforms/sql_test.py::SqlTransformTest::test_map
apache_beam/transforms/sql_test.py::SqlTransformTest::test_project
apache_beam/transforms/sql_test.py::SqlTransformTest::test_row
apache_beam/transforms/sql_test.py::SqlTransformTest::test_tagged_join
apache_beam/transforms/sql_test.py::SqlTransformTest::test_windowing_before_sql
apache_beam/transforms/sql_test.py::SqlTransformTest::test_zetasql_generate_data
  <https://ci-beam.apache.org/job/beam_PostCommit_XVR_Spark3/ws/src/sdks/python/apache_beam/transforms/external.py>:676: BeamDeprecationWarning: options is deprecated since First stable release. References to <pipeline>.options will not be supported
    self._expansion_service, pipeline.options)

-- Docs: https://docs.pytest.org/en/stable/how-to/capture-warnings.html
- generated xml file: <https://ci-beam.apache.org/job/beam_PostCommit_XVR_Spark3/ws/src/sdks/python/pytest_xlangSqlValidateRunner.xml> -
=========================== short test summary info ============================
FAILED apache_beam/transforms/sql_test.py::SqlTransformTest::test_agg - RuntimeError: Service failed to start up with error 1
FAILED apache_beam/transforms/sql_test.py::SqlTransformTest::test_filter - RuntimeError: Service failed to start up with error 1
FAILED apache_beam/transforms/sql_test.py::SqlTransformTest::test_generate_data - RuntimeError: Service failed to start up with error 1
FAILED apache_beam/transforms/sql_test.py::SqlTransformTest::test_map - RuntimeError: Service failed to start up with error 1
FAILED apache_beam/transforms/sql_test.py::SqlTransformTest::test_project - RuntimeError: Service failed to start up with error 1
FAILED apache_beam/transforms/sql_test.py::SqlTransformTest::test_row - RuntimeError: Service failed to start up with error 1
FAILED apache_beam/transforms/sql_test.py::SqlTransformTest::test_tagged_join - RuntimeError: Service failed to start up with error 1
FAILED apache_beam/transforms/sql_test.py::SqlTransformTest::test_windowing_before_sql - RuntimeError: Service failed to start up with error 1
FAILED apache_beam/transforms/sql_test.py::SqlTransformTest::test_zetasql_generate_data - RuntimeError: Service failed to start up with error 1
========= 9 failed, 14 skipped, 6945 deselected, 57 warnings in 10.47s =========

> Task :runners:spark:3:job-server:validatesCrossLanguageRunnerPythonUsingSql FAILED

> Task :runners:spark:3:job-server:sparkJobServerCleanup
Stopping job server pid: 570157.

> Task :runners:spark:3:job-server:validatesCrossLanguageRunnerCleanup
Stopping expansion service pid: 575752.
Stopping expansion service pid: 575753.

FAILURE: Build completed with 2 failures.

1: Task failed with an exception.
-----------
* Where:
Build file '<https://ci-beam.apache.org/job/beam_PostCommit_XVR_Spark3/ws/src/sdks/go/test/build.gradle'> line: 217

* What went wrong:
Execution failed for task ':runners:spark:3:job-server:validatesCrossLanguageRunnerGoUsingJava'.
> Process 'command 'sh'' finished with non-zero exit value 1

* Try:
> Run with --stacktrace option to get the stack trace.
> Run with --info or --debug option to get more log output.
==============================================================================

2: Task failed with an exception.
-----------
* What went wrong:
Execution failed for task ':runners:spark:3:job-server:validatesCrossLanguageRunnerPythonUsingSql'.
> Process 'command 'sh'' finished with non-zero exit value 1

* Try:
> Run with --stacktrace option to get the stack trace.
> Run with --info or --debug option to get more log output.
==============================================================================

* Get more help at https://help.gradle.org

Deprecated Gradle features were used in this build, making it incompatible with Gradle 8.0.

You can use '--warning-mode all' to show the individual deprecation warnings and determine if they come from your own scripts or plugins.

See https://docs.gradle.org/7.6.2/userguide/command_line_interface.html#sec:command_line_warnings

Execution optimizations have been disabled for 1 invalid unit(s) of work during this build to ensure correctness.
Please consult deprecation warnings for more details.

BUILD FAILED in 30m 57s
274 actionable tasks: 178 executed, 84 from cache, 12 up-to-date

Publishing build scan...
https://ge.apache.org/s/rheidymkjuqno

Build step 'Invoke Gradle script' changed build result to FAILURE
Build step 'Invoke Gradle script' marked build as failure

---------------------------------------------------------------------
To unsubscribe, e-mail: builds-unsubscribe@beam.apache.org
For additional commands, e-mail: builds-help@beam.apache.org


Build failed in Jenkins: beam_PostCommit_XVR_Spark3 #3426

Posted by Apache Jenkins Server <je...@builds.apache.org>.
See <https://ci-beam.apache.org/job/beam_PostCommit_XVR_Spark3/3426/display/redirect>

Changes:


------------------------------------------
[...truncated 1.14 MB...]
      spec: <
        urn: "beam:coders:javasdk:0.1"
        payload: "\202SNAPPY\000\000\000\000\001\000\000\000\001\000\000\000\312\214\002\360^\254\355\000\005sr\000,org.apache.beam.sdk.coders.SerializableCoder\010\364 \216\305ynl\002\000\001L\000\004typet\000\021Ljava/lang/Class;xr\000&ofV\000\024Custom\005P8j\260\010\235\013;\035\013\002\000\000xr\000 j\213\000\005/\034C\335\325\211\256\274~\370\001/\020pvr\000;N1\000Pio.BoundedReadFromUnb\t\021`Source$Shardd\236\240U\205\000j\363\002\000\000xp"
      >
    >
  >
  coders: <
    key: "HsRYdOtZOETimestampedValueCoder"
    value: <
      spec: <
        urn: "beam:coders:javasdk:0.1"
        payload: "\202SNAPPY\000\000\000\000\001\000\000\000\001\000\000\001?\315\003\270\254\355\000\005sr\000Aorg.apache.beam.sdk.values.TimestampedV\001\022\000$>\021\000LCoder\364\376\202p\274iX-\002\000\001L\000\nv\001)\005\030\034t\000\"Lorg/\t]\000/\001],/sdk/coders/\005$\020;xr\000*N\202\000\t%(.Structured\005/8s\277\022\016\325\3246\021\002\000\000xr\000 j9\000\005/\034C\335\325\211\256\274~\370\001/\020psr\000,j1\000(Serializabl\t\277\034\010\364 \216\305ynl\005\327\\\004typet\000\021Ljava/lang/Class\001\300\000&jV\000\024Custom\005\215Pj\260\010\235\013;\035\013\002\000\000xq\000~\000\003vr\000;N;\000Pio.BoundedReadFromUnb\t\021`Source$Shardd\236\240U\205\000j\363\002\000\000xp"
      >
    >
  >
  coders: <
    key: "HsRYdOtZOEValueWithRecordIdCoder"
    value: <
      spec: <
        urn: "beam:coders:javasdk:0.1"
        payload: "\202SNAPPY\000\000\000\000\001\000\000\000\001\000\000\001\213\311\005\320\254\355\000\005sr\000Corg.apache.beam.sdk.values.ValueWithRecordId$B\022\000LCoder{\343\376bQ\014\204>\002\000\002L\000\007i\t\025\034t\000+Lorg/\t\\\000/\001\\\024/sdk/c\0012(s/ByteArray\005B\014;L\000\n\005u\005\016\010t\000\"n;\000\005$\020;xr\000*N\274\000\t`(.Structured\005/8s\277\022\016\325\3246\021\002\000\000xr\000 j9\000\005/\034C\335\325\211\256\274~\370\001/\020psr\000)j1\0006\312\000\034\351\277\005|\263\3746\333\001:\010r\000&j8\000\024Atomic\005o\034\307\354\265\314\205tPF\0015 q\000~\000\003sr\000-N;\000$io.kafka.K\001\006\000R%\227\005B<I\320\251Y\032\341{#\002\000\001L\000\007kv\005\025\010t\000$nH\001\000K\t&\000;\025s\000\"Ns\000-P\r- j\000\275\271\035\243\3126\002!\353\010\010ke)\277\001\264\000\0022\303\001\005\022\025Y\000(jY\000\030Nullabl)\372\034E\333\0336>\220\247\007\005\307]\022.O\000\001\014,\006sq\000~\000\016q\000~\000\020"
      >
    >
  >
  coders: <
    key: "HsRYdOtZOEVarIntCoder"
    value: <
      spec: <
        urn: "beam:coders:javasdk:0.1"
        payload: "\202SNAPPY\000\000\000\000\001\000\000\000\001\000\000\000\210\330\001\350\254\355\000\005sr\000&org.apache.beam.sdk.coders.VarIntCoder\300K2\332\251KVh\002\000\000xrr5\000\024Atomic\0055 \307\354\265\314\205tPF\002\0055\000*jj\000$Structured\0059\034s\277\022\016\325\3246\021\t9\000 j9\000\005/0C\335\325\211\256\274~\370\002\000\000xp"
      >
    >
  >
  coders: <
    key: "c0"
    value: <
      spec: <
        urn: "beam:coder:bytes:v1"
      >
    >
  >
  coders: <
    key: "c1"
    value: <
      spec: <
        urn: "beam:coder:global_window:v1"
      >
    >
  >
  coders: <
    key: "c2"
    value: <
      spec: <
        urn: "beam:go:coder:custom:v1"
        payload: "Cgd2YXJpbnR6EgIIAhpdCklnaXRodWIuY29tL2FwYWNoZS9iZWFtL3Nka3MvdjIvZ28vcGtnL2JlYW0vY29yZS9ydW50aW1lL2NvZGVyeC5lbmNWYXJJbnRaEhAIFiIECBlADyoGCBQSAggIImkKSWdpdGh1Yi5jb20vYXBhY2hlL2JlYW0vc2Rrcy92Mi9nby9wa2cvYmVhbS9jb3JlL3J1bnRpbWUvY29kZXJ4LmRlY1ZhckludFoSHAgWIgQIGUADIgYIFBICCAgqBAgZQA8qBAgZQAE="
      >
    >
  >
  coders: <
    key: "c3"
    value: <
      spec: <
        urn: "beam:coder:length_prefix:v1"
      >
      component_coder_ids: "c2"
    >
  >
  coders: <
    key: "c4"
    value: <
      spec: <
        urn: "beam:coder:kv:v1"
      >
      component_coder_ids: "c0"
      component_coder_ids: "c0"
    >
  >
  environments: <
    key: "HsRYdOtZOEbeam:env:docker:v1"
    value: <
      urn: "beam:env:docker:v1"
      payload: "\n apache/beam_java8_sdk:2.50.0.dev"
      capabilities: "beam:coder:bytes:v1"
      capabilities: "beam:coder:bool:v1"
      capabilities: "beam:coder:varint:v1"
      capabilities: "beam:coder:string_utf8:v1"
      capabilities: "beam:coder:iterable:v1"
      capabilities: "beam:coder:timer:v1"
      capabilities: "beam:coder:kv:v1"
      capabilities: "beam:coder:length_prefix:v1"
      capabilities: "beam:coder:global_window:v1"
      capabilities: "beam:coder:interval_window:v1"
      capabilities: "beam:coder:custom_window:v1"
      capabilities: "beam:coder:windowed_value:v1"
      capabilities: "beam:coder:double:v1"
      capabilities: "beam:coder:row:v1"
      capabilities: "beam:coder:param_windowed_value:v1"
      capabilities: "beam:coder:state_backed_iterable:v1"
      capabilities: "beam:coder:sharded_key:v1"
      capabilities: "beam:coder:nullable:v1"
      capabilities: "beam:protocol:multi_core_bundle_processing:v1"
      capabilities: "beam:protocol:progress_reporting:v1"
      capabilities: "beam:protocol:harness_monitoring_infos:v1"
      capabilities: "beam:protocol:control_request_elements_embedding:v1"
      capabilities: "beam:protocol:state_caching:v1"
      capabilities: "beam:version:sdk_base:apache/beam_java8_sdk:2.50.0.dev"
      capabilities: "beam:transform:sdf_truncate_sized_restrictions:v1"
      capabilities: "beam:transform:to_string:v1"
      capabilities: "beam:protocol:data_sampling:v1"
      dependencies: <
        type_urn: "beam:artifact:type:file:v1"
        type_payload: "\nL/tmp/artifacts/icedtea-sound-Sx4pTbVkRyMN68Iwm-IRjHx-_IrVB7OJ04Hgf0GOshw.jar\022@4b1e294db56447230debc2309be2118c7c7efc8ad507b389d381e07f418eb21c"
        role_urn: "beam:artifact:role:staging_to:v1"
        role_payload: "\n=icedtea-sound-Sx4pTbVkRyMN68Iwm-IRjHx-_IrVB7OJ04Hgf0GOshw.jar"
      >
      dependencies: <
        type_urn: "beam:artifact:type:file:v1"
        type_payload: "\nF/tmp/artifacts/jaccess-cLw_6VKUXVSSR02qNdmHfiCEQC4xgO9cGkcXeJGoXLU.jar\022@70bc3fe952945d5492474daa35d9877e2084402e3180ef5c1a47177891a85cb5"
        role_urn: "beam:artifact:role:staging_to:v1"
        role_payload: "\n7jaccess-cLw_6VKUXVSSR02qNdmHfiCEQC4xgO9cGkcXeJGoXLU.jar"
      >
      dependencies: <
        type_urn: "beam:artifact:type:file:v1"
        type_payload: "\nI/tmp/artifacts/localedata-m64AoS_ttn_e9NIqwSVR0lu2Z1Z5ql2mff-rP_lcNFc.jar\022@9bae00a12fedb67fdef4d22ac12551d25bb6675679aa5da67dffab3ff95c3457"
        role_urn: "beam:artifact:role:staging_to:v1"
        role_payload: "\n:localedata-m64AoS_ttn_e9NIqwSVR0lu2Z1Z5ql2mff-rP_lcNFc.jar"
      >
      dependencies: <
        type_urn: "beam:artifact:type:file:v1"
        type_payload: "\nF/tmp/artifacts/nashorn-N0Jsn4-u6InD0KSL1iQKJxisnjbN1yx2Il6jtukpLvI.jar\022@37426c9f8faee889c3d0a48bd6240a2718ac9e36cdd72c76225ea3b6e9292ef2"
        role_urn: "beam:artifact:role:staging_to:v1"
        role_payload: "\n7nashorn-N0Jsn4-u6InD0KSL1iQKJxisnjbN1yx2Il6jtukpLvI.jar"
      >
      dependencies: <
        type_urn: "beam:artifact:type:file:v1"
        type_payload: "\nG/tmp/artifacts/cldrdata-5EWPOR1vxHHNVt2c5NwrXn6onAk_PiwkFY34pXx-PXY.jar\022@e4458f391d6fc471cd56dd9ce4dc2b5e7ea89c093f3e2c24158df8a57c7e3d76"
        role_urn: "beam:artifact:role:staging_to:v1"
        role_payload: "\n8cldrdata-5EWPOR1vxHHNVt2c5NwrXn6onAk_PiwkFY34pXx-PXY.jar"
      >
      dependencies: <
        type_urn: "beam:artifact:type:file:v1"
        type_payload: "\nD/tmp/artifacts/dnsns-WBg9XKwp_aXals1SHuDLDILJwBF0Qp8_Vs6ch4cmKVc.jar\022@58183d5cac29fda5da96cd521ee0cb0c82c9c01174429f3f56ce9c8787262957"
        role_urn: "beam:artifact:role:staging_to:v1"
        role_payload: "\n5dnsns-WBg9XKwp_aXals1SHuDLDILJwBF0Qp8_Vs6ch4cmKVc.jar"
      >
      dependencies: <
        type_urn: "beam:artifact:type:file:v1"
        type_payload: "\nr/tmp/artifacts/beam-sdks-java-io-expansion-service-2.50.0-SNAPSHOT-laIirfe5DlRWhs4zZLc6h83GKIwlrr_6yWHJyx9K9JQ.jar\022@95a222adf7b90e545686ce3364b73a87cdc6288c25aebffac961c9cb1f4af494"
        role_urn: "beam:artifact:role:staging_to:v1"
        role_payload: "\ncbeam-sdks-java-io-expansion-service-2.50.0-SNAPSHOT-laIirfe5DlRWhs4zZLc6h83GKIwlrr_6yWHJyx9K9JQ.jar"
      >
    >
  >
  environments: <
    key: "go"
    value: <
      urn: "beam:env:docker:v1"
      payload: "\n\026apache/beam_go_sdk:dev"
      capabilities: "beam:protocol:progress_reporting:v1"
      capabilities: "beam:protocol:multi_core_bundle_processing:v1"
      capabilities: "beam:transform:sdf_truncate_sized_restrictions:v1"
      capabilities: "beam:protocol:worker_status:v1"
      capabilities: "beam:protocol:monitoring_info_short_ids:v1"
      capabilities: "beam:version:sdk_base:go:apache/beam_go_sdk:2.50.0.dev"
      capabilities: "beam:coder:bytes:v1"
      capabilities: "beam:coder:bool:v1"
      capabilities: "beam:coder:varint:v1"
      capabilities: "beam:coder:double:v1"
      capabilities: "beam:coder:string_utf8:v1"
      capabilities: "beam:coder:length_prefix:v1"
      capabilities: "beam:coder:kv:v1"
      capabilities: "beam:coder:iterable:v1"
      capabilities: "beam:coder:state_backed_iterable:v1"
      capabilities: "beam:coder:windowed_value:v1"
      capabilities: "beam:coder:global_window:v1"
      capabilities: "beam:coder:interval_window:v1"
      capabilities: "beam:coder:row:v1"
      capabilities: "beam:coder:nullable:v1"
      capabilities: "beam:coder:timer:v1"
      dependencies: <
        type_urn: "beam:artifact:type:file:v1"
        role_urn: "beam:artifact:role:go_worker_binary:v1"
      >
    >
  >
>
root_transform_ids: "s1"
root_transform_ids: "e4"
root_transform_ids: "e5"
root_transform_ids: "s3"
2023/08/06 14:37:35 Cross-compiling <https://ci-beam.apache.org/job/beam_PostCommit_XVR_Spark3/ws/src/sdks/go/test/integration/io/xlang/kafka/kafka_test.go> with GOOS=linux GOARCH=amd64 CGO_ENABLED=0 as /tmp/worker-2-1691332655933569922
2023/08/06 14:37:38 Prepared job with id: go-testkafkaio_basicreadwrite-235_45b5be4e-018e-4d99-a928-8de684ea80c9 and staging token: go-testkafkaio_basicreadwrite-235_45b5be4e-018e-4d99-a928-8de684ea80c9
2023/08/06 14:37:38 Staged binary artifact with token: 
2023/08/06 14:37:38 Submitted job: go0testkafkaio0basicreadwrite0235-jenkins-0806143738-7f3b4303_cd1e7ff5-e582-4d66-bc4f-bbf86995c1f1
2023/08/06 14:37:38 Job state: STOPPED
2023/08/06 14:37:38 Job state: STARTING
2023/08/06 14:37:38 Job state: RUNNING
2023/08/06 14:37:59 Job state: DONE
--- PASS: TestKafkaIO_BasicReadWrite (39.48s)
PASS
ok  	github.com/apache/beam/sdks/v2/go/test/integration/io/xlang/kafka	45.513s

> Task :runners:spark:3:job-server:validatesCrossLanguageRunnerJavaUsingPython
INFO:root:No image given, using default Python SDK image
INFO:root:Python SDK container image set to "apache/beam_python3.8_sdk:2.49.0" for Docker environment
INFO:__main__:Listening for expansion requests at 45353
INFO:root:Missing pipeline option (runner). Executing pipeline using the default runner: DirectRunner.
INFO:__main__:Shutting down expansion service.
INFO:apache_beam.runners.portability.stager:Executing command: ['/home/jenkins/.apache_beam/cache/venvs/py-3.8-beam-2.49.0-743bdccef67087512a7a190820e727aab7bdcb14/bin/python', '-m', 'pip', 'download', '--dest', '/tmp/dataflow-requirements-cache', '-r', '/tmp/tmp4xbdzxsn/tmp_requirements.txt', '--exists-action', 'i', '--no-deps', '--implementation', 'cp', '--abi', 'cp38', '--platform', 'manylinux2014_x86_64']
INFO:root:No image given, using default Python SDK image
INFO:root:Python SDK container image set to "apache/beam_python3.8_sdk:2.49.0" for Docker environment
INFO:__main__:Listening for expansion requests at 41213
INFO:root:Missing pipeline option (runner). Executing pipeline using the default runner: DirectRunner.
INFO:__main__:Shutting down expansion service.

> Task :runners:spark:3:job-server:validatesCrossLanguageRunnerPythonUsingJava
> Task :runners:spark:3:job-server:validatesCrossLanguageRunnerPythonUsingSql FAILED
> Task :runners:spark:3:job-server:sparkJobServerCleanup
> Task :runners:spark:3:job-server:validatesCrossLanguageRunnerCleanup

FAILURE: Build failed with an exception.

* What went wrong:
Execution failed for task ':runners:spark:3:job-server:validatesCrossLanguageRunnerPythonUsingSql'.
> Process 'command 'sh'' finished with non-zero exit value 1

* Try:
> Run with --stacktrace option to get the stack trace.
> Run with --info or --debug option to get more log output.

* Get more help at https://help.gradle.org

Deprecated Gradle features were used in this build, making it incompatible with Gradle 8.0.

You can use '--warning-mode all' to show the individual deprecation warnings and determine if they come from your own scripts or plugins.

See https://docs.gradle.org/7.6.2/userguide/command_line_interface.html#sec:command_line_warnings

Execution optimizations have been disabled for 1 invalid unit(s) of work during this build to ensure correctness.
Please consult deprecation warnings for more details.

BUILD FAILED in 33m 30s
274 actionable tasks: 178 executed, 84 from cache, 12 up-to-date

Publishing build scan...
https://ge.apache.org/s/bqqpwawpf67n6

Build step 'Invoke Gradle script' changed build result to FAILURE
Build step 'Invoke Gradle script' marked build as failure

---------------------------------------------------------------------
To unsubscribe, e-mail: builds-unsubscribe@beam.apache.org
For additional commands, e-mail: builds-help@beam.apache.org


Build failed in Jenkins: beam_PostCommit_XVR_Spark3 #3425

Posted by Apache Jenkins Server <je...@builds.apache.org>.
See <https://ci-beam.apache.org/job/beam_PostCommit_XVR_Spark3/3425/display/redirect>

Changes:


------------------------------------------
[...truncated 1.14 MB...]
      spec: <
        urn: "beam:coders:javasdk:0.1"
        payload: "\202SNAPPY\000\000\000\000\001\000\000\000\001\000\000\000\312\214\002\360^\254\355\000\005sr\000,org.apache.beam.sdk.coders.SerializableCoder\010\364 \216\305ynl\002\000\001L\000\004typet\000\021Ljava/lang/Class;xr\000&ofV\000\024Custom\005P8j\260\010\235\013;\035\013\002\000\000xr\000 j\213\000\005/\034C\335\325\211\256\274~\370\001/\020pvr\000;N1\000Pio.BoundedReadFromUnb\t\021`Source$Shardd\236\240U\205\000j\363\002\000\000xp"
      >
    >
  >
  coders: <
    key: "ATSBWFyhgjTimestampedValueCoder"
    value: <
      spec: <
        urn: "beam:coders:javasdk:0.1"
        payload: "\202SNAPPY\000\000\000\000\001\000\000\000\001\000\000\001?\315\003\270\254\355\000\005sr\000Aorg.apache.beam.sdk.values.TimestampedV\001\022\000$>\021\000LCoder\364\376\202p\274iX-\002\000\001L\000\nv\001)\005\030\034t\000\"Lorg/\t]\000/\001],/sdk/coders/\005$\020;xr\000*N\202\000\t%(.Structured\005/8s\277\022\016\325\3246\021\002\000\000xr\000 j9\000\005/\034C\335\325\211\256\274~\370\001/\020psr\000,j1\000(Serializabl\t\277\034\010\364 \216\305ynl\005\327\\\004typet\000\021Ljava/lang/Class\001\300\000&jV\000\024Custom\005\215Pj\260\010\235\013;\035\013\002\000\000xq\000~\000\003vr\000;N;\000Pio.BoundedReadFromUnb\t\021`Source$Shardd\236\240U\205\000j\363\002\000\000xp"
      >
    >
  >
  coders: <
    key: "ATSBWFyhgjValueWithRecordIdCoder"
    value: <
      spec: <
        urn: "beam:coders:javasdk:0.1"
        payload: "\202SNAPPY\000\000\000\000\001\000\000\000\001\000\000\001\213\311\005\320\254\355\000\005sr\000Corg.apache.beam.sdk.values.ValueWithRecordId$B\022\000LCoder{\343\376bQ\014\204>\002\000\002L\000\007i\t\025\034t\000+Lorg/\t\\\000/\001\\\024/sdk/c\0012(s/ByteArray\005B\014;L\000\n\005u\005\016\010t\000\"n;\000\005$\020;xr\000*N\274\000\t`(.Structured\005/8s\277\022\016\325\3246\021\002\000\000xr\000 j9\000\005/\034C\335\325\211\256\274~\370\001/\020psr\000)j1\0006\312\000\034\351\277\005|\263\3746\333\001:\010r\000&j8\000\024Atomic\005o\034\307\354\265\314\205tPF\0015 q\000~\000\003sr\000-N;\000$io.kafka.K\001\006\000R%\227\005B<I\320\251Y\032\341{#\002\000\001L\000\007kv\005\025\010t\000$nH\001\000K\t&\000;\025s\000\"Ns\000-P\r- j\000\275\271\035\243\3126\002!\353\010\010ke)\277\001\264\000\0022\303\001\005\022\025Y\000(jY\000\030Nullabl)\372\034E\333\0336>\220\247\007\005\307]\022.O\000\001\014,\006sq\000~\000\016q\000~\000\020"
      >
    >
  >
  coders: <
    key: "ATSBWFyhgjVarIntCoder"
    value: <
      spec: <
        urn: "beam:coders:javasdk:0.1"
        payload: "\202SNAPPY\000\000\000\000\001\000\000\000\001\000\000\000\210\330\001\350\254\355\000\005sr\000&org.apache.beam.sdk.coders.VarIntCoder\300K2\332\251KVh\002\000\000xrr5\000\024Atomic\0055 \307\354\265\314\205tPF\002\0055\000*jj\000$Structured\0059\034s\277\022\016\325\3246\021\t9\000 j9\000\005/0C\335\325\211\256\274~\370\002\000\000xp"
      >
    >
  >
  coders: <
    key: "c0"
    value: <
      spec: <
        urn: "beam:coder:bytes:v1"
      >
    >
  >
  coders: <
    key: "c1"
    value: <
      spec: <
        urn: "beam:coder:global_window:v1"
      >
    >
  >
  coders: <
    key: "c2"
    value: <
      spec: <
        urn: "beam:go:coder:custom:v1"
        payload: "Cgd2YXJpbnR6EgIIAhpdCklnaXRodWIuY29tL2FwYWNoZS9iZWFtL3Nka3MvdjIvZ28vcGtnL2JlYW0vY29yZS9ydW50aW1lL2NvZGVyeC5lbmNWYXJJbnRaEhAIFiIECBlADyoGCBQSAggIImkKSWdpdGh1Yi5jb20vYXBhY2hlL2JlYW0vc2Rrcy92Mi9nby9wa2cvYmVhbS9jb3JlL3J1bnRpbWUvY29kZXJ4LmRlY1ZhckludFoSHAgWIgQIGUADIgYIFBICCAgqBAgZQA8qBAgZQAE="
      >
    >
  >
  coders: <
    key: "c3"
    value: <
      spec: <
        urn: "beam:coder:length_prefix:v1"
      >
      component_coder_ids: "c2"
    >
  >
  coders: <
    key: "c4"
    value: <
      spec: <
        urn: "beam:coder:kv:v1"
      >
      component_coder_ids: "c0"
      component_coder_ids: "c0"
    >
  >
  environments: <
    key: "ATSBWFyhgjbeam:env:docker:v1"
    value: <
      urn: "beam:env:docker:v1"
      payload: "\n apache/beam_java8_sdk:2.50.0.dev"
      capabilities: "beam:coder:bytes:v1"
      capabilities: "beam:coder:bool:v1"
      capabilities: "beam:coder:varint:v1"
      capabilities: "beam:coder:string_utf8:v1"
      capabilities: "beam:coder:iterable:v1"
      capabilities: "beam:coder:timer:v1"
      capabilities: "beam:coder:kv:v1"
      capabilities: "beam:coder:length_prefix:v1"
      capabilities: "beam:coder:global_window:v1"
      capabilities: "beam:coder:interval_window:v1"
      capabilities: "beam:coder:custom_window:v1"
      capabilities: "beam:coder:windowed_value:v1"
      capabilities: "beam:coder:double:v1"
      capabilities: "beam:coder:row:v1"
      capabilities: "beam:coder:param_windowed_value:v1"
      capabilities: "beam:coder:state_backed_iterable:v1"
      capabilities: "beam:coder:sharded_key:v1"
      capabilities: "beam:coder:nullable:v1"
      capabilities: "beam:protocol:multi_core_bundle_processing:v1"
      capabilities: "beam:protocol:progress_reporting:v1"
      capabilities: "beam:protocol:harness_monitoring_infos:v1"
      capabilities: "beam:protocol:control_request_elements_embedding:v1"
      capabilities: "beam:protocol:state_caching:v1"
      capabilities: "beam:version:sdk_base:apache/beam_java8_sdk:2.50.0.dev"
      capabilities: "beam:transform:sdf_truncate_sized_restrictions:v1"
      capabilities: "beam:transform:to_string:v1"
      capabilities: "beam:protocol:data_sampling:v1"
      dependencies: <
        type_urn: "beam:artifact:type:file:v1"
        type_payload: "\nL/tmp/artifacts/icedtea-sound-Sx4pTbVkRyMN68Iwm-IRjHx-_IrVB7OJ04Hgf0GOshw.jar\022@4b1e294db56447230debc2309be2118c7c7efc8ad507b389d381e07f418eb21c"
        role_urn: "beam:artifact:role:staging_to:v1"
        role_payload: "\n=icedtea-sound-Sx4pTbVkRyMN68Iwm-IRjHx-_IrVB7OJ04Hgf0GOshw.jar"
      >
      dependencies: <
        type_urn: "beam:artifact:type:file:v1"
        type_payload: "\nF/tmp/artifacts/jaccess-cLw_6VKUXVSSR02qNdmHfiCEQC4xgO9cGkcXeJGoXLU.jar\022@70bc3fe952945d5492474daa35d9877e2084402e3180ef5c1a47177891a85cb5"
        role_urn: "beam:artifact:role:staging_to:v1"
        role_payload: "\n7jaccess-cLw_6VKUXVSSR02qNdmHfiCEQC4xgO9cGkcXeJGoXLU.jar"
      >
      dependencies: <
        type_urn: "beam:artifact:type:file:v1"
        type_payload: "\nI/tmp/artifacts/localedata-m64AoS_ttn_e9NIqwSVR0lu2Z1Z5ql2mff-rP_lcNFc.jar\022@9bae00a12fedb67fdef4d22ac12551d25bb6675679aa5da67dffab3ff95c3457"
        role_urn: "beam:artifact:role:staging_to:v1"
        role_payload: "\n:localedata-m64AoS_ttn_e9NIqwSVR0lu2Z1Z5ql2mff-rP_lcNFc.jar"
      >
      dependencies: <
        type_urn: "beam:artifact:type:file:v1"
        type_payload: "\nF/tmp/artifacts/nashorn-N0Jsn4-u6InD0KSL1iQKJxisnjbN1yx2Il6jtukpLvI.jar\022@37426c9f8faee889c3d0a48bd6240a2718ac9e36cdd72c76225ea3b6e9292ef2"
        role_urn: "beam:artifact:role:staging_to:v1"
        role_payload: "\n7nashorn-N0Jsn4-u6InD0KSL1iQKJxisnjbN1yx2Il6jtukpLvI.jar"
      >
      dependencies: <
        type_urn: "beam:artifact:type:file:v1"
        type_payload: "\nG/tmp/artifacts/cldrdata-5EWPOR1vxHHNVt2c5NwrXn6onAk_PiwkFY34pXx-PXY.jar\022@e4458f391d6fc471cd56dd9ce4dc2b5e7ea89c093f3e2c24158df8a57c7e3d76"
        role_urn: "beam:artifact:role:staging_to:v1"
        role_payload: "\n8cldrdata-5EWPOR1vxHHNVt2c5NwrXn6onAk_PiwkFY34pXx-PXY.jar"
      >
      dependencies: <
        type_urn: "beam:artifact:type:file:v1"
        type_payload: "\nD/tmp/artifacts/dnsns-WBg9XKwp_aXals1SHuDLDILJwBF0Qp8_Vs6ch4cmKVc.jar\022@58183d5cac29fda5da96cd521ee0cb0c82c9c01174429f3f56ce9c8787262957"
        role_urn: "beam:artifact:role:staging_to:v1"
        role_payload: "\n5dnsns-WBg9XKwp_aXals1SHuDLDILJwBF0Qp8_Vs6ch4cmKVc.jar"
      >
      dependencies: <
        type_urn: "beam:artifact:type:file:v1"
        type_payload: "\nr/tmp/artifacts/beam-sdks-java-io-expansion-service-2.50.0-SNAPSHOT-laIirfe5DlRWhs4zZLc6h83GKIwlrr_6yWHJyx9K9JQ.jar\022@95a222adf7b90e545686ce3364b73a87cdc6288c25aebffac961c9cb1f4af494"
        role_urn: "beam:artifact:role:staging_to:v1"
        role_payload: "\ncbeam-sdks-java-io-expansion-service-2.50.0-SNAPSHOT-laIirfe5DlRWhs4zZLc6h83GKIwlrr_6yWHJyx9K9JQ.jar"
      >
    >
  >
  environments: <
    key: "go"
    value: <
      urn: "beam:env:docker:v1"
      payload: "\n\026apache/beam_go_sdk:dev"
      capabilities: "beam:protocol:progress_reporting:v1"
      capabilities: "beam:protocol:multi_core_bundle_processing:v1"
      capabilities: "beam:transform:sdf_truncate_sized_restrictions:v1"
      capabilities: "beam:protocol:worker_status:v1"
      capabilities: "beam:protocol:monitoring_info_short_ids:v1"
      capabilities: "beam:version:sdk_base:go:apache/beam_go_sdk:2.50.0.dev"
      capabilities: "beam:coder:bytes:v1"
      capabilities: "beam:coder:bool:v1"
      capabilities: "beam:coder:varint:v1"
      capabilities: "beam:coder:double:v1"
      capabilities: "beam:coder:string_utf8:v1"
      capabilities: "beam:coder:length_prefix:v1"
      capabilities: "beam:coder:kv:v1"
      capabilities: "beam:coder:iterable:v1"
      capabilities: "beam:coder:state_backed_iterable:v1"
      capabilities: "beam:coder:windowed_value:v1"
      capabilities: "beam:coder:global_window:v1"
      capabilities: "beam:coder:interval_window:v1"
      capabilities: "beam:coder:row:v1"
      capabilities: "beam:coder:nullable:v1"
      capabilities: "beam:coder:timer:v1"
      dependencies: <
        type_urn: "beam:artifact:type:file:v1"
        role_urn: "beam:artifact:role:go_worker_binary:v1"
      >
    >
  >
>
root_transform_ids: "s1"
root_transform_ids: "e4"
root_transform_ids: "e5"
root_transform_ids: "s3"
2023/08/06 08:37:52 Cross-compiling <https://ci-beam.apache.org/job/beam_PostCommit_XVR_Spark3/ws/src/sdks/go/test/integration/io/xlang/kafka/kafka_test.go> with GOOS=linux GOARCH=amd64 CGO_ENABLED=0 as /tmp/worker-2-1691311072024748114
2023/08/06 08:37:54 Prepared job with id: go-testkafkaio_basicreadwrite-182_54b17203-6d50-4f34-81ef-f1c9a56aefdd and staging token: go-testkafkaio_basicreadwrite-182_54b17203-6d50-4f34-81ef-f1c9a56aefdd
2023/08/06 08:37:54 Staged binary artifact with token: 
2023/08/06 08:37:54 Submitted job: go0testkafkaio0basicreadwrite0182-jenkins-0806083754-ccd799ec_ef132b8c-b53f-40c2-83e9-68de81590ed8
2023/08/06 08:37:54 Job state: STOPPED
2023/08/06 08:37:54 Job state: STARTING
2023/08/06 08:37:54 Job state: RUNNING
2023/08/06 08:38:15 Job state: DONE
--- PASS: TestKafkaIO_BasicReadWrite (39.24s)
PASS
ok  	github.com/apache/beam/sdks/v2/go/test/integration/io/xlang/kafka	45.269s

> Task :runners:spark:3:job-server:validatesCrossLanguageRunnerJavaUsingPython
INFO:root:No image given, using default Python SDK image
INFO:root:Python SDK container image set to "apache/beam_python3.8_sdk:2.49.0" for Docker environment
INFO:__main__:Listening for expansion requests at 33305
INFO:root:Missing pipeline option (runner). Executing pipeline using the default runner: DirectRunner.
INFO:__main__:Shutting down expansion service.
INFO:apache_beam.runners.portability.stager:Executing command: ['/home/jenkins/.apache_beam/cache/venvs/py-3.8-beam-2.49.0-743bdccef67087512a7a190820e727aab7bdcb14/bin/python', '-m', 'pip', 'download', '--dest', '/tmp/dataflow-requirements-cache', '-r', '/tmp/tmpyw3l334q/tmp_requirements.txt', '--exists-action', 'i', '--no-deps', '--implementation', 'cp', '--abi', 'cp38', '--platform', 'manylinux2014_x86_64']
INFO:root:No image given, using default Python SDK image
INFO:root:Python SDK container image set to "apache/beam_python3.8_sdk:2.49.0" for Docker environment
INFO:__main__:Listening for expansion requests at 41209
INFO:root:Missing pipeline option (runner). Executing pipeline using the default runner: DirectRunner.
INFO:__main__:Shutting down expansion service.

> Task :runners:spark:3:job-server:validatesCrossLanguageRunnerPythonUsingJava
> Task :runners:spark:3:job-server:validatesCrossLanguageRunnerPythonUsingSql FAILED
> Task :runners:spark:3:job-server:sparkJobServerCleanup
> Task :runners:spark:3:job-server:validatesCrossLanguageRunnerCleanup

FAILURE: Build failed with an exception.

* What went wrong:
Execution failed for task ':runners:spark:3:job-server:validatesCrossLanguageRunnerPythonUsingSql'.
> Process 'command 'sh'' finished with non-zero exit value 1

* Try:
> Run with --stacktrace option to get the stack trace.
> Run with --info or --debug option to get more log output.

* Get more help at https://help.gradle.org

Deprecated Gradle features were used in this build, making it incompatible with Gradle 8.0.

You can use '--warning-mode all' to show the individual deprecation warnings and determine if they come from your own scripts or plugins.

See https://docs.gradle.org/7.6.2/userguide/command_line_interface.html#sec:command_line_warnings

Execution optimizations have been disabled for 1 invalid unit(s) of work during this build to ensure correctness.
Please consult deprecation warnings for more details.

BUILD FAILED in 33m 20s
274 actionable tasks: 179 executed, 83 from cache, 12 up-to-date

Publishing build scan...
https://ge.apache.org/s/cpdnmtu54jb7a

Build step 'Invoke Gradle script' changed build result to FAILURE
Build step 'Invoke Gradle script' marked build as failure

---------------------------------------------------------------------
To unsubscribe, e-mail: builds-unsubscribe@beam.apache.org
For additional commands, e-mail: builds-help@beam.apache.org


Build failed in Jenkins: beam_PostCommit_XVR_Spark3 #3424

Posted by Apache Jenkins Server <je...@builds.apache.org>.
See <https://ci-beam.apache.org/job/beam_PostCommit_XVR_Spark3/3424/display/redirect>

Changes:


------------------------------------------
[...truncated 852.12 KB...]
      component_coder_ids: "urGjrMoEORTimestampedValueCoder"
    >
  >
  coders: <
    key: "urGjrMoEORKvCoder3"
    value: <
      spec: <
        urn: "beam:coder:kv:v1"
      >
      component_coder_ids: "urGjrMoEORVarIntCoder"
      component_coder_ids: "urGjrMoEORIterableCoder"
    >
  >
  coders: <
    key: "urGjrMoEORNullableCoder"
    value: <
      spec: <
        urn: "beam:coder:nullable:v1"
      >
      component_coder_ids: "urGjrMoEORByteArrayCoder"
    >
  >
  coders: <
    key: "urGjrMoEORSerializableCoder"
    value: <
      spec: <
        urn: "beam:coders:javasdk:0.1"
        payload: "\202SNAPPY\000\000\000\000\001\000\000\000\001\000\000\000\312\214\002\360^\254\355\000\005sr\000,org.apache.beam.sdk.coders.SerializableCoder\010\364 \216\305ynl\002\000\001L\000\004typet\000\021Ljava/lang/Class;xr\000&ofV\000\024Custom\005P8j\260\010\235\013;\035\013\002\000\000xr\000 j\213\000\005/\034C\335\325\211\256\274~\370\001/\020pvr\000;N1\000Pio.BoundedReadFromUnb\t\021`Source$Shardd\236\240U\205\000j\363\002\000\000xp"
      >
    >
  >
  coders: <
    key: "urGjrMoEORTimestampedValueCoder"
    value: <
      spec: <
        urn: "beam:coders:javasdk:0.1"
        payload: "\202SNAPPY\000\000\000\000\001\000\000\000\001\000\000\001?\315\003\270\254\355\000\005sr\000Aorg.apache.beam.sdk.values.TimestampedV\001\022\000$>\021\000LCoder\364\376\202p\274iX-\002\000\001L\000\nv\001)\005\030\034t\000\"Lorg/\t]\000/\001],/sdk/coders/\005$\020;xr\000*N\202\000\t%(.Structured\005/8s\277\022\016\325\3246\021\002\000\000xr\000 j9\000\005/\034C\335\325\211\256\274~\370\001/\020psr\000,j1\000(Serializabl\t\277\034\010\364 \216\305ynl\005\327\\\004typet\000\021Ljava/lang/Class\001\300\000&jV\000\024Custom\005\215Pj\260\010\235\013;\035\013\002\000\000xq\000~\000\003vr\000;N;\000Pio.BoundedReadFromUnb\t\021`Source$Shardd\236\240U\205\000j\363\002\000\000xp"
      >
    >
  >
  coders: <
    key: "urGjrMoEORValueWithRecordIdCoder"
    value: <
      spec: <
        urn: "beam:coders:javasdk:0.1"
        payload: "\202SNAPPY\000\000\000\000\001\000\000\000\001\000\000\001\213\311\005\320\254\355\000\005sr\000Corg.apache.beam.sdk.values.ValueWithRecordId$B\022\000LCoder{\343\376bQ\014\204>\002\000\002L\000\007i\t\025\034t\000+Lorg/\t\\\000/\001\\\024/sdk/c\0012(s/ByteArray\005B\014;L\000\n\005u\005\016\010t\000\"n;\000\005$\020;xr\000*N\274\000\t`(.Structured\005/8s\277\022\016\325\3246\021\002\000\000xr\000 j9\000\005/\034C\335\325\211\256\274~\370\001/\020psr\000)j1\0006\312\000\034\351\277\005|\263\3746\333\001:\010r\000&j8\000\024Atomic\005o\034\307\354\265\314\205tPF\0015 q\000~\000\003sr\000-N;\000$io.kafka.K\001\006\000R%\227\005B<I\320\251Y\032\341{#\002\000\001L\000\007kv\005\025\010t\000$nH\001\000K\t&\000;\025s\000\"Ns\000-P\r- j\000\275\271\035\243\3126\002!\353\010\010ke)\277\001\264\000\0022\303\001\005\022\025Y\000(jY\000\030Nullabl)\372\034E\333\0336>\220\247\007\005\307]\022.O\000\001\014,\006sq\000~\000\016q\000~\000\020"
      >
    >
  >
  coders: <
    key: "urGjrMoEORVarIntCoder"
    value: <
      spec: <
        urn: "beam:coders:javasdk:0.1"
        payload: "\202SNAPPY\000\000\000\000\001\000\000\000\001\000\000\000\210\330\001\350\254\355\000\005sr\000&org.apache.beam.sdk.coders.VarIntCoder\300K2\332\251KVh\002\000\000xrr5\000\024Atomic\0055 \307\354\265\314\205tPF\002\0055\000*jj\000$Structured\0059\034s\277\022\016\325\3246\021\t9\000 j9\000\005/0C\335\325\211\256\274~\370\002\000\000xp"
      >
    >
  >
  environments: <
    key: "go"
    value: <
      urn: "beam:env:docker:v1"
      payload: "\n\026apache/beam_go_sdk:dev"
      capabilities: "beam:protocol:progress_reporting:v1"
      capabilities: "beam:protocol:multi_core_bundle_processing:v1"
      capabilities: "beam:transform:sdf_truncate_sized_restrictions:v1"
      capabilities: "beam:protocol:worker_status:v1"
      capabilities: "beam:protocol:monitoring_info_short_ids:v1"
      capabilities: "beam:version:sdk_base:go:apache/beam_go_sdk:2.50.0.dev"
      capabilities: "beam:coder:bytes:v1"
      capabilities: "beam:coder:bool:v1"
      capabilities: "beam:coder:varint:v1"
      capabilities: "beam:coder:double:v1"
      capabilities: "beam:coder:string_utf8:v1"
      capabilities: "beam:coder:length_prefix:v1"
      capabilities: "beam:coder:kv:v1"
      capabilities: "beam:coder:iterable:v1"
      capabilities: "beam:coder:state_backed_iterable:v1"
      capabilities: "beam:coder:windowed_value:v1"
      capabilities: "beam:coder:global_window:v1"
      capabilities: "beam:coder:interval_window:v1"
      capabilities: "beam:coder:row:v1"
      capabilities: "beam:coder:nullable:v1"
      capabilities: "beam:coder:timer:v1"
      dependencies: <
        type_urn: "beam:artifact:type:file:v1"
        role_urn: "beam:artifact:role:go_worker_binary:v1"
      >
    >
  >
  environments: <
    key: "urGjrMoEORbeam:env:docker:v1"
    value: <
      urn: "beam:env:docker:v1"
      payload: "\n apache/beam_java8_sdk:2.50.0.dev"
      capabilities: "beam:coder:bytes:v1"
      capabilities: "beam:coder:bool:v1"
      capabilities: "beam:coder:varint:v1"
      capabilities: "beam:coder:string_utf8:v1"
      capabilities: "beam:coder:iterable:v1"
      capabilities: "beam:coder:timer:v1"
      capabilities: "beam:coder:kv:v1"
      capabilities: "beam:coder:length_prefix:v1"
      capabilities: "beam:coder:global_window:v1"
      capabilities: "beam:coder:interval_window:v1"
      capabilities: "beam:coder:custom_window:v1"
      capabilities: "beam:coder:windowed_value:v1"
      capabilities: "beam:coder:double:v1"
      capabilities: "beam:coder:row:v1"
      capabilities: "beam:coder:param_windowed_value:v1"
      capabilities: "beam:coder:state_backed_iterable:v1"
      capabilities: "beam:coder:sharded_key:v1"
      capabilities: "beam:coder:nullable:v1"
      capabilities: "beam:protocol:multi_core_bundle_processing:v1"
      capabilities: "beam:protocol:progress_reporting:v1"
      capabilities: "beam:protocol:harness_monitoring_infos:v1"
      capabilities: "beam:protocol:control_request_elements_embedding:v1"
      capabilities: "beam:protocol:state_caching:v1"
      capabilities: "beam:version:sdk_base:apache/beam_java8_sdk:2.50.0.dev"
      capabilities: "beam:transform:sdf_truncate_sized_restrictions:v1"
      capabilities: "beam:transform:to_string:v1"
      capabilities: "beam:protocol:data_sampling:v1"
      dependencies: <
        type_urn: "beam:artifact:type:file:v1"
        type_payload: "\nL/tmp/artifacts/icedtea-sound-uoIQCGhMffp0D_gc1dkBtXBGXr18Bkb5Qx-e-CvP00s.jar\022@ba821008684c7dfa740ff81cd5d901b570465ebd7c0646f9431f9ef82bcfd34b"
        role_urn: "beam:artifact:role:staging_to:v1"
        role_payload: "\n=icedtea-sound-uoIQCGhMffp0D_gc1dkBtXBGXr18Bkb5Qx-e-CvP00s.jar"
      >
      dependencies: <
        type_urn: "beam:artifact:type:file:v1"
        type_payload: "\nF/tmp/artifacts/jaccess-T1qVdaqZDj2uNq1tdHEk1lwFMYQiwMhYa0jqGU9fUMg.jar\022@4f5a9575aa990e3dae36ad6d747124d65c05318422c0c8586b48ea194f5f50c8"
        role_urn: "beam:artifact:role:staging_to:v1"
        role_payload: "\n7jaccess-T1qVdaqZDj2uNq1tdHEk1lwFMYQiwMhYa0jqGU9fUMg.jar"
      >
      dependencies: <
        type_urn: "beam:artifact:type:file:v1"
        type_payload: "\nI/tmp/artifacts/localedata-dQT9YOGvbd1zEqcZsyJ1W4l8jNhxoX3b1nmMhdIbCb8.jar\022@7504fd60e1af6ddd7312a719b322755b897c8cd871a17ddbd6798c85d21b09bf"
        role_urn: "beam:artifact:role:staging_to:v1"
        role_payload: "\n:localedata-dQT9YOGvbd1zEqcZsyJ1W4l8jNhxoX3b1nmMhdIbCb8.jar"
      >
      dependencies: <
        type_urn: "beam:artifact:type:file:v1"
        type_payload: "\nF/tmp/artifacts/nashorn-gZxbPAWCb1KP7OCbxUu1prmT4YMEDX-mGdJFjkB3pfs.jar\022@819c5b3c05826f528fece09bc54bb5a6b993e183040d7fa619d2458e4077a5fb"
        role_urn: "beam:artifact:role:staging_to:v1"
        role_payload: "\n7nashorn-gZxbPAWCb1KP7OCbxUu1prmT4YMEDX-mGdJFjkB3pfs.jar"
      >
      dependencies: <
        type_urn: "beam:artifact:type:file:v1"
        type_payload: "\nG/tmp/artifacts/cldrdata-_GVjPlS0invvNh7wlTfv_CNVOxTj3Y-xvSW1Xw2r_-4.jar\022@fc65633e54b48a7bef361ef09537effc23553b14e3dd8fb1bd25b55f0dabffee"
        role_urn: "beam:artifact:role:staging_to:v1"
        role_payload: "\n8cldrdata-_GVjPlS0invvNh7wlTfv_CNVOxTj3Y-xvSW1Xw2r_-4.jar"
      >
      dependencies: <
        type_urn: "beam:artifact:type:file:v1"
        type_payload: "\nD/tmp/artifacts/dnsns-lI-xDSEZtu3C8A4-qt_7RcyP_ql7OU0LNZreNR5piTU.jar\022@948fb10d2119b6edc2f00e3eaadffb45cc8ffea97b394d0b359ade351e698935"
        role_urn: "beam:artifact:role:staging_to:v1"
        role_payload: "\n5dnsns-lI-xDSEZtu3C8A4-qt_7RcyP_ql7OU0LNZreNR5piTU.jar"
      >
      dependencies: <
        type_urn: "beam:artifact:type:file:v1"
        type_payload: "\nr/tmp/artifacts/beam-sdks-java-io-expansion-service-2.50.0-SNAPSHOT-laIirfe5DlRWhs4zZLc6h83GKIwlrr_6yWHJyx9K9JQ.jar\022@95a222adf7b90e545686ce3364b73a87cdc6288c25aebffac961c9cb1f4af494"
        role_urn: "beam:artifact:role:staging_to:v1"
        role_payload: "\ncbeam-sdks-java-io-expansion-service-2.50.0-SNAPSHOT-laIirfe5DlRWhs4zZLc6h83GKIwlrr_6yWHJyx9K9JQ.jar"
      >
    >
  >
>
root_transform_ids: "e4"
root_transform_ids: "s1"
root_transform_ids: "e5"
root_transform_ids: "s3"
2023/08/06 02:36:25 Cross-compiling <https://ci-beam.apache.org/job/beam_PostCommit_XVR_Spark3/ws/src/sdks/go/test/integration/io/xlang/kafka/kafka_test.go> with GOOS=linux GOARCH=amd64 CGO_ENABLED=0 as /tmp/worker-2-1691289385371252851
2023/08/06 02:36:30 Prepared job with id: go-testkafkaio_basicreadwrite-215_a4ebbd9c-5c21-40ee-bc42-fd9c725ddd18 and staging token: go-testkafkaio_basicreadwrite-215_a4ebbd9c-5c21-40ee-bc42-fd9c725ddd18
2023/08/06 02:36:30 Staged binary artifact with token: 
2023/08/06 02:36:30 Submitted job: go0testkafkaio0basicreadwrite0215-jenkins-0806023630-1adfa3d7_1d8c262e-3dd9-45eb-b1b4-ad9233738904
2023/08/06 02:36:30 Job state: STOPPED
2023/08/06 02:36:30 Job state: STARTING
2023/08/06 02:36:30 Job state: RUNNING
2023/08/06 02:36:57 Job state: DONE
--- PASS: TestKafkaIO_BasicReadWrite (59.18s)
PASS
ok  	github.com/apache/beam/sdks/v2/go/test/integration/io/xlang/kafka	65.209s
FAIL

> Task :runners:spark:3:job-server:validatesCrossLanguageRunnerGoUsingJava FAILED
> Task :runners:spark:3:job-server:validatesCrossLanguageRunnerJavaUsingPython
INFO:root:No image given, using default Python SDK image
INFO:root:Python SDK container image set to "apache/beam_python3.8_sdk:2.49.0" for Docker environment
INFO:__main__:Listening for expansion requests at 43353
INFO:root:Missing pipeline option (runner). Executing pipeline using the default runner: DirectRunner.
INFO:__main__:Shutting down expansion service.
INFO:apache_beam.runners.portability.stager:Executing command: ['/home/jenkins/.apache_beam/cache/venvs/py-3.8-beam-2.49.0-743bdccef67087512a7a190820e727aab7bdcb14/bin/python', '-m', 'pip', 'download', '--dest', '/tmp/dataflow-requirements-cache', '-r', '/tmp/tmpebe3i352/tmp_requirements.txt', '--exists-action', 'i', '--no-deps', '--implementation', 'cp', '--abi', 'cp38', '--platform', 'manylinux2014_x86_64']
INFO:root:No image given, using default Python SDK image
INFO:root:Python SDK container image set to "apache/beam_python3.8_sdk:2.49.0" for Docker environment
INFO:__main__:Listening for expansion requests at 38575
INFO:root:Missing pipeline option (runner). Executing pipeline using the default runner: DirectRunner.
INFO:__main__:Shutting down expansion service.

> Task :runners:spark:3:job-server:validatesCrossLanguageRunnerPythonUsingJava
> Task :runners:spark:3:job-server:validatesCrossLanguageRunnerPythonUsingSql FAILED
> Task :runners:spark:3:job-server:sparkJobServerCleanup
> Task :runners:spark:3:job-server:validatesCrossLanguageRunnerCleanup

FAILURE: Build completed with 2 failures.

1: Task failed with an exception.
-----------
* Where:
Build file '<https://ci-beam.apache.org/job/beam_PostCommit_XVR_Spark3/ws/src/sdks/go/test/build.gradle'> line: 217

* What went wrong:
Execution failed for task ':runners:spark:3:job-server:validatesCrossLanguageRunnerGoUsingJava'.
> Process 'command 'sh'' finished with non-zero exit value 1

* Try:
> Run with --stacktrace option to get the stack trace.
> Run with --info or --debug option to get more log output.
==============================================================================

2: Task failed with an exception.
-----------
* What went wrong:
Execution failed for task ':runners:spark:3:job-server:validatesCrossLanguageRunnerPythonUsingSql'.
> Process 'command 'sh'' finished with non-zero exit value 1

* Try:
> Run with --stacktrace option to get the stack trace.
> Run with --info or --debug option to get more log output.
==============================================================================

* Get more help at https://help.gradle.org

Deprecated Gradle features were used in this build, making it incompatible with Gradle 8.0.

You can use '--warning-mode all' to show the individual deprecation warnings and determine if they come from your own scripts or plugins.

See https://docs.gradle.org/7.6.2/userguide/command_line_interface.html#sec:command_line_warnings

Execution optimizations have been disabled for 1 invalid unit(s) of work during this build to ensure correctness.
Please consult deprecation warnings for more details.

BUILD FAILED in 30m 47s
274 actionable tasks: 178 executed, 84 from cache, 12 up-to-date

Publishing build scan...
https://ge.apache.org/s/3ulqz4bdvlaru

Build step 'Invoke Gradle script' changed build result to FAILURE
Build step 'Invoke Gradle script' marked build as failure

---------------------------------------------------------------------
To unsubscribe, e-mail: builds-unsubscribe@beam.apache.org
For additional commands, e-mail: builds-help@beam.apache.org