You are viewing a plain text version of this content. The canonical link for it is here.
Posted to dev@airavata.apache.org by Lahiru Gunathilake <gl...@gmail.com> on 2014/07/04 21:18:53 UTC
Build is breaken
[INFO] BUILD FAILURE
[INFO]
------------------------------------------------------------------------
[INFO] Total time: 11.570s
[INFO] Finished at: Fri Jul 04 15:18:22 EDT 2014
[INFO] Final Memory: 22M/106M
[INFO]
------------------------------------------------------------------------
[ERROR] Failed to execute goal
org.apache.maven.plugins:maven-compiler-plugin:3.1:compile
(default-compile) on project airavata-model-utils: Compilation failure:
Compilation failure:
[ERROR]
/Users/lahirugunathilake/work/airavata/git/airavata/airavata-api/airavata-model-utils/src/main/java/org/apache/airavata/model/util/ComputeResourceUtil.java:[47,19]
cannot find symbol
[ERROR] symbol : class GSISSHJobSubmission
[ERROR] location: class org.apache.airavata.model.util.ComputeResourceUtil
[ERROR]
/Users/lahirugunathilake/work/airavata/git/airavata/airavata-api/airavata-model-utils/src/main/java/org/apache/airavata/model/util/AppDeploymentUtil.java:[38,20]
cannot find symbol
[ERROR] symbol : method setModuleLoadCmd(java.lang.String)
[ERROR] location: class
org.apache.airavata.model.appcatalog.appdeployment.ApplicationDeploymentDescription
[ERROR]
/Users/lahirugunathilake/work/airavata/git/airavata/airavata-api/airavata-model-utils/src/main/java/org/apache/airavata/model/util/ComputeResourceUtil.java:[34,24]
cannot find symbol
[ERROR] symbol : method setResourceDescription(java.lang.String)
[ERROR] location: class
org.apache.airavata.model.appcatalog.computeresource.ComputeResourceDescription
[ERROR]
/Users/lahirugunathilake/work/airavata/git/airavata/airavata-api/airavata-model-utils/src/main/java/org/apache/airavata/model/util/ComputeResourceUtil.java:[35,24]
cannot find symbol
[ERROR] symbol : method setPreferredJobSubmissionProtocol(java.lang.String)
[ERROR] location: class
org.apache.airavata.model.appcatalog.computeresource.ComputeResourceDescription
[ERROR]
/Users/lahirugunathilake/work/airavata/git/airavata/airavata-api/airavata-model-utils/src/main/java/org/apache/airavata/model/util/ComputeResourceUtil.java:[51,9]
cannot find symbol
[ERROR] symbol : class GSISSHJobSubmission
[ERROR] location: class org.apache.airavata.model.util.ComputeResourceUtil
[ERROR]
/Users/lahirugunathilake/work/airavata/git/airavata/airavata-api/airavata-model-utils/src/main/java/org/apache/airavata/model/util/ComputeResourceUtil.java:[51,49]
cannot find symbol
[ERROR] symbol : class GSISSHJobSubmission
[ERROR] location: class org.apache.airavata.model.util.ComputeResourceUtil
[ERROR]
/Users/lahirugunathilake/work/airavata/git/airavata/airavata-api/airavata-model-utils/src/main/java/org/apache/airavata/model/util/ComputeResourceUtil.java:[81,21]
cannot find symbol
[ERROR] symbol : method
setGridFTPEndPoint(java.util.List<java.lang.String>)
[ERROR] location: class
org.apache.airavata.model.appcatalog.computeresource.GridFTPDataMovement
[ERROR] -> [Help 1]
[ERROR]
[ERROR] To see the full stack trace of the errors, re-run Maven with the -e
switch.
[ERROR] Re-run Maven using the -X switch to enable full debug logging.
[ERROR]
[ERROR] For more information about the errors and possible solutions,
please read the following articles:
[ERROR] [Help 1]
http://cwiki.apache.org/confluence/display/MAVEN/MojoFailureException
[ERROR]
[ERROR] After correcting the problems, you can resume the build with the
command
[ERROR] mvn <goals> -rf :airavata-model-utils
Lahirus-MacBook-Pro:airavata lahirugunathilake$
--
System Analyst Programmer
PTI Lab
Indiana University
Re: Build is breaken
Posted by Suresh Marru <sm...@apache.org>.
Hi Lahiru,
Saminda is working on updating all compute resources, meanwhile, I will fix the build temporarily so it doesn’t hold you up.
Suresh
On Jul 4, 2014, at 3:18 PM, Lahiru Gunathilake <gl...@gmail.com> wrote:
> [INFO] BUILD FAILURE
> [INFO] ------------------------------------------------------------------------
> [INFO] Total time: 11.570s
> [INFO] Finished at: Fri Jul 04 15:18:22 EDT 2014
> [INFO] Final Memory: 22M/106M
> [INFO] ------------------------------------------------------------------------
> [ERROR] Failed to execute goal org.apache.maven.plugins:maven-compiler-plugin:3.1:compile (default-compile) on project airavata-model-utils: Compilation failure: Compilation failure:
> [ERROR] /Users/lahirugunathilake/work/airavata/git/airavata/airavata-api/airavata-model-utils/src/main/java/org/apache/airavata/model/util/ComputeResourceUtil.java:[47,19] cannot find symbol
> [ERROR] symbol : class GSISSHJobSubmission
> [ERROR] location: class org.apache.airavata.model.util.ComputeResourceUtil
> [ERROR] /Users/lahirugunathilake/work/airavata/git/airavata/airavata-api/airavata-model-utils/src/main/java/org/apache/airavata/model/util/AppDeploymentUtil.java:[38,20] cannot find symbol
> [ERROR] symbol : method setModuleLoadCmd(java.lang.String)
> [ERROR] location: class org.apache.airavata.model.appcatalog.appdeployment.ApplicationDeploymentDescription
> [ERROR] /Users/lahirugunathilake/work/airavata/git/airavata/airavata-api/airavata-model-utils/src/main/java/org/apache/airavata/model/util/ComputeResourceUtil.java:[34,24] cannot find symbol
> [ERROR] symbol : method setResourceDescription(java.lang.String)
> [ERROR] location: class org.apache.airavata.model.appcatalog.computeresource.ComputeResourceDescription
> [ERROR] /Users/lahirugunathilake/work/airavata/git/airavata/airavata-api/airavata-model-utils/src/main/java/org/apache/airavata/model/util/ComputeResourceUtil.java:[35,24] cannot find symbol
> [ERROR] symbol : method setPreferredJobSubmissionProtocol(java.lang.String)
> [ERROR] location: class org.apache.airavata.model.appcatalog.computeresource.ComputeResourceDescription
> [ERROR] /Users/lahirugunathilake/work/airavata/git/airavata/airavata-api/airavata-model-utils/src/main/java/org/apache/airavata/model/util/ComputeResourceUtil.java:[51,9] cannot find symbol
> [ERROR] symbol : class GSISSHJobSubmission
> [ERROR] location: class org.apache.airavata.model.util.ComputeResourceUtil
> [ERROR] /Users/lahirugunathilake/work/airavata/git/airavata/airavata-api/airavata-model-utils/src/main/java/org/apache/airavata/model/util/ComputeResourceUtil.java:[51,49] cannot find symbol
> [ERROR] symbol : class GSISSHJobSubmission
> [ERROR] location: class org.apache.airavata.model.util.ComputeResourceUtil
> [ERROR] /Users/lahirugunathilake/work/airavata/git/airavata/airavata-api/airavata-model-utils/src/main/java/org/apache/airavata/model/util/ComputeResourceUtil.java:[81,21] cannot find symbol
> [ERROR] symbol : method setGridFTPEndPoint(java.util.List<java.lang.String>)
> [ERROR] location: class org.apache.airavata.model.appcatalog.computeresource.GridFTPDataMovement
> [ERROR] -> [Help 1]
> [ERROR]
> [ERROR] To see the full stack trace of the errors, re-run Maven with the -e switch.
> [ERROR] Re-run Maven using the -X switch to enable full debug logging.
> [ERROR]
> [ERROR] For more information about the errors and possible solutions, please read the following articles:
> [ERROR] [Help 1] http://cwiki.apache.org/confluence/display/MAVEN/MojoFailureException
> [ERROR]
> [ERROR] After correcting the problems, you can resume the build with the command
> [ERROR] mvn <goals> -rf :airavata-model-utils
> Lahirus-MacBook-Pro:airavata lahirugunathilake$
>
>
> --
> System Analyst Programmer
> PTI Lab
> Indiana University