You are viewing a plain text version of this content. The canonical link for it is here.
Posted to dev@ranger.apache.org by "Kishor Gollapalliwar (Jira)" <ji...@apache.org> on 2024/09/06 08:33:00 UTC

[jira] [Commented] (RANGER-4927) Ranger security admin build fails as karma plugin fails to start in Ubuntu 22.04 LTS

    [ https://issues.apache.org/jira/browse/RANGER-4927?page=com.atlassian.jira.plugin.system.issuetabpanels:comment-tabpanel&focusedCommentId=17879808#comment-17879808 ] 

Kishor Gollapalliwar commented on RANGER-4927:
----------------------------------------------

Manual workaround Steps:
 # export OPENSSL_CONF=/dev/null
 # mvn clean compile package install -pl :security-admin-web -am (or you can build whole repository)

> Ranger security admin build fails as karma plugin fails to start in Ubuntu 22.04 LTS
> ------------------------------------------------------------------------------------
>
>                 Key: RANGER-4927
>                 URL: https://issues.apache.org/jira/browse/RANGER-4927
>             Project: Ranger
>          Issue Type: Bug
>          Components: Ranger
>    Affects Versions: 3.0.0
>            Reporter: Kishor Gollapalliwar
>            Assignee: Dhaval Rajpara
>            Priority: Major
>         Attachments: ranger-apache-build-maven.log
>
>
> Hi Team, while building Ranger repository in Ubuntu 22.04 LTS it fails for security-admin sub-module, as karma plugin fails to start.
> {code:java}
> [INFO] 06 09 2024 12:29:50.147:INFO [karma-server]: Karma v3.1.4 server started at http://0.0.0.0:9876/
> [INFO] 06 09 2024 12:29:50.150:INFO [launcher]: Launching browsers PhantomJS with concurrency unlimited
> [INFO] 06 09 2024 12:29:50.156:INFO [launcher]: Starting browser PhantomJS
> [INFO] 06 09 2024 12:29:50.172:ERROR [phantomjs.launcher]: Auto configuration failed
> [INFO] 131752149018560:error:25066067:DSO support routines:DLFCN_LOAD:could not load the shared library:dso_dlfcn.c:185:filename(libproviders.so): libproviders.so: cannot open shared object file: No such file or directory
> [INFO] 131752149018560:error:25070067:DSO support routines:DSO_load:could not load the shared library:dso_lib.c:244:
> [INFO] 131752149018560:error:0E07506E:configuration file routines:MODULE_LOAD_DSO:error loading dso:conf_mod.c:285:module=providers, path=providers
> [INFO] 131752149018560:error:0E076071:configuration file routines:MODULE_RUN:unknown module name:conf_mod.c:222:module=providers
> [INFO] 
> [INFO] 06 09 2024 12:29:50.174:ERROR [launcher]: Cannot start PhantomJS
> [INFO]     Auto configuration failed
> [INFO] 131752149018560:error:25066067:DSO support routines:DLFCN_LOAD:could not load the shared library:dso_dlfcn.c:185:filename(libproviders.so): libproviders.so: cannot open shared object file: No such file or directory
> [INFO] 131752149018560:error:25070067:DSO support routines:DSO_load:could not load the shared library:dso_lib.c:244:
> [INFO] 131752149018560:error:0E07506E:configuration file routines:MODULE_LOAD_DSO:error loading dso:conf_mod.c:285:module=providers, path=providers
> [INFO] 131752149018560:error:0E076071:configuration file routines:MODULE_RUN:unknown module name:conf_mod.c:222:module=providers
> [INFO] 
> [INFO] 06 09 2024 12:29:50.174:ERROR [launcher]: PhantomJS stdout: 
> [INFO] 06 09 2024 12:29:50.174:ERROR [launcher]: PhantomJS stderr: Auto configuration failed
> [INFO] 131752149018560:error:25066067:DSO support routines:DLFCN_LOAD:could not load the shared library:dso_dlfcn.c:185:filename(libproviders.so): libproviders.so: cannot open shared object file: No such file or directory
> [INFO] 131752149018560:error:25070067:DSO support routines:DSO_load:could not load the shared library:dso_lib.c:244:
> [INFO] 131752149018560:error:0E07506E:configuration file routines:MODULE_LOAD_DSO:error loading dso:conf_mod.c:285:module=providers, path=providers
> [INFO] 131752149018560:error:0E076071:configuration file routines:MODULE_RUN:unknown module name:conf_mod.c:222:module=providers
> [INFO] 
> [INFO] 06 09 2024 12:29:50.177:INFO [launcher]: Trying to start PhantomJS again (1/2).
> [INFO] 06 09 2024 12:29:50.198:ERROR [phantomjs.launcher]: Auto configuration failed
> [INFO] 140049643886528:error:25066067:DSO support routines:DLFCN_LOAD:could not load the shared library:dso_dlfcn.c:185:filename(libproviders.so): libproviders.so: cannot open shared object file: No such file or directory
> [INFO] 140049643886528:error:25070067:DSO support routines:DSO_load:could not load the shared library:dso_lib.c:244:
> [INFO] 140049643886528:error:0E07506E:configuration file routines:MODULE_LOAD_DSO:error loading dso:conf_mod.c:285:module=providers, path=providers
> [INFO] 140049643886528:error:0E076071:configuration file routines:MODULE_RUN:unknown module name:conf_mod.c:222:module=providers
> [INFO] 
> [INFO] 06 09 2024 12:29:50.199:ERROR [launcher]: Cannot start PhantomJS
> [INFO]     Auto configuration failed
> [INFO] 140049643886528:error:25066067:DSO support routines:DLFCN_LOAD:could not load the shared library:dso_dlfcn.c:185:filename(libproviders.so): libproviders.so: cannot open shared object file: No such file or directory
> [INFO] 140049643886528:error:25070067:DSO support routines:DSO_load:could not load the shared library:dso_lib.c:244:
> [INFO] 140049643886528:error:0E07506E:configuration file routines:MODULE_LOAD_DSO:error loading dso:conf_mod.c:285:module=providers, path=providers
> [INFO] 140049643886528:error:0E076071:configuration file routines:MODULE_RUN:unknown module name:conf_mod.c:222:module=providers
> [INFO] 
> [INFO] 06 09 2024 12:29:50.200:ERROR [launcher]: PhantomJS stdout: 
> [INFO] 06 09 2024 12:29:50.200:ERROR [launcher]: PhantomJS stderr: Auto configuration failed
> [INFO] 140049643886528:error:25066067:DSO support routines:DLFCN_LOAD:could not load the shared library:dso_dlfcn.c:185:filename(libproviders.so): libproviders.so: cannot open shared object file: No such file or directory
> [INFO] 140049643886528:error:25070067:DSO support routines:DSO_load:could not load the shared library:dso_lib.c:244:
> [INFO] 140049643886528:error:0E07506E:configuration file routines:MODULE_LOAD_DSO:error loading dso:conf_mod.c:285:module=providers, path=providers
> [INFO] 140049643886528:error:0E076071:configuration file routines:MODULE_RUN:unknown module name:conf_mod.c:222:module=providers
> [INFO] 
> [INFO] 06 09 2024 12:29:50.201:INFO [launcher]: Trying to start PhantomJS again (2/2).
> [INFO] 06 09 2024 12:29:50.222:ERROR [phantomjs.launcher]: Auto configuration failed
> [INFO] 127785112438720:error:25066067:DSO support routines:DLFCN_LOAD:could not load the shared library:dso_dlfcn.c:185:filename(libproviders.so): libproviders.so: cannot open shared object file: No such file or directory
> [INFO] 127785112438720:error:25070067:DSO support routines:DSO_load:could not load the shared library:dso_lib.c:244:
> [INFO] 127785112438720:error:0E07506E:configuration file routines:MODULE_LOAD_DSO:error loading dso:conf_mod.c:285:module=providers, path=providers
> [INFO] 127785112438720:error:0E076071:configuration file routines:MODULE_RUN:unknown module name:conf_mod.c:222:module=providers
> [INFO] 
> [INFO] 06 09 2024 12:29:50.223:ERROR [launcher]: Cannot start PhantomJS
> [INFO]     Auto configuration failed
> [INFO] 127785112438720:error:25066067:DSO support routines:DLFCN_LOAD:could not load the shared library:dso_dlfcn.c:185:filename(libproviders.so): libproviders.so: cannot open shared object file: No such file or directory
> [INFO] 127785112438720:error:25070067:DSO support routines:DSO_load:could not load the shared library:dso_lib.c:244:
> [INFO] 127785112438720:error:0E07506E:configuration file routines:MODULE_LOAD_DSO:error loading dso:conf_mod.c:285:module=providers, path=providers
> [INFO] 127785112438720:error:0E076071:configuration file routines:MODULE_RUN:unknown module name:conf_mod.c:222:module=providers
> [INFO] 
> [INFO] 06 09 2024 12:29:50.223:ERROR [launcher]: PhantomJS stdout: 
> [INFO] 06 09 2024 12:29:50.223:ERROR [launcher]: PhantomJS stderr: Auto configuration failed
> [INFO] 127785112438720:error:25066067:DSO support routines:DLFCN_LOAD:could not load the shared library:dso_dlfcn.c:185:filename(libproviders.so): libproviders.so: cannot open shared object file: No such file or directory
> [INFO] 127785112438720:error:25070067:DSO support routines:DSO_load:could not load the shared library:dso_lib.c:244:
> [INFO] 127785112438720:error:0E07506E:configuration file routines:MODULE_LOAD_DSO:error loading dso:conf_mod.c:285:module=providers, path=providers
> [INFO] 127785112438720:error:0E076071:configuration file routines:MODULE_RUN:unknown module name:conf_mod.c:222:module=providers
> [INFO] 
> [INFO] 06 09 2024 12:29:50.224:ERROR [launcher]: PhantomJS failed 2 times (cannot start). Giving up.
> [INFO] ------------------------------------------------------------------------
> [INFO] Reactor Summary for ranger 2.4.0.7.3.1.0-68:
> [INFO] 
> [INFO] ranger ............................................. SUCCESS [ 19.526 s]
> [INFO] Credential Support ................................. SUCCESS [ 14.043 s]
> [INFO] Audit Component .................................... SUCCESS [ 30.331 s]
> [INFO] ranger-plugin-classloader .......................... SUCCESS [  3.652 s]
> [INFO] Common library for Plugins ......................... SUCCESS [ 42.080 s]
> [INFO] Credential Builder ................................. SUCCESS [ 11.191 s]
> [INFO] Embedded Web Server Invoker ........................ SUCCESS [ 10.338 s]
> [INFO] ranger-metrics ..................................... SUCCESS [ 16.899 s]
> [INFO] Ranger Util ........................................ SUCCESS [  5.136 s]
> [INFO] Unix Authentication Client ......................... SUCCESS [  4.415 s]
> [INFO] User Group Synchronizer Util ....................... SUCCESS [  3.173 s]
> [INFO] ranger-authn ....................................... SUCCESS [  5.060 s]
> [INFO] Security Admin Web Application ..................... FAILURE [04:21 min]
> [INFO] ------------------------------------------------------------------------
> [INFO] BUILD FAILURE
> [INFO] ------------------------------------------------------------------------
> [INFO] Total time:  07:08 min
> [INFO] Finished at: 2024-09-06T12:29:50+05:30
> [INFO] ------------------------------------------------------------------------
> [ERROR] Failed to execute goal com.github.eirslett:frontend-maven-plugin:1.11.3:karma (karma dev) on project security-admin-web: Failed to run task: 'karma start ../../src/test/javascript/karma-dev.conf.js' failed. org.apache.commons.exec.ExecuteException: Process exited with an error: 1 (Exit value: 1) -> [Help 1]
> org.apache.maven.lifecycle.LifecycleExecutionException: Failed to execute goal com.github.eirslett:frontend-maven-plugin:1.11.3:karma (karma dev) on project security-admin-web: Failed to run task
>     at org.apache.maven.lifecycle.internal.MojoExecutor.execute (MojoExecutor.java:215)
>     at org.apache.maven.lifecycle.internal.MojoExecutor.execute (MojoExecutor.java:156)
>     at org.apache.maven.lifecycle.internal.MojoExecutor.execute (MojoExecutor.java:148)
>     at org.apache.maven.lifecycle.internal.LifecycleModuleBuilder.buildProject (LifecycleModuleBuilder.java:117)
>     at org.apache.maven.lifecycle.internal.LifecycleModuleBuilder.buildProject (LifecycleModuleBuilder.java:81)
>     at org.apache.maven.lifecycle.internal.builder.singlethreaded.SingleThreadedBuilder.build (SingleThreadedBuilder.java:56)
>     at org.apache.maven.lifecycle.internal.LifecycleStarter.execute (LifecycleStarter.java:128)
>     at org.apache.maven.DefaultMaven.doExecute (DefaultMaven.java:305)
>     at org.apache.maven.DefaultMaven.doExecute (DefaultMaven.java:192)
>     at org.apache.maven.DefaultMaven.execute (DefaultMaven.java:105)
>     at org.apache.maven.cli.MavenCli.execute (MavenCli.java:957)
>     at org.apache.maven.cli.MavenCli.doMain (MavenCli.java:289)
>     at org.apache.maven.cli.MavenCli.main (MavenCli.java:193)
>     at sun.reflect.NativeMethodAccessorImpl.invoke0 (Native Method)
>     at sun.reflect.NativeMethodAccessorImpl.invoke (NativeMethodAccessorImpl.java:62)
>     at sun.reflect.DelegatingMethodAccessorImpl.invoke (DelegatingMethodAccessorImpl.java:43)
>     at java.lang.reflect.Method.invoke (Method.java:498)
>     at org.codehaus.plexus.classworlds.launcher.Launcher.launchEnhanced (Launcher.java:282)
>     at org.codehaus.plexus.classworlds.launcher.Launcher.launch (Launcher.java:225)
>     at org.codehaus.plexus.classworlds.launcher.Launcher.mainWithExitCode (Launcher.java:406)
>     at org.codehaus.plexus.classworlds.launcher.Launcher.main (Launcher.java:347)
> Caused by: org.apache.maven.plugin.MojoFailureException: Failed to run task
>     at com.github.eirslett.maven.plugins.frontend.mojo.AbstractFrontendMojo.execute (AbstractFrontendMojo.java:100)
>     at org.apache.maven.plugin.DefaultBuildPluginManager.executeMojo (DefaultBuildPluginManager.java:137)
>     at org.apache.maven.lifecycle.internal.MojoExecutor.execute (MojoExecutor.java:210)
>     at org.apache.maven.lifecycle.internal.MojoExecutor.execute (MojoExecutor.java:156)
>     at org.apache.maven.lifecycle.internal.MojoExecutor.execute (MojoExecutor.java:148)
>     at org.apache.maven.lifecycle.internal.LifecycleModuleBuilder.buildProject (LifecycleModuleBuilder.java:117)
>     at org.apache.maven.lifecycle.internal.LifecycleModuleBuilder.buildProject (LifecycleModuleBuilder.java:81)
>     at org.apache.maven.lifecycle.internal.builder.singlethreaded.SingleThreadedBuilder.build (SingleThreadedBuilder.java:56)
>     at org.apache.maven.lifecycle.internal.LifecycleStarter.execute (LifecycleStarter.java:128)
>     at org.apache.maven.DefaultMaven.doExecute (DefaultMaven.java:305)
>     at org.apache.maven.DefaultMaven.doExecute (DefaultMaven.java:192)
>     at org.apache.maven.DefaultMaven.execute (DefaultMaven.java:105)
>     at org.apache.maven.cli.MavenCli.execute (MavenCli.java:957)
>     at org.apache.maven.cli.MavenCli.doMain (MavenCli.java:289)
>     at org.apache.maven.cli.MavenCli.main (MavenCli.java:193)
>     at sun.reflect.NativeMethodAccessorImpl.invoke0 (Native Method)
>     at sun.reflect.NativeMethodAccessorImpl.invoke (NativeMethodAccessorImpl.java:62)
>     at sun.reflect.DelegatingMethodAccessorImpl.invoke (DelegatingMethodAccessorImpl.java:43)
>     at java.lang.reflect.Method.invoke (Method.java:498)
>     at org.codehaus.plexus.classworlds.launcher.Launcher.launchEnhanced (Launcher.java:282)
>     at org.codehaus.plexus.classworlds.launcher.Launcher.launch (Launcher.java:225)
>     at org.codehaus.plexus.classworlds.launcher.Launcher.mainWithExitCode (Launcher.java:406)
>     at org.codehaus.plexus.classworlds.launcher.Launcher.main (Launcher.java:347)
> Caused by: com.github.eirslett.maven.plugins.frontend.lib.TaskRunnerException: 'karma start ../../src/test/javascript/karma-dev.conf.js' failed.
>     at com.github.eirslett.maven.plugins.frontend.lib.NodeTaskExecutor.execute (NodeTaskExecutor.java:63)
>     at com.github.eirslett.maven.plugins.frontend.mojo.KarmaRunMojo.execute (KarmaRunMojo.java:32)
>     at com.github.eirslett.maven.plugins.frontend.mojo.AbstractFrontendMojo.execute (AbstractFrontendMojo.java:94)
>     at org.apache.maven.plugin.DefaultBuildPluginManager.executeMojo (DefaultBuildPluginManager.java:137)
>     at org.apache.maven.lifecycle.internal.MojoExecutor.execute (MojoExecutor.java:210)
>     at org.apache.maven.lifecycle.internal.MojoExecutor.execute (MojoExecutor.java:156)
>     at org.apache.maven.lifecycle.internal.MojoExecutor.execute (MojoExecutor.java:148)
>     at org.apache.maven.lifecycle.internal.LifecycleModuleBuilder.buildProject (LifecycleModuleBuilder.java:117)
>     at org.apache.maven.lifecycle.internal.LifecycleModuleBuilder.buildProject (LifecycleModuleBuilder.java:81)
>     at org.apache.maven.lifecycle.internal.builder.singlethreaded.SingleThreadedBuilder.build (SingleThreadedBuilder.java:56)
>     at org.apache.maven.lifecycle.internal.LifecycleStarter.execute (LifecycleStarter.java:128)
>     at org.apache.maven.DefaultMaven.doExecute (DefaultMaven.java:305)
>     at org.apache.maven.DefaultMaven.doExecute (DefaultMaven.java:192)
>     at org.apache.maven.DefaultMaven.execute (DefaultMaven.java:105)
>     at org.apache.maven.cli.MavenCli.execute (MavenCli.java:957)
>     at org.apache.maven.cli.MavenCli.doMain (MavenCli.java:289)
>     at org.apache.maven.cli.MavenCli.main (MavenCli.java:193)
>     at sun.reflect.NativeMethodAccessorImpl.invoke0 (Native Method)
>     at sun.reflect.NativeMethodAccessorImpl.invoke (NativeMethodAccessorImpl.java:62)
>     at sun.reflect.DelegatingMethodAccessorImpl.invoke (DelegatingMethodAccessorImpl.java:43)
>     at java.lang.reflect.Method.invoke (Method.java:498)
>     at org.codehaus.plexus.classworlds.launcher.Launcher.launchEnhanced (Launcher.java:282)
>     at org.codehaus.plexus.classworlds.launcher.Launcher.launch (Launcher.java:225)
>     at org.codehaus.plexus.classworlds.launcher.Launcher.mainWithExitCode (Launcher.java:406)
>     at org.codehaus.plexus.classworlds.launcher.Launcher.main (Launcher.java:347)
> Caused by: com.github.eirslett.maven.plugins.frontend.lib.ProcessExecutionException: org.apache.commons.exec.ExecuteException: Process exited with an error: 1 (Exit value: 1)
>     at com.github.eirslett.maven.plugins.frontend.lib.ProcessExecutor.execute (ProcessExecutor.java:82)
>     at com.github.eirslett.maven.plugins.frontend.lib.ProcessExecutor.executeAndRedirectOutput (ProcessExecutor.java:64)
>     at com.github.eirslett.maven.plugins.frontend.lib.NodeExecutor.executeAndRedirectOutput (NodeExecutor.java:29)
>     at com.github.eirslett.maven.plugins.frontend.lib.NodeTaskExecutor.execute (NodeTaskExecutor.java:58)
>     at com.github.eirslett.maven.plugins.frontend.mojo.KarmaRunMojo.execute (KarmaRunMojo.java:32)
>     at com.github.eirslett.maven.plugins.frontend.mojo.AbstractFrontendMojo.execute (AbstractFrontendMojo.java:94)
>     at org.apache.maven.plugin.DefaultBuildPluginManager.executeMojo (DefaultBuildPluginManager.java:137)
>     at org.apache.maven.lifecycle.internal.MojoExecutor.execute (MojoExecutor.java:210)
>     at org.apache.maven.lifecycle.internal.MojoExecutor.execute (MojoExecutor.java:156)
>     at org.apache.maven.lifecycle.internal.MojoExecutor.execute (MojoExecutor.java:148)
>     at org.apache.maven.lifecycle.internal.LifecycleModuleBuilder.buildProject (LifecycleModuleBuilder.java:117)
>     at org.apache.maven.lifecycle.internal.LifecycleModuleBuilder.buildProject (LifecycleModuleBuilder.java:81)
>     at org.apache.maven.lifecycle.internal.builder.singlethreaded.SingleThreadedBuilder.build (SingleThreadedBuilder.java:56)
>     at org.apache.maven.lifecycle.internal.LifecycleStarter.execute (LifecycleStarter.java:128)
>     at org.apache.maven.DefaultMaven.doExecute (DefaultMaven.java:305)
>     at org.apache.maven.DefaultMaven.doExecute (DefaultMaven.java:192)
>     at org.apache.maven.DefaultMaven.execute (DefaultMaven.java:105)
>     at org.apache.maven.cli.MavenCli.execute (MavenCli.java:957)
>     at org.apache.maven.cli.MavenCli.doMain (MavenCli.java:289)
>     at org.apache.maven.cli.MavenCli.main (MavenCli.java:193)
>     at sun.reflect.NativeMethodAccessorImpl.invoke0 (Native Method)
>     at sun.reflect.NativeMethodAccessorImpl.invoke (NativeMethodAccessorImpl.java:62)
>     at sun.reflect.DelegatingMethodAccessorImpl.invoke (DelegatingMethodAccessorImpl.java:43)
>     at java.lang.reflect.Method.invoke (Method.java:498)
>     at org.codehaus.plexus.classworlds.launcher.Launcher.launchEnhanced (Launcher.java:282)
>     at org.codehaus.plexus.classworlds.launcher.Launcher.launch (Launcher.java:225)
>     at org.codehaus.plexus.classworlds.launcher.Launcher.mainWithExitCode (Launcher.java:406)
>     at org.codehaus.plexus.classworlds.launcher.Launcher.main (Launcher.java:347)
> Caused by: org.apache.commons.exec.ExecuteException: Process exited with an error: 1 (Exit value: 1)
>     at org.apache.commons.exec.DefaultExecutor.executeInternal (DefaultExecutor.java:404)
>     at org.apache.commons.exec.DefaultExecutor.execute (DefaultExecutor.java:166)
>     at com.github.eirslett.maven.plugins.frontend.lib.ProcessExecutor.execute (ProcessExecutor.java:74)
>     at com.github.eirslett.maven.plugins.frontend.lib.ProcessExecutor.executeAndRedirectOutput (ProcessExecutor.java:64)
>     at com.github.eirslett.maven.plugins.frontend.lib.NodeExecutor.executeAndRedirectOutput (NodeExecutor.java:29)
>     at com.github.eirslett.maven.plugins.frontend.lib.NodeTaskExecutor.execute (NodeTaskExecutor.java:58)
>     at com.github.eirslett.maven.plugins.frontend.mojo.KarmaRunMojo.execute (KarmaRunMojo.java:32)
>     at com.github.eirslett.maven.plugins.frontend.mojo.AbstractFrontendMojo.execute (AbstractFrontendMojo.java:94)
>     at org.apache.maven.plugin.DefaultBuildPluginManager.executeMojo (DefaultBuildPluginManager.java:137)
>     at org.apache.maven.lifecycle.internal.MojoExecutor.execute (MojoExecutor.java:210)
>     at org.apache.maven.lifecycle.internal.MojoExecutor.execute (MojoExecutor.java:156)
>     at org.apache.maven.lifecycle.internal.MojoExecutor.execute (MojoExecutor.java:148)
>     at org.apache.maven.lifecycle.internal.LifecycleModuleBuilder.buildProject (LifecycleModuleBuilder.java:117)
>     at org.apache.maven.lifecycle.internal.LifecycleModuleBuilder.buildProject (LifecycleModuleBuilder.java:81)
>     at org.apache.maven.lifecycle.internal.builder.singlethreaded.SingleThreadedBuilder.build (SingleThreadedBuilder.java:56)
>     at org.apache.maven.lifecycle.internal.LifecycleStarter.execute (LifecycleStarter.java:128)
>     at org.apache.maven.DefaultMaven.doExecute (DefaultMaven.java:305)
>     at org.apache.maven.DefaultMaven.doExecute (DefaultMaven.java:192)
>     at org.apache.maven.DefaultMaven.execute (DefaultMaven.java:105)
>     at org.apache.maven.cli.MavenCli.execute (MavenCli.java:957)
>     at org.apache.maven.cli.MavenCli.doMain (MavenCli.java:289)
>     at org.apache.maven.cli.MavenCli.main (MavenCli.java:193)
>     at sun.reflect.NativeMethodAccessorImpl.invoke0 (Native Method)
>     at sun.reflect.NativeMethodAccessorImpl.invoke (NativeMethodAccessorImpl.java:62)
>     at sun.reflect.DelegatingMethodAccessorImpl.invoke (DelegatingMethodAccessorImpl.java:43)
>     at java.lang.reflect.Method.invoke (Method.java:498)
>     at org.codehaus.plexus.classworlds.launcher.Launcher.launchEnhanced (Launcher.java:282)
>     at org.codehaus.plexus.classworlds.launcher.Launcher.launch (Launcher.java:225)
>     at org.codehaus.plexus.classworlds.launcher.Launcher.mainWithExitCode (Launcher.java:406)
>     at org.codehaus.plexus.classworlds.launcher.Launcher.main (Launcher.java:347)
> [ERROR] 
> [ERROR] 
> [ERROR] For more information about the errors and possible solutions, please read the following articles:
> [ERROR] [Help 1] http://cwiki.apache.org/confluence/display/MAVEN/MojoFailureException
> [ERROR] 
> [ERROR] After correcting the problems, you can resume the build with the command
> [ERROR]   mvn <args> -rf :security-admin-web {code}
> For more details please refer [^ranger-apache-build-maven.log]
>  
>  Steps:
> # Clone [Ranger|https://github.com/apache/ranger] repository 
> # mvn clean compile package install -pl :security-admin-web -am (or you can build whole repository)



--
This message was sent by Atlassian Jira
(v8.20.10#820010)