You are viewing a plain text version of this content. The canonical link for it is here.
Posted to dev@poi.apache.org by Apache Jenkins Server <je...@builds.apache.org> on 2023/01/22 15:51:55 UTC

Build failed in Jenkins: POI » POI-DSL-IBM-JDK #137

See <https://ci-builds.apache.org/job/POI/job/POI-DSL-IBM-JDK/137/display/redirect?page=changes>

Changes:

[PJ Fanning] [bug-66433] Boolean functions should blank cells. Thanks to Patrick Böker

[PJ Fanning] revert to saxon 11.4 (saxon 12.0 only supports Java 11)

[PJ Fanning] woodstox 6.5

[PJ Fanning] test with saxon 12


------------------------------------------
[...truncated 457.75 KB...]
    [javac] Creating empty <https://ci-builds.apache.org/job/POI/job/POI-DSL-IBM-JDK/ws/poi/build/classes/ant/java/org/apache/poi/poifs/package-info.class>
    [javac] Creating empty <https://ci-builds.apache.org/job/POI/job/POI-DSL-IBM-JDK/ws/poi/build/classes/ant/java/org/apache/poi/poifs/crypt/package-info.class>
    [javac] Creating empty <https://ci-builds.apache.org/job/POI/job/POI-DSL-IBM-JDK/ws/poi/build/classes/ant/java/org/apache/poi/hpsf/wellknown/package-info.class>
    [javac] Creating empty <https://ci-builds.apache.org/job/POI/job/POI-DSL-IBM-JDK/ws/poi/build/classes/ant/java/org/apache/poi/ss/formula/package-info.class>
    [javac] Creating empty <https://ci-builds.apache.org/job/POI/job/POI-DSL-IBM-JDK/ws/poi/build/classes/ant/java/org/apache/poi/hpsf/package-info.class>
    [javac] Creating empty <https://ci-builds.apache.org/job/POI/job/POI-DSL-IBM-JDK/ws/poi/build/classes/ant/java/org/apache/poi/poifs/property/package-info.class>
    [javac] Creating empty <https://ci-builds.apache.org/job/POI/job/POI-DSL-IBM-JDK/ws/poi/build/classes/ant/java/org/apache/poi/poifs/filesystem/package-info.class>
    [javac] Creating empty <https://ci-builds.apache.org/job/POI/job/POI-DSL-IBM-JDK/ws/poi/build/classes/ant/java/org/apache/poi/ss/formula/ptg/package-info.class>
    [javac] Creating empty <https://ci-builds.apache.org/job/POI/job/POI-DSL-IBM-JDK/ws/poi/build/classes/ant/java/org/apache/poi/poifs/storage/package-info.class>
    [javac] Creating empty <https://ci-builds.apache.org/job/POI/job/POI-DSL-IBM-JDK/ws/poi/build/classes/ant/java/org/apache/poi/hssf/eventusermodel/package-info.class>
    [javac] Creating empty <https://ci-builds.apache.org/job/POI/job/POI-DSL-IBM-JDK/ws/poi/build/classes/ant/java/org/apache/poi/hssf/record/aggregates/package-info.class>
    [javac] Creating empty <https://ci-builds.apache.org/job/POI/job/POI-DSL-IBM-JDK/ws/poi/build/classes/ant/java/org/apache/poi/ss/format/package-info.class>
    [javac] Creating empty <https://ci-builds.apache.org/job/POI/job/POI-DSL-IBM-JDK/ws/poi/build/classes/ant/java/org/apache/poi/hssf/model/package-info.class>
    [javac] Creating empty <https://ci-builds.apache.org/job/POI/job/POI-DSL-IBM-JDK/ws/poi/build/classes/ant/java/org/apache/poi/hssf/usermodel/package-info.class>
    [javac] Creating empty <https://ci-builds.apache.org/job/POI/job/POI-DSL-IBM-JDK/ws/poi/build/classes/ant/java/org/apache/poi/hssf/util/package-info.class>
    [javac] Creating empty <https://ci-builds.apache.org/job/POI/job/POI-DSL-IBM-JDK/ws/poi/build/classes/ant/java/org/apache/poi/poifs/eventfilesystem/package-info.class>
     [echo] Building java9+ classes for poi
    [mkdir] Created dir: <https://ci-builds.apache.org/job/POI/job/POI-DSL-IBM-JDK/ws/build/dist/maven/poi>
     [echo] Building jar for poi, module-name: poi with isJava8: true
      [jar] Building jar: <https://ci-builds.apache.org/job/POI/job/POI-DSL-IBM-JDK/137/artifact/build/dist/maven/poi/poi-5.2.4-SNAPSHOT.jar>
    [javac] Compiling 588 source files to <https://ci-builds.apache.org/job/POI/job/POI-DSL-IBM-JDK/ws/poi/build/test-classes>
    [javac] Support for javac --release has been added in Java9 ignoring it
    [javac] Note: Some input files use or override a deprecated API.
    [javac] Note: Recompile with -Xlint:deprecation for details.
    [javac] Creating empty <https://ci-builds.apache.org/job/POI/job/POI-DSL-IBM-JDK/ws/poi/build/test-classes/org/apache/poi/hssf/dev/package-info.class>
     [echo] Building test-jar for poi, module-name: poi with isJava8: true
      [jar] Building jar: <https://ci-builds.apache.org/job/POI/job/POI-DSL-IBM-JDK/137/artifact/build/dist/maven/poi-tests/poi-5.2.4-SNAPSHOT-tests.jar>
      [jar] Building jar: <https://ci-builds.apache.org/job/POI/job/POI-DSL-IBM-JDK/137/artifact/build/dist/maven/poi/poi-5.2.4-SNAPSHOT-sources.jar>

compile-scratchpad:
     [echo] Building classes for poi-scratchpad
    [javac] Compiling 517 source files to <https://ci-builds.apache.org/job/POI/job/POI-DSL-IBM-JDK/ws/poi-scratchpad/build/classes/ant/java>
    [javac] Note: Some input files use or override a deprecated API.
    [javac] Note: Recompile with -Xlint:deprecation for details.
    [javac] Note: <https://ci-builds.apache.org/job/POI/job/POI-DSL-IBM-JDK/ws/poi-scratchpad/src/main/java/org/apache/poi/hwpf/model/BytePropertyNode.java> uses unchecked or unsafe operations.
    [javac] Note: Recompile with -Xlint:unchecked for details.
     [echo] Building java9+ classes for poi-scratchpad
    [mkdir] Created dir: <https://ci-builds.apache.org/job/POI/job/POI-DSL-IBM-JDK/ws/build/dist/maven/poi-scratchpad>
     [echo] Building jar for poi-scratchpad, module-name: scratchpad with isJava8: true
      [jar] Building jar: <https://ci-builds.apache.org/job/POI/job/POI-DSL-IBM-JDK/137/artifact/build/dist/maven/poi-scratchpad/poi-scratchpad-5.2.4-SNAPSHOT.jar>
    [javac] Compiling 198 source files to <https://ci-builds.apache.org/job/POI/job/POI-DSL-IBM-JDK/ws/poi-scratchpad/build/test-classes>
    [javac] Support for javac --release has been added in Java9 ignoring it
    [javac] Note: Some input files use or override a deprecated API.
    [javac] Note: Recompile with -Xlint:deprecation for details.
     [echo] Building test-jar for poi-scratchpad, module-name: scratchpad with isJava8: true
      [jar] Building jar: <https://ci-builds.apache.org/job/POI/job/POI-DSL-IBM-JDK/137/artifact/build/dist/maven/poi-scratchpad-tests/poi-scratchpad-5.2.4-SNAPSHOT-tests.jar>
      [jar] Building jar: <https://ci-builds.apache.org/job/POI/job/POI-DSL-IBM-JDK/137/artifact/build/dist/maven/poi-scratchpad/poi-scratchpad-5.2.4-SNAPSHOT-sources.jar>

check-compiled-ooxml-xsds:

compile-ooxml-xsds:
    [mkdir] Created dir: <https://ci-builds.apache.org/job/POI/job/POI-DSL-IBM-JDK/ws/poi-ooxml-full/build/xsds>
     [copy] Copying 12 files to <https://ci-builds.apache.org/job/POI/job/POI-DSL-IBM-JDK/ws/poi-ooxml-full/build/xsds>
     [copy] Copying 28 resources to <https://ci-builds.apache.org/job/POI/job/POI-DSL-IBM-JDK/ws/poi-ooxml-full/build/xsds>
  [xmlbean] SchemaCompiler  Metadata LOAD:org/apache/xmlbeans/metadata GEN:org/apache/poi/schemas/ooxml
  [xmlbean] Time to build schema type system: 3.824 seconds
  [xmlbean] Time to generate code: 6.888 seconds
    [javac] Compiling 5147 source files to <https://ci-builds.apache.org/job/POI/job/POI-DSL-IBM-JDK/ws/poi-ooxml-full/build/classes/ant/java>
    [javac] Support for javac --release has been added in Java9 ignoring it
    [mkdir] Created dir: <https://ci-builds.apache.org/job/POI/job/POI-DSL-IBM-JDK/ws/build/dist/maven/poi-ooxml-full>
      [jar] Building jar: <https://ci-builds.apache.org/job/POI/job/POI-DSL-IBM-JDK/137/artifact/build/dist/maven/poi-ooxml-full/poi-ooxml-full-5.2.4-SNAPSHOT.jar>
      [jar] Building jar: <https://ci-builds.apache.org/job/POI/job/POI-DSL-IBM-JDK/137/artifact/build/dist/maven/poi-ooxml-full/poi-ooxml-full-5.2.4-SNAPSHOT-sources.jar>

compile-ooxml:
     [echo] Building classes for poi-ooxml
    [javac] Compiling 643 source files to <https://ci-builds.apache.org/job/POI/job/POI-DSL-IBM-JDK/ws/poi-ooxml/build/classes/ant/java>
    [javac] Note: Some input files use or override a deprecated API.
    [javac] Note: Recompile with -Xlint:deprecation for details.
    [javac] Creating empty <https://ci-builds.apache.org/job/POI/job/POI-DSL-IBM-JDK/ws/poi-ooxml/build/classes/ant/java/org/apache/poi/xwpf/package-info.class>
    [javac] Creating empty <https://ci-builds.apache.org/job/POI/job/POI-DSL-IBM-JDK/ws/poi-ooxml/build/classes/ant/java/org/apache/poi/xssf/binary/package-info.class>
     [echo] Building java9+ classes for poi-ooxml
    [mkdir] Created dir: <https://ci-builds.apache.org/job/POI/job/POI-DSL-IBM-JDK/ws/build/dist/maven/poi-ooxml>
     [echo] Building jar for poi-ooxml, module-name: ooxml with isJava8: true
      [jar] Building jar: <https://ci-builds.apache.org/job/POI/job/POI-DSL-IBM-JDK/137/artifact/build/dist/maven/poi-ooxml/poi-ooxml-5.2.4-SNAPSHOT.jar>
    [javac] Compiling 295 source files to <https://ci-builds.apache.org/job/POI/job/POI-DSL-IBM-JDK/ws/poi-ooxml/build/test-classes>
    [javac] Support for javac --release has been added in Java9 ignoring it
    [javac] Note: Some input files use or override a deprecated API.
    [javac] Note: Recompile with -Xlint:deprecation for details.
     [echo] Building test-jar for poi-ooxml, module-name: ooxml with isJava8: true
      [jar] Building jar: <https://ci-builds.apache.org/job/POI/job/POI-DSL-IBM-JDK/137/artifact/build/dist/maven/poi-ooxml-tests/poi-ooxml-5.2.4-SNAPSHOT-tests.jar>
      [jar] Building jar: <https://ci-builds.apache.org/job/POI/job/POI-DSL-IBM-JDK/137/artifact/build/dist/maven/poi-ooxml/poi-ooxml-5.2.4-SNAPSHOT-sources.jar>
    [mkdir] Created dir: <https://ci-builds.apache.org/job/POI/job/POI-DSL-IBM-JDK/ws/poi-ooxml-lite-agent/build/classes/ant/java>
    [javac] Compiling 1 source file to <https://ci-builds.apache.org/job/POI/job/POI-DSL-IBM-JDK/ws/poi-ooxml-lite-agent/build/classes/ant/java>
    [javac] Support for javac --release has been added in Java9 ignoring it
      [jar] Building jar: <https://ci-builds.apache.org/job/POI/job/POI-DSL-IBM-JDK/137/artifact/build/dist/maven/poi-ooxml-lite-agent/poi-ooxml-lite-agent-5.2.4-SNAPSHOT.jar>

compile-examples:
     [echo] Building classes for poi-examples
    [javac] Compiling 139 source files to <https://ci-builds.apache.org/job/POI/job/POI-DSL-IBM-JDK/ws/poi-examples/build/classes/ant/java>
    [javac] Creating empty <https://ci-builds.apache.org/job/POI/job/POI-DSL-IBM-JDK/ws/poi-examples/build/classes/ant/java/org/apache/poi/examples/ss/html/package-info.class>
     [echo] Building java9+ classes for poi-examples
    [mkdir] Created dir: <https://ci-builds.apache.org/job/POI/job/POI-DSL-IBM-JDK/ws/build/dist/maven/poi-examples>
     [echo] Building jar for poi-examples, module-name: examples with isJava8: true
      [jar] Building jar: <https://ci-builds.apache.org/job/POI/job/POI-DSL-IBM-JDK/137/artifact/build/dist/maven/poi-examples/poi-examples-5.2.4-SNAPSHOT.jar>
     [echo] Building test-jar for poi-examples, module-name: examples with isJava8: true
      [jar] Building jar: <https://ci-builds.apache.org/job/POI/job/POI-DSL-IBM-JDK/137/artifact/build/dist/maven/poi-examples/poi-examples-5.2.4-SNAPSHOT-sources.jar>

compile-excelant:
     [echo] Building classes for poi-excelant
    [javac] Compiling 14 source files to <https://ci-builds.apache.org/job/POI/job/POI-DSL-IBM-JDK/ws/poi-excelant/build/classes/ant/java>
     [echo] Building java9+ classes for poi-excelant
    [mkdir] Created dir: <https://ci-builds.apache.org/job/POI/job/POI-DSL-IBM-JDK/ws/build/dist/maven/poi-excelant>
     [echo] Building jar for poi-excelant, module-name: excelant with isJava8: true
      [jar] Building jar: <https://ci-builds.apache.org/job/POI/job/POI-DSL-IBM-JDK/137/artifact/build/dist/maven/poi-excelant/poi-excelant-5.2.4-SNAPSHOT.jar>
    [javac] Compiling 12 source files to <https://ci-builds.apache.org/job/POI/job/POI-DSL-IBM-JDK/ws/poi-excelant/build/test-classes>
    [javac] Support for javac --release has been added in Java9 ignoring it
     [echo] Building test-jar for poi-excelant, module-name: excelant with isJava8: true
      [jar] Building jar: <https://ci-builds.apache.org/job/POI/job/POI-DSL-IBM-JDK/137/artifact/build/dist/maven/poi-excelant-tests/poi-excelant-5.2.4-SNAPSHOT-tests.jar>
      [jar] Building jar: <https://ci-builds.apache.org/job/POI/job/POI-DSL-IBM-JDK/137/artifact/build/dist/maven/poi-excelant/poi-excelant-5.2.4-SNAPSHOT-sources.jar>

compile:

jacocotask:
     [echo] Coverage reporting: true

-test-main-check:

test-main:
    [mkdir] Created dir: <https://ci-builds.apache.org/job/POI/job/POI-DSL-IBM-JDK/ws/poi-excelant/build/poi-ant-contrib>
    [javac] Compiling 1 source file to <https://ci-builds.apache.org/job/POI/job/POI-DSL-IBM-JDK/ws/poi-excelant/build/poi-ant-contrib>
[junitlauncher] Running org.apache.poi.TestJDK12
[junitlauncher] 
[junitlauncher] Running org.apache.poi.TestJDK12
[junitlauncher] Tests run: 1, Failures: 0, Aborted: 0, Skipped: 0, Time elapsed: 1.124000 sec
[junitlauncher] Running org.apache.poi.TestPOIDocumentMain
[junitlauncher] 
[junitlauncher] Running org.apache.poi.TestPOIDocumentMain
[junitlauncher] Tests run: 6, Failures: 0, Aborted: 0, Skipped: 0, Time elapsed: 1.913000 sec
[junitlauncher] Running org.apache.poi.TestPOITestCase
[junitlauncher] 
[junitlauncher] Running org.apache.poi.TestPOITestCase
[junitlauncher] Tests run: 8, Failures: 0, Aborted: 0, Skipped: 0, Time elapsed: 0.034000 sec
[junitlauncher] Running org.apache.poi.ddf.TestEscherBSERecord
[junitlauncher] 
[junitlauncher] Running org.apache.poi.ddf.TestEscherBSERecord
[junitlauncher] Tests run: 3, Failures: 0, Aborted: 0, Skipped: 0, Time elapsed: 0.101000 sec
[junitlauncher] Running org.apache.poi.ddf.TestEscherBlipRecord
[junitlauncher] 
[junitlauncher] Running org.apache.poi.ddf.TestEscherBlipRecord
[junitlauncher] Tests run: 4, Failures: 0, Aborted: 0, Skipped: 0, Time elapsed: 0.077000 sec
[junitlauncher] Running org.apache.poi.ddf.TestEscherBoolProperty
[junitlauncher] 
[junitlauncher] Running org.apache.poi.ddf.TestEscherBoolProperty
[junitlauncher] Tests run: 1, Failures: 0, Aborted: 0, Skipped: 0, Time elapsed: 0.011000 sec
[junitlauncher] Running org.apache.poi.ddf.TestEscherChildAnchorRecord
[junitlauncher] 
[junitlauncher] Running org.apache.poi.ddf.TestEscherChildAnchorRecord
[junitlauncher] Tests run: 3, Failures: 0, Aborted: 0, Skipped: 0, Time elapsed: 0.011000 sec
[junitlauncher] Running org.apache.poi.ddf.TestEscherClientAnchorRecord
[junitlauncher] 
[junitlauncher] Running org.apache.poi.ddf.TestEscherClientAnchorRecord
[junitlauncher] Tests run: 3, Failures: 0, Aborted: 0, Skipped: 0, Time elapsed: 0.013000 sec
[junitlauncher] Running org.apache.poi.ddf.TestEscherClientDataRecord
[junitlauncher] 
[junitlauncher] Running org.apache.poi.ddf.TestEscherClientDataRecord
[junitlauncher] Tests run: 3, Failures: 0, Aborted: 0, Skipped: 0, Time elapsed: 0.008000 sec
[junitlauncher] Running org.apache.poi.ddf.TestEscherContainerRecord
[junitlauncher] 
[junitlauncher] Running org.apache.poi.ddf.TestEscherContainerRecord
[junitlauncher] Tests run: 6, Failures: 0, Aborted: 0, Skipped: 0, Time elapsed: 0.035000 sec
[junitlauncher] Running org.apache.poi.ddf.TestEscherDgRecord
[junitlauncher] 
[junitlauncher] Running org.apache.poi.ddf.TestEscherDgRecord
[junitlauncher] Tests run: 3, Failures: 0, Aborted: 0, Skipped: 0, Time elapsed: 0.007000 sec
[junitlauncher] Running org.apache.poi.ddf.TestEscherDggRecord
[junitlauncher] 
[junitlauncher] Running org.apache.poi.ddf.TestEscherDggRecord
[junitlauncher] Tests run: 4, Failures: 0, Aborted: 0, Skipped: 0, Time elapsed: 0.015000 sec
[junitlauncher] Running org.apache.poi.ddf.TestEscherDump
[junitlauncher] 
[junitlauncher] Running org.apache.poi.ddf.TestEscherDump
[junitlauncher] Tests run: 4, Failures: 0, Aborted: 0, Skipped: 0, Time elapsed: 0.426000 sec
[junitlauncher] Running org.apache.poi.ddf.TestEscherOptRecord
[junitlauncher] 
[junitlauncher] Running org.apache.poi.ddf.TestEscherOptRecord
[junitlauncher] Tests run: 6, Failures: 0, Aborted: 0, Skipped: 0, Time elapsed: 0.018000 sec
[junitlauncher] Running org.apache.poi.ddf.TestEscherProperty
[junitlauncher] 
[junitlauncher] Running org.apache.poi.ddf.TestEscherProperty
[junitlauncher] Tests run: 1, Failures: 0, Aborted: 0, Skipped: 0, Time elapsed: 0.002000 sec
[junitlauncher] Running org.apache.poi.ddf.TestEscherPropertyFactory
[junitlauncher] 
[junitlauncher] Running org.apache.poi.ddf.TestEscherPropertyFactory
[junitlauncher] Tests run: 1, Failures: 0, Aborted: 0, Skipped: 0, Time elapsed: 0.003000 sec
[junitlauncher] Running org.apache.poi.ddf.TestEscherSpRecord
[junitlauncher] 
[junitlauncher] Running org.apache.poi.ddf.TestEscherSpRecord
[junitlauncher] Tests run: 3, Failures: 0, Aborted: 0, Skipped: 0, Time elapsed: 0.012000 sec
[junitlauncher] Running org.apache.poi.ddf.TestEscherSpgrRecord
[junitlauncher] 
[junitlauncher] Running org.apache.poi.ddf.TestEscherSpgrRecord
[junitlauncher] Tests run: 3, Failures: 0, Aborted: 0, Skipped: 0, Time elapsed: 0.008000 sec
[junitlauncher] Running org.apache.poi.ddf.TestEscherSplitMenuColorsRecord
[junitlauncher] 
[junitlauncher] Running org.apache.poi.ddf.TestEscherSplitMenuColorsRecord
[junitlauncher] Tests run: 3, Failures: 0, Aborted: 0, Skipped: 0, Time elapsed: 0.006000 sec
[junitlauncher] Running org.apache.poi.ddf.TestUnknownEscherRecord
[junitlauncher] 
[junitlauncher] Running org.apache.poi.ddf.TestUnknownEscherRecord
[junitlauncher] Tests run: 3, Failures: 0, Aborted: 0, Skipped: 0, Time elapsed: 0.006000 sec
[junitlauncher] Running org.apache.poi.hpsf.TestVariantSupport
[junitlauncher] 
[junitlauncher] Running org.apache.poi.hpsf.TestVariantSupport
[junitlauncher] Tests run: 2, Failures: 0, Aborted: 0, Skipped: 0, Time elapsed: 0.020000 sec
[junitlauncher] Running org.apache.poi.hpsf.basic.TestBasic
[junitlauncher] 
[junitlauncher] Running org.apache.poi.hpsf.basic.TestBasic
[junitlauncher] Tests run: 6, Failures: 0, Aborted: 0, Skipped: 0, Time elapsed: 0.045000 sec
[junitlauncher] Running org.apache.poi.hpsf.basic.TestClassID
[junitlauncher] 
[junitlauncher] Running org.apache.poi.hpsf.basic.TestClassID
[junitlauncher] Tests run: 6, Failures: 0, Aborted: 0, Skipped: 0, Time elapsed: 0.011000 sec
[junitlauncher] Running org.apache.poi.hpsf.basic.TestEmptyProperties
[junitlauncher] 
[junitlauncher] Running org.apache.poi.hpsf.basic.TestEmptyProperties
[junitlauncher] Tests run: 3, Failures: 0, Aborted: 0, Skipped: 0, Time elapsed: 0.020000 sec
[junitlauncher] Running org.apache.poi.hpsf.basic.TestHPSFBugs
[junitlauncher] 
[junitlauncher] Running org.apache.poi.hpsf.basic.TestHPSFBugs
[junitlauncher] Tests run: 4, Failures: 0, Aborted: 0, Skipped: 0, Time elapsed: 0.064000 sec
[junitlauncher] Running org.apache.poi.hpsf.basic.TestMetaDataIPI
[junitlauncher] 
[junitlauncher] Running org.apache.poi.hpsf.basic.TestMetaDataIPI
[junitlauncher] Tests run: 7, Failures: 0, Aborted: 0, Skipped: 0, Time elapsed: 1.257000 sec
[junitlauncher] Running org.apache.poi.hpsf.basic.TestReadAllFiles
[junitlauncher] 
[junitlauncher] Running org.apache.poi.hpsf.basic.TestReadAllFiles
[junitlauncher]    Failed: readDocumentSummaryInformation(File): java.lang.NoSuchMethodError: org/junit/platform/commons/util/ReflectionUtils.parseQualifiedMethodName(Ljava/lang/String;)[Ljava/lang/String; (loaded from <https://ci-builds.apache.org/job/POI/job/POI-DSL-IBM-JDK/ws/lib/main-tests/junit-platform-commons-1.9.1.jar> by sun.misc.Launcher$AppClassLoader@2b9022a4) called from class org.junit.jupiter.params.provider.MethodArgumentsProvider (loaded from <https://ci-builds.apache.org/job/POI/job/POI-DSL-IBM-JDK/ws/lib/main-tests/junit-jupiter-params-5.9.2.jar> by sun.misc.Launcher$AppClassLoader@2b9022a4).
[junitlauncher]    Failed: readCustomPropertiesFromFiles(File): java.lang.NoSuchMethodError: org/junit/platform/commons/util/ReflectionUtils.parseQualifiedMethodName(Ljava/lang/String;)[Ljava/lang/String; (loaded from <https://ci-builds.apache.org/job/POI/job/POI-DSL-IBM-JDK/ws/lib/main-tests/junit-platform-commons-1.9.1.jar> by sun.misc.Launcher$AppClassLoader@2b9022a4) called from class org.junit.jupiter.params.provider.MethodArgumentsProvider (loaded from <https://ci-builds.apache.org/job/POI/job/POI-DSL-IBM-JDK/ws/lib/main-tests/junit-jupiter-params-5.9.2.jar> by sun.misc.Launcher$AppClassLoader@2b9022a4).
[junitlauncher]    Failed: recreate(File): java.lang.NoSuchMethodError: org/junit/platform/commons/util/ReflectionUtils.parseQualifiedMethodName(Ljava/lang/String;)[Ljava/lang/String; (loaded from <https://ci-builds.apache.org/job/POI/job/POI-DSL-IBM-JDK/ws/lib/main-tests/junit-platform-commons-1.9.1.jar> by sun.misc.Launcher$AppClassLoader@2b9022a4) called from class org.junit.jupiter.params.provider.MethodArgumentsProvider (loaded from <https://ci-builds.apache.org/job/POI/job/POI-DSL-IBM-JDK/ws/lib/main-tests/junit-jupiter-params-5.9.2.jar> by sun.misc.Launcher$AppClassLoader@2b9022a4).
[junitlauncher]    Failed: read(File): java.lang.NoSuchMethodError: org/junit/platform/commons/util/ReflectionUtils.parseQualifiedMethodName(Ljava/lang/String;)[Ljava/lang/String; (loaded from <https://ci-builds.apache.org/job/POI/job/POI-DSL-IBM-JDK/ws/lib/main-tests/junit-platform-commons-1.9.1.jar> by sun.misc.Launcher$AppClassLoader@2b9022a4) called from class org.junit.jupiter.params.provider.MethodArgumentsProvider (loaded from <https://ci-builds.apache.org/job/POI/job/POI-DSL-IBM-JDK/ws/lib/main-tests/junit-jupiter-params-5.9.2.jar> by sun.misc.Launcher$AppClassLoader@2b9022a4).
[junitlauncher] Tests run: 4, Failures: 4, Aborted: 0, Skipped: 0, Time elapsed: 0.435000 sec

BUILD FAILED
<https://ci-builds.apache.org/job/POI/job/POI-DSL-IBM-JDK/ws/build.xml>:1725: The following error occurred while executing this line:
<https://ci-builds.apache.org/job/POI/job/POI-DSL-IBM-JDK/ws/build.xml>:1421: Some test(s) have failure(s)

Total time: 3 minutes 25 seconds
Build step 'Invoke Ant' marked build as failure
[SpotBugs] Skipping execution of recorder since overall result is 'FAILURE'
ERROR: Not all environment variables could be successfully injected. Check for similarly-named environment variables.
Archiving artifacts
ERROR: Not all environment variables could be successfully injected. Check for similarly-named environment variables.
Recording test results
ERROR: Not all environment variables could be successfully injected. Check for similarly-named environment variables.
[Checks API] No suitable checks publisher found.
ERROR: Not all environment variables could be successfully injected. Check for similarly-named environment variables.
ERROR: Not all environment variables could be successfully injected. Check for similarly-named environment variables.
ERROR: Not all environment variables could be successfully injected. Check for similarly-named environment variables.

---------------------------------------------------------------------
To unsubscribe, e-mail: dev-unsubscribe@poi.apache.org
For additional commands, e-mail: dev-help@poi.apache.org


Jenkins build is back to normal : POI » POI-DSL-IBM-JDK #139

Posted by Apache Jenkins Server <je...@builds.apache.org>.
See <https://ci-builds.apache.org/job/POI/job/POI-DSL-IBM-JDK/139/display/redirect?page=changes>


---------------------------------------------------------------------
To unsubscribe, e-mail: dev-unsubscribe@poi.apache.org
For additional commands, e-mail: dev-help@poi.apache.org


Build failed in Jenkins: POI » POI-DSL-IBM-JDK #138

Posted by Apache Jenkins Server <je...@builds.apache.org>.
See <https://ci-builds.apache.org/job/POI/job/POI-DSL-IBM-JDK/138/display/redirect?page=changes>

Changes:

[PJ Fanning] rework SXSSF groupRow and add test

[PJ Fanning] edge case (avoid short overflow)

[PJ Fanning] try to improve performance of XSSFSheet row/col grouping/ungrouping

[PJ Fanning] reorder xssf code

[PJ Fanning] update changes


------------------------------------------
[...truncated 23.47 KB...]
    [javac] Creating empty <https://ci-builds.apache.org/job/POI/job/POI-DSL-IBM-JDK/ws/poi/build/classes/ant/java/org/apache/poi/poifs/common/package-info.class>
    [javac] Creating empty <https://ci-builds.apache.org/job/POI/job/POI-DSL-IBM-JDK/ws/poi/build/classes/ant/java/org/apache/poi/hssf/record/package-info.class>
    [javac] Creating empty <https://ci-builds.apache.org/job/POI/job/POI-DSL-IBM-JDK/ws/poi/build/classes/ant/java/org/apache/poi/poifs/package-info.class>
    [javac] Creating empty <https://ci-builds.apache.org/job/POI/job/POI-DSL-IBM-JDK/ws/poi/build/classes/ant/java/org/apache/poi/poifs/crypt/package-info.class>
    [javac] Creating empty <https://ci-builds.apache.org/job/POI/job/POI-DSL-IBM-JDK/ws/poi/build/classes/ant/java/org/apache/poi/hpsf/wellknown/package-info.class>
    [javac] Creating empty <https://ci-builds.apache.org/job/POI/job/POI-DSL-IBM-JDK/ws/poi/build/classes/ant/java/org/apache/poi/ss/formula/package-info.class>
    [javac] Creating empty <https://ci-builds.apache.org/job/POI/job/POI-DSL-IBM-JDK/ws/poi/build/classes/ant/java/org/apache/poi/hpsf/package-info.class>
    [javac] Creating empty <https://ci-builds.apache.org/job/POI/job/POI-DSL-IBM-JDK/ws/poi/build/classes/ant/java/org/apache/poi/poifs/property/package-info.class>
    [javac] Creating empty <https://ci-builds.apache.org/job/POI/job/POI-DSL-IBM-JDK/ws/poi/build/classes/ant/java/org/apache/poi/poifs/filesystem/package-info.class>
    [javac] Creating empty <https://ci-builds.apache.org/job/POI/job/POI-DSL-IBM-JDK/ws/poi/build/classes/ant/java/org/apache/poi/ss/formula/ptg/package-info.class>
    [javac] Creating empty <https://ci-builds.apache.org/job/POI/job/POI-DSL-IBM-JDK/ws/poi/build/classes/ant/java/org/apache/poi/poifs/storage/package-info.class>
    [javac] Creating empty <https://ci-builds.apache.org/job/POI/job/POI-DSL-IBM-JDK/ws/poi/build/classes/ant/java/org/apache/poi/hssf/eventusermodel/package-info.class>
    [javac] Creating empty <https://ci-builds.apache.org/job/POI/job/POI-DSL-IBM-JDK/ws/poi/build/classes/ant/java/org/apache/poi/hssf/record/aggregates/package-info.class>
    [javac] Creating empty <https://ci-builds.apache.org/job/POI/job/POI-DSL-IBM-JDK/ws/poi/build/classes/ant/java/org/apache/poi/ss/format/package-info.class>
    [javac] Creating empty <https://ci-builds.apache.org/job/POI/job/POI-DSL-IBM-JDK/ws/poi/build/classes/ant/java/org/apache/poi/hssf/model/package-info.class>
    [javac] Creating empty <https://ci-builds.apache.org/job/POI/job/POI-DSL-IBM-JDK/ws/poi/build/classes/ant/java/org/apache/poi/hssf/usermodel/package-info.class>
    [javac] Creating empty <https://ci-builds.apache.org/job/POI/job/POI-DSL-IBM-JDK/ws/poi/build/classes/ant/java/org/apache/poi/hssf/util/package-info.class>
    [javac] Creating empty <https://ci-builds.apache.org/job/POI/job/POI-DSL-IBM-JDK/ws/poi/build/classes/ant/java/org/apache/poi/poifs/eventfilesystem/package-info.class>
     [echo] Building java9+ classes for poi
    [mkdir] Created dir: <https://ci-builds.apache.org/job/POI/job/POI-DSL-IBM-JDK/ws/build/dist/maven/poi>
     [echo] Building jar for poi, module-name: poi with isJava8: true
      [jar] Building jar: <https://ci-builds.apache.org/job/POI/job/POI-DSL-IBM-JDK/138/artifact/build/dist/maven/poi/poi-5.2.4-SNAPSHOT.jar>
    [javac] Compiling 588 source files to <https://ci-builds.apache.org/job/POI/job/POI-DSL-IBM-JDK/ws/poi/build/test-classes>
    [javac] Support for javac --release has been added in Java9 ignoring it
    [javac] Note: Some input files use or override a deprecated API.
    [javac] Note: Recompile with -Xlint:deprecation for details.
    [javac] Creating empty <https://ci-builds.apache.org/job/POI/job/POI-DSL-IBM-JDK/ws/poi/build/test-classes/org/apache/poi/hssf/dev/package-info.class>
     [echo] Building test-jar for poi, module-name: poi with isJava8: true
      [jar] Building jar: <https://ci-builds.apache.org/job/POI/job/POI-DSL-IBM-JDK/138/artifact/build/dist/maven/poi-tests/poi-5.2.4-SNAPSHOT-tests.jar>
      [jar] Building jar: <https://ci-builds.apache.org/job/POI/job/POI-DSL-IBM-JDK/138/artifact/build/dist/maven/poi/poi-5.2.4-SNAPSHOT-sources.jar>

compile-scratchpad:
     [echo] Building classes for poi-scratchpad
    [javac] Compiling 517 source files to <https://ci-builds.apache.org/job/POI/job/POI-DSL-IBM-JDK/ws/poi-scratchpad/build/classes/ant/java>
    [javac] Note: Some input files use or override a deprecated API.
    [javac] Note: Recompile with -Xlint:deprecation for details.
    [javac] Note: <https://ci-builds.apache.org/job/POI/job/POI-DSL-IBM-JDK/ws/poi-scratchpad/src/main/java/org/apache/poi/hwpf/model/BytePropertyNode.java> uses unchecked or unsafe operations.
    [javac] Note: Recompile with -Xlint:unchecked for details.
     [echo] Building java9+ classes for poi-scratchpad
    [mkdir] Created dir: <https://ci-builds.apache.org/job/POI/job/POI-DSL-IBM-JDK/ws/build/dist/maven/poi-scratchpad>
     [echo] Building jar for poi-scratchpad, module-name: scratchpad with isJava8: true
      [jar] Building jar: <https://ci-builds.apache.org/job/POI/job/POI-DSL-IBM-JDK/138/artifact/build/dist/maven/poi-scratchpad/poi-scratchpad-5.2.4-SNAPSHOT.jar>
    [javac] Compiling 198 source files to <https://ci-builds.apache.org/job/POI/job/POI-DSL-IBM-JDK/ws/poi-scratchpad/build/test-classes>
    [javac] Support for javac --release has been added in Java9 ignoring it
    [javac] Note: Some input files use or override a deprecated API.
    [javac] Note: Recompile with -Xlint:deprecation for details.
     [echo] Building test-jar for poi-scratchpad, module-name: scratchpad with isJava8: true
      [jar] Building jar: <https://ci-builds.apache.org/job/POI/job/POI-DSL-IBM-JDK/138/artifact/build/dist/maven/poi-scratchpad-tests/poi-scratchpad-5.2.4-SNAPSHOT-tests.jar>
      [jar] Building jar: <https://ci-builds.apache.org/job/POI/job/POI-DSL-IBM-JDK/138/artifact/build/dist/maven/poi-scratchpad/poi-scratchpad-5.2.4-SNAPSHOT-sources.jar>

check-compiled-ooxml-xsds:

compile-ooxml-xsds:
    [mkdir] Created dir: <https://ci-builds.apache.org/job/POI/job/POI-DSL-IBM-JDK/ws/poi-ooxml-full/build/xsds>
     [copy] Copying 12 files to <https://ci-builds.apache.org/job/POI/job/POI-DSL-IBM-JDK/ws/poi-ooxml-full/build/xsds>
     [copy] Copying 28 resources to <https://ci-builds.apache.org/job/POI/job/POI-DSL-IBM-JDK/ws/poi-ooxml-full/build/xsds>
  [xmlbean] SchemaCompiler  Metadata LOAD:org/apache/xmlbeans/metadata GEN:org/apache/poi/schemas/ooxml
  [xmlbean] Time to build schema type system: 3.89 seconds
  [xmlbean] Time to generate code: 5.78 seconds
    [javac] Compiling 5147 source files to <https://ci-builds.apache.org/job/POI/job/POI-DSL-IBM-JDK/ws/poi-ooxml-full/build/classes/ant/java>
    [javac] Support for javac --release has been added in Java9 ignoring it
    [mkdir] Created dir: <https://ci-builds.apache.org/job/POI/job/POI-DSL-IBM-JDK/ws/build/dist/maven/poi-ooxml-full>
      [jar] Building jar: <https://ci-builds.apache.org/job/POI/job/POI-DSL-IBM-JDK/138/artifact/build/dist/maven/poi-ooxml-full/poi-ooxml-full-5.2.4-SNAPSHOT.jar>
      [jar] Building jar: <https://ci-builds.apache.org/job/POI/job/POI-DSL-IBM-JDK/138/artifact/build/dist/maven/poi-ooxml-full/poi-ooxml-full-5.2.4-SNAPSHOT-sources.jar>

compile-ooxml:
     [echo] Building classes for poi-ooxml
    [javac] Compiling 643 source files to <https://ci-builds.apache.org/job/POI/job/POI-DSL-IBM-JDK/ws/poi-ooxml/build/classes/ant/java>
    [javac] Note: Some input files use or override a deprecated API.
    [javac] Note: Recompile with -Xlint:deprecation for details.
    [javac] Creating empty <https://ci-builds.apache.org/job/POI/job/POI-DSL-IBM-JDK/ws/poi-ooxml/build/classes/ant/java/org/apache/poi/xwpf/package-info.class>
    [javac] Creating empty <https://ci-builds.apache.org/job/POI/job/POI-DSL-IBM-JDK/ws/poi-ooxml/build/classes/ant/java/org/apache/poi/xssf/binary/package-info.class>
     [echo] Building java9+ classes for poi-ooxml
    [mkdir] Created dir: <https://ci-builds.apache.org/job/POI/job/POI-DSL-IBM-JDK/ws/build/dist/maven/poi-ooxml>
     [echo] Building jar for poi-ooxml, module-name: ooxml with isJava8: true
      [jar] Building jar: <https://ci-builds.apache.org/job/POI/job/POI-DSL-IBM-JDK/138/artifact/build/dist/maven/poi-ooxml/poi-ooxml-5.2.4-SNAPSHOT.jar>
    [javac] Compiling 295 source files to <https://ci-builds.apache.org/job/POI/job/POI-DSL-IBM-JDK/ws/poi-ooxml/build/test-classes>
    [javac] Support for javac --release has been added in Java9 ignoring it
    [javac] Note: Some input files use or override a deprecated API.
    [javac] Note: Recompile with -Xlint:deprecation for details.
     [echo] Building test-jar for poi-ooxml, module-name: ooxml with isJava8: true
      [jar] Building jar: <https://ci-builds.apache.org/job/POI/job/POI-DSL-IBM-JDK/138/artifact/build/dist/maven/poi-ooxml-tests/poi-ooxml-5.2.4-SNAPSHOT-tests.jar>
      [jar] Building jar: <https://ci-builds.apache.org/job/POI/job/POI-DSL-IBM-JDK/138/artifact/build/dist/maven/poi-ooxml/poi-ooxml-5.2.4-SNAPSHOT-sources.jar>
      [jar] Building jar: <https://ci-builds.apache.org/job/POI/job/POI-DSL-IBM-JDK/138/artifact/build/dist/maven/poi-ooxml-lite-agent/poi-ooxml-lite-agent-5.2.4-SNAPSHOT.jar>

compile-examples:
     [echo] Building classes for poi-examples
    [javac] Compiling 139 source files to <https://ci-builds.apache.org/job/POI/job/POI-DSL-IBM-JDK/ws/poi-examples/build/classes/ant/java>
    [javac] Creating empty <https://ci-builds.apache.org/job/POI/job/POI-DSL-IBM-JDK/ws/poi-examples/build/classes/ant/java/org/apache/poi/examples/ss/html/package-info.class>
     [echo] Building java9+ classes for poi-examples
    [mkdir] Created dir: <https://ci-builds.apache.org/job/POI/job/POI-DSL-IBM-JDK/ws/build/dist/maven/poi-examples>
     [echo] Building jar for poi-examples, module-name: examples with isJava8: true
      [jar] Building jar: <https://ci-builds.apache.org/job/POI/job/POI-DSL-IBM-JDK/138/artifact/build/dist/maven/poi-examples/poi-examples-5.2.4-SNAPSHOT.jar>
     [echo] Building test-jar for poi-examples, module-name: examples with isJava8: true
      [jar] Building jar: <https://ci-builds.apache.org/job/POI/job/POI-DSL-IBM-JDK/138/artifact/build/dist/maven/poi-examples/poi-examples-5.2.4-SNAPSHOT-sources.jar>

compile-excelant:
     [echo] Building classes for poi-excelant
    [javac] Compiling 14 source files to <https://ci-builds.apache.org/job/POI/job/POI-DSL-IBM-JDK/ws/poi-excelant/build/classes/ant/java>
     [echo] Building java9+ classes for poi-excelant
    [mkdir] Created dir: <https://ci-builds.apache.org/job/POI/job/POI-DSL-IBM-JDK/ws/build/dist/maven/poi-excelant>
     [echo] Building jar for poi-excelant, module-name: excelant with isJava8: true
      [jar] Building jar: <https://ci-builds.apache.org/job/POI/job/POI-DSL-IBM-JDK/138/artifact/build/dist/maven/poi-excelant/poi-excelant-5.2.4-SNAPSHOT.jar>
    [javac] Compiling 12 source files to <https://ci-builds.apache.org/job/POI/job/POI-DSL-IBM-JDK/ws/poi-excelant/build/test-classes>
    [javac] Support for javac --release has been added in Java9 ignoring it
     [echo] Building test-jar for poi-excelant, module-name: excelant with isJava8: true
      [jar] Building jar: <https://ci-builds.apache.org/job/POI/job/POI-DSL-IBM-JDK/138/artifact/build/dist/maven/poi-excelant-tests/poi-excelant-5.2.4-SNAPSHOT-tests.jar>
      [jar] Building jar: <https://ci-builds.apache.org/job/POI/job/POI-DSL-IBM-JDK/138/artifact/build/dist/maven/poi-excelant/poi-excelant-5.2.4-SNAPSHOT-sources.jar>

compile:

jacocotask:
     [echo] Coverage reporting: true

-test-main-check:

test-main:
    [mkdir] Created dir: <https://ci-builds.apache.org/job/POI/job/POI-DSL-IBM-JDK/ws/poi-excelant/build/poi-ant-contrib>
    [javac] Compiling 1 source file to <https://ci-builds.apache.org/job/POI/job/POI-DSL-IBM-JDK/ws/poi-excelant/build/poi-ant-contrib>
[junitlauncher] Running org.apache.poi.TestJDK12
[junitlauncher] 
[junitlauncher] Running org.apache.poi.TestJDK12
[junitlauncher] Tests run: 1, Failures: 0, Aborted: 0, Skipped: 0, Time elapsed: 1.144000 sec
[junitlauncher] Running org.apache.poi.TestPOIDocumentMain
[junitlauncher] 
[junitlauncher] Running org.apache.poi.TestPOIDocumentMain
[junitlauncher] Tests run: 6, Failures: 0, Aborted: 0, Skipped: 0, Time elapsed: 1.845000 sec
[junitlauncher] Running org.apache.poi.TestPOITestCase
[junitlauncher] 
[junitlauncher] Running org.apache.poi.TestPOITestCase
[junitlauncher] Tests run: 8, Failures: 0, Aborted: 0, Skipped: 0, Time elapsed: 0.038000 sec
[junitlauncher] Running org.apache.poi.ddf.TestEscherBSERecord
[junitlauncher] 
[junitlauncher] Running org.apache.poi.ddf.TestEscherBSERecord
[junitlauncher] Tests run: 3, Failures: 0, Aborted: 0, Skipped: 0, Time elapsed: 0.075000 sec
[junitlauncher] Running org.apache.poi.ddf.TestEscherBlipRecord
[junitlauncher] 
[junitlauncher] Running org.apache.poi.ddf.TestEscherBlipRecord
[junitlauncher] Tests run: 4, Failures: 0, Aborted: 0, Skipped: 0, Time elapsed: 0.100000 sec
[junitlauncher] Running org.apache.poi.ddf.TestEscherBoolProperty
[junitlauncher] 
[junitlauncher] Running org.apache.poi.ddf.TestEscherBoolProperty
[junitlauncher] Tests run: 1, Failures: 0, Aborted: 0, Skipped: 0, Time elapsed: 0.007000 sec
[junitlauncher] Running org.apache.poi.ddf.TestEscherChildAnchorRecord
[junitlauncher] 
[junitlauncher] Running org.apache.poi.ddf.TestEscherChildAnchorRecord
[junitlauncher] Tests run: 3, Failures: 0, Aborted: 0, Skipped: 0, Time elapsed: 0.014000 sec
[junitlauncher] Running org.apache.poi.ddf.TestEscherClientAnchorRecord
[junitlauncher] 
[junitlauncher] Running org.apache.poi.ddf.TestEscherClientAnchorRecord
[junitlauncher] Tests run: 3, Failures: 0, Aborted: 0, Skipped: 0, Time elapsed: 0.012000 sec
[junitlauncher] Running org.apache.poi.ddf.TestEscherClientDataRecord
[junitlauncher] 
[junitlauncher] Running org.apache.poi.ddf.TestEscherClientDataRecord
[junitlauncher] Tests run: 3, Failures: 0, Aborted: 0, Skipped: 0, Time elapsed: 0.010000 sec
[junitlauncher] Running org.apache.poi.ddf.TestEscherContainerRecord
[junitlauncher] 
[junitlauncher] Running org.apache.poi.ddf.TestEscherContainerRecord
[junitlauncher] Tests run: 6, Failures: 0, Aborted: 0, Skipped: 0, Time elapsed: 0.025000 sec
[junitlauncher] Running org.apache.poi.ddf.TestEscherDgRecord
[junitlauncher] 
[junitlauncher] Running org.apache.poi.ddf.TestEscherDgRecord
[junitlauncher] Tests run: 3, Failures: 0, Aborted: 0, Skipped: 0, Time elapsed: 0.008000 sec
[junitlauncher] Running org.apache.poi.ddf.TestEscherDggRecord
[junitlauncher] 
[junitlauncher] Running org.apache.poi.ddf.TestEscherDggRecord
[junitlauncher] Tests run: 4, Failures: 0, Aborted: 0, Skipped: 0, Time elapsed: 0.015000 sec
[junitlauncher] Running org.apache.poi.ddf.TestEscherDump
[junitlauncher] 
[junitlauncher] Running org.apache.poi.ddf.TestEscherDump
[junitlauncher] Tests run: 4, Failures: 0, Aborted: 0, Skipped: 0, Time elapsed: 0.462000 sec
[junitlauncher] Running org.apache.poi.ddf.TestEscherOptRecord
[junitlauncher] 
[junitlauncher] Running org.apache.poi.ddf.TestEscherOptRecord
[junitlauncher] Tests run: 6, Failures: 0, Aborted: 0, Skipped: 0, Time elapsed: 0.018000 sec
[junitlauncher] Running org.apache.poi.ddf.TestEscherProperty
[junitlauncher] 
[junitlauncher] Running org.apache.poi.ddf.TestEscherProperty
[junitlauncher] Tests run: 1, Failures: 0, Aborted: 0, Skipped: 0, Time elapsed: 0.003000 sec
[junitlauncher] Running org.apache.poi.ddf.TestEscherPropertyFactory
[junitlauncher] 
[junitlauncher] Running org.apache.poi.ddf.TestEscherPropertyFactory
[junitlauncher] Tests run: 1, Failures: 0, Aborted: 0, Skipped: 0, Time elapsed: 0.003000 sec
[junitlauncher] Running org.apache.poi.ddf.TestEscherSpRecord
[junitlauncher] 
[junitlauncher] Running org.apache.poi.ddf.TestEscherSpRecord
[junitlauncher] Tests run: 3, Failures: 0, Aborted: 0, Skipped: 0, Time elapsed: 0.008000 sec
[junitlauncher] Running org.apache.poi.ddf.TestEscherSpgrRecord
[junitlauncher] 
[junitlauncher] Running org.apache.poi.ddf.TestEscherSpgrRecord
[junitlauncher] Tests run: 3, Failures: 0, Aborted: 0, Skipped: 0, Time elapsed: 0.008000 sec
[junitlauncher] Running org.apache.poi.ddf.TestEscherSplitMenuColorsRecord
[junitlauncher] 
[junitlauncher] Running org.apache.poi.ddf.TestEscherSplitMenuColorsRecord
[junitlauncher] Tests run: 3, Failures: 0, Aborted: 0, Skipped: 0, Time elapsed: 0.006000 sec
[junitlauncher] Running org.apache.poi.ddf.TestUnknownEscherRecord
[junitlauncher] 
[junitlauncher] Running org.apache.poi.ddf.TestUnknownEscherRecord
[junitlauncher] Tests run: 3, Failures: 0, Aborted: 0, Skipped: 0, Time elapsed: 0.006000 sec
[junitlauncher] Running org.apache.poi.hpsf.TestVariantSupport
[junitlauncher] 
[junitlauncher] Running org.apache.poi.hpsf.TestVariantSupport
[junitlauncher] Tests run: 2, Failures: 0, Aborted: 0, Skipped: 0, Time elapsed: 0.021000 sec
[junitlauncher] Running org.apache.poi.hpsf.basic.TestBasic
[junitlauncher] 
[junitlauncher] Running org.apache.poi.hpsf.basic.TestBasic
[junitlauncher] Tests run: 6, Failures: 0, Aborted: 0, Skipped: 0, Time elapsed: 0.227000 sec
[junitlauncher] Running org.apache.poi.hpsf.basic.TestClassID
[junitlauncher] 
[junitlauncher] Running org.apache.poi.hpsf.basic.TestClassID
[junitlauncher] Tests run: 6, Failures: 0, Aborted: 0, Skipped: 0, Time elapsed: 0.014000 sec
[junitlauncher] Running org.apache.poi.hpsf.basic.TestEmptyProperties
[junitlauncher] 
[junitlauncher] Running org.apache.poi.hpsf.basic.TestEmptyProperties
[junitlauncher] Tests run: 3, Failures: 0, Aborted: 0, Skipped: 0, Time elapsed: 0.021000 sec
[junitlauncher] Running org.apache.poi.hpsf.basic.TestHPSFBugs
[junitlauncher] 
[junitlauncher] Running org.apache.poi.hpsf.basic.TestHPSFBugs
[junitlauncher] Tests run: 4, Failures: 0, Aborted: 0, Skipped: 0, Time elapsed: 0.070000 sec
[junitlauncher] Running org.apache.poi.hpsf.basic.TestMetaDataIPI
[junitlauncher] 
[junitlauncher] Running org.apache.poi.hpsf.basic.TestMetaDataIPI
[junitlauncher] Tests run: 7, Failures: 0, Aborted: 0, Skipped: 0, Time elapsed: 1.255000 sec
[junitlauncher] Running org.apache.poi.hpsf.basic.TestReadAllFiles
[junitlauncher] 
[junitlauncher] Running org.apache.poi.hpsf.basic.TestReadAllFiles
[junitlauncher]    Failed: readDocumentSummaryInformation(File): java.lang.NoSuchMethodError: org/junit/platform/commons/util/ReflectionUtils.parseQualifiedMethodName(Ljava/lang/String;)[Ljava/lang/String; (loaded from <https://ci-builds.apache.org/job/POI/job/POI-DSL-IBM-JDK/ws/lib/main-tests/junit-platform-commons-1.9.1.jar> by sun.misc.Launcher$AppClassLoader@4b9955cd) called from class org.junit.jupiter.params.provider.MethodArgumentsProvider (loaded from <https://ci-builds.apache.org/job/POI/job/POI-DSL-IBM-JDK/ws/lib/main-tests/junit-jupiter-params-5.9.2.jar> by sun.misc.Launcher$AppClassLoader@4b9955cd).
[junitlauncher]    Failed: readCustomPropertiesFromFiles(File): java.lang.NoSuchMethodError: org/junit/platform/commons/util/ReflectionUtils.parseQualifiedMethodName(Ljava/lang/String;)[Ljava/lang/String; (loaded from <https://ci-builds.apache.org/job/POI/job/POI-DSL-IBM-JDK/ws/lib/main-tests/junit-platform-commons-1.9.1.jar> by sun.misc.Launcher$AppClassLoader@4b9955cd) called from class org.junit.jupiter.params.provider.MethodArgumentsProvider (loaded from <https://ci-builds.apache.org/job/POI/job/POI-DSL-IBM-JDK/ws/lib/main-tests/junit-jupiter-params-5.9.2.jar> by sun.misc.Launcher$AppClassLoader@4b9955cd).
[junitlauncher]    Failed: recreate(File): java.lang.NoSuchMethodError: org/junit/platform/commons/util/ReflectionUtils.parseQualifiedMethodName(Ljava/lang/String;)[Ljava/lang/String; (loaded from <https://ci-builds.apache.org/job/POI/job/POI-DSL-IBM-JDK/ws/lib/main-tests/junit-platform-commons-1.9.1.jar> by sun.misc.Launcher$AppClassLoader@4b9955cd) called from class org.junit.jupiter.params.provider.MethodArgumentsProvider (loaded from <https://ci-builds.apache.org/job/POI/job/POI-DSL-IBM-JDK/ws/lib/main-tests/junit-jupiter-params-5.9.2.jar> by sun.misc.Launcher$AppClassLoader@4b9955cd).
[junitlauncher]    Failed: read(File): java.lang.NoSuchMethodError: org/junit/platform/commons/util/ReflectionUtils.parseQualifiedMethodName(Ljava/lang/String;)[Ljava/lang/String; (loaded from <https://ci-builds.apache.org/job/POI/job/POI-DSL-IBM-JDK/ws/lib/main-tests/junit-platform-commons-1.9.1.jar> by sun.misc.Launcher$AppClassLoader@4b9955cd) called from class org.junit.jupiter.params.provider.MethodArgumentsProvider (loaded from <https://ci-builds.apache.org/job/POI/job/POI-DSL-IBM-JDK/ws/lib/main-tests/junit-jupiter-params-5.9.2.jar> by sun.misc.Launcher$AppClassLoader@4b9955cd).
[junitlauncher] Tests run: 4, Failures: 4, Aborted: 0, Skipped: 0, Time elapsed: 0.164000 sec

BUILD FAILED
<https://ci-builds.apache.org/job/POI/job/POI-DSL-IBM-JDK/ws/build.xml>:1725: The following error occurred while executing this line:
<https://ci-builds.apache.org/job/POI/job/POI-DSL-IBM-JDK/ws/build.xml>:1421: Some test(s) have failure(s)

Total time: 2 minutes 54 seconds
Build step 'Invoke Ant' marked build as failure
[SpotBugs] Skipping execution of recorder since overall result is 'FAILURE'
ERROR: Not all environment variables could be successfully injected. Check for similarly-named environment variables.
Archiving artifacts
[Fast Archiver] Compressed 40.84 MB of artifacts by 11.8% relative to #135
ERROR: Not all environment variables could be successfully injected. Check for similarly-named environment variables.
Recording test results
ERROR: Not all environment variables could be successfully injected. Check for similarly-named environment variables.
[Checks API] No suitable checks publisher found.
ERROR: Not all environment variables could be successfully injected. Check for similarly-named environment variables.
ERROR: Not all environment variables could be successfully injected. Check for similarly-named environment variables.
ERROR: Not all environment variables could be successfully injected. Check for similarly-named environment variables.

---------------------------------------------------------------------
To unsubscribe, e-mail: dev-unsubscribe@poi.apache.org
For additional commands, e-mail: dev-help@poi.apache.org