You are viewing a plain text version of this content. The canonical link for it is here.
Posted to dev@juneau.apache.org by Apache Jenkins Server <je...@builds.apache.org> on 2026/10/19 00:37:24 UTC
Build failed in Jenkins: Juneau » Juneau-Java-17 #2762
See <https://ci-builds.apache.org/job/Juneau/job/Juneau-Java-17/2762/display/redirect?page=changes>
Changes:
[James Bognar] Add a Bazel parser and pluggable external parsers to juneau-run (parser contract with poll/close, lazy-loaded parsers package, tool detection from argv[0], tools.bazel), draw finished row icons as a coloured dot, send git commit input only once when polling, and give same-second full logs unique names
------------------------------------------
[...truncated 617.60 KiB...]
[INFO] Tests run: 14, Failures: 0, Errors: 0, Skipped: 0, Time elapsed: 0.203 s -- in org.apache.juneau.rest.server.auth.AuthResult_Test
[INFO] Running org.apache.juneau.rest.server.auth.ClaimsPrincipal_Test
[INFO] Tests run: 14, Failures: 0, Errors: 0, Skipped: 0, Time elapsed: 0.181 s -- in org.apache.juneau.rest.server.auth.ClaimsPrincipal_Test
[INFO] Running org.apache.juneau.rest.server.auth.AuthenticatedRequestWrapper_Test
[INFO] Tests run: 9, Failures: 0, Errors: 0, Skipped: 0, Time elapsed: 0.161 s -- in org.apache.juneau.rest.server.auth.AuthenticatedRequestWrapper_Test
[INFO] Running org.apache.juneau.rest.server.MixinResponseProcessorFold_Test
[INFO] Tests run: 3, Failures: 0, Errors: 0, Skipped: 0, Time elapsed: 2.589 s -- in org.apache.juneau.rest.server.MixinResponseProcessorFold_Test
[INFO] Running org.apache.juneau.rest.server.RestContext_CoverageSweep_Test
[INFO] Tests run: 41, Failures: 0, Errors: 0, Skipped: 0, Time elapsed: 11.19 s -- in org.apache.juneau.rest.server.RestContext_CoverageSweep_Test
[INFO] Running org.apache.juneau.rest.server.RestContext_ErrorBodyAndSwagger_Test
[INFO] Tests run: 10, Failures: 0, Errors: 0, Skipped: 0, Time elapsed: 2.732 s -- in org.apache.juneau.rest.server.RestContext_ErrorBodyAndSwagger_Test
[INFO] Running org.apache.juneau.rest.server.servlet.BasicRestResourceGroup_Test
[INFO] Tests run: 12, Failures: 0, Errors: 0, Skipped: 0, Time elapsed: 0.153 s -- in org.apache.juneau.rest.server.servlet.BasicRestResourceGroup_Test
[INFO] Running org.apache.juneau.rest.server.stats.MethodExecStore_Test
[INFO] Tests run: 8, Failures: 0, Errors: 0, Skipped: 0, Time elapsed: 0.185 s -- in org.apache.juneau.rest.server.stats.MethodExecStore_Test
[INFO] Running org.apache.juneau.rest.server.stats.ThrownStore_Test
[INFO] Tests run: 13, Failures: 0, Errors: 0, Skipped: 0, Time elapsed: 0.227 s -- in org.apache.juneau.rest.server.stats.ThrownStore_Test
[INFO] Running org.apache.juneau.rest.server.beans.Hyperlink_Test
[INFO] Tests run: 4, Failures: 0, Errors: 0, Skipped: 0, Time elapsed: 1.459 s -- in org.apache.juneau.rest.server.beans.Hyperlink_Test
[INFO] Running org.apache.juneau.rest.server.sse.SseSubscription_Test
[INFO] Tests run: 8, Failures: 0, Errors: 0, Skipped: 0, Time elapsed: 0.534 s -- in org.apache.juneau.rest.server.sse.SseSubscription_Test
[INFO] Running org.apache.juneau.rest.server.RestContextProperties_Test
[INFO] Tests run: 5, Failures: 0, Errors: 0, Skipped: 0, Time elapsed: 0.032 s -- in org.apache.juneau.rest.server.RestContextProperties_Test
[INFO] Running org.apache.juneau.rest.server.converter.QueryableSettings_Test
[ERROR] Tests run: 14, Failures: 0, Errors: 1, Skipped: 0, Time elapsed: 0.390 s <<< FAILURE! -- in org.apache.juneau.rest.server.converter.QueryableSettings_Test
[ERROR] org.apache.juneau.rest.server.converter.QueryableSettings_Test.a09_default_leavesBuilderDefaultsUntouched -- Time elapsed: 0.135 s <<< ERROR!
org.apache.juneau.commons.beanquery.BeanQuerySyntaxException: Regex search took too long.
at org.apache.juneau.commons.beanquery.RegexBudget$Deadlined.tick(RegexBudget.java:102)
at org.apache.juneau.commons.beanquery.RegexBudget$Deadlined.charAt(RegexBudget.java:112)
at java.base/java.lang.Character.codePointAt(Character.java:8910)
at java.base/java.util.regex.Pattern$CharPropertyGreedy.match(Pattern.java:4273)
at java.base/java.util.regex.Pattern$BmpCharProperty.match(Pattern.java:3955)
at java.base/java.util.regex.Matcher.match(Matcher.java:1755)
at java.base/java.util.regex.Matcher.matches(Matcher.java:712)
at org.apache.juneau.commons.beanquery.RegexBudget.matches(RegexBudget.java:61)
at org.apache.juneau.commons.beanquery.InMemoryMatch.matchLeaf(InMemoryMatch.java:86)
at org.apache.juneau.commons.beanquery.InMemoryMatch.matches(InMemoryMatch.java:55)
at org.apache.juneau.commons.beanquery.FilterEvaluator.matches(FilterEvaluator.java:48)
at org.apache.juneau.commons.beanquery.InMemoryBeanQuerySession.lambda$matched$1(InMemoryBeanQuerySession.java:175)
at java.base/java.util.stream.ReferencePipeline$2$1.accept(ReferencePipeline.java:178)
at java.base/java.util.ArrayList$ArrayListSpliterator.forEachRemaining(ArrayList.java:1625)
at java.base/java.util.stream.AbstractPipeline.copyInto(AbstractPipeline.java:509)
at java.base/java.util.stream.AbstractPipeline.wrapAndCopyInto(AbstractPipeline.java:499)
at java.base/java.util.stream.AbstractPipeline.evaluate(AbstractPipeline.java:575)
at java.base/java.util.stream.AbstractPipeline.evaluateToArrayNode(AbstractPipeline.java:260)
at java.base/java.util.stream.ReferencePipeline.toArray(ReferencePipeline.java:616)
at java.base/java.util.stream.ReferencePipeline.toArray(ReferencePipeline.java:622)
at java.base/java.util.stream.ReferencePipeline.toList(ReferencePipeline.java:627)
at org.apache.juneau.commons.beanquery.InMemoryBeanQuerySession.matched(InMemoryBeanQuerySession.java:175)
at org.apache.juneau.commons.beanquery.InMemoryBeanQuerySession.doFind(InMemoryBeanQuerySession.java:140)
at org.apache.juneau.commons.beanquery.BeanQuerySession.find(BeanQuerySession.java:305)
at org.apache.juneau.rest.server.converter.QueryableSettings_Test.a09_default_leavesBuilderDefaultsUntouched(QueryableSettings_Test.java:116)
[INFO] Running org.apache.juneau.rest.server.assertions.FluentRequestHeaderAssertion_Test
CUSTOM String differed at position 0.
Expect='expected'.
Actual='actual'.
String differed at position 0.
Expect='expected'.
Actual='actual'.
[INFO] Tests run: 5, Failures: 0, Errors: 0, Skipped: 0, Time elapsed: 0.123 s -- in org.apache.juneau.rest.server.assertions.FluentRequestHeaderAssertion_Test
[INFO] Running org.apache.juneau.rest.server.assertions.FluentRequestFormParamAssertion_Test
[INFO] Tests run: 3, Failures: 0, Errors: 0, Skipped: 0, Time elapsed: 0.015 s -- in org.apache.juneau.rest.server.assertions.FluentRequestFormParamAssertion_Test
[INFO] Running org.apache.juneau.rest.server.assertions.FluentRequestQueryParamAssertion_Test
[INFO] Tests run: 3, Failures: 0, Errors: 0, Skipped: 0, Time elapsed: 0.027 s -- in org.apache.juneau.rest.server.assertions.FluentRequestQueryParamAssertion_Test
[INFO] Running org.apache.juneau.rest.server.RestContext_HandleNotFound_Test
[INFO] Tests run: 8, Failures: 0, Errors: 0, Skipped: 0, Time elapsed: 1.760 s -- in org.apache.juneau.rest.server.RestContext_HandleNotFound_Test
[INFO] Running org.apache.juneau.rest.server.DebugMarshalling_AnnotationContract_Test
[INFO] Tests run: 9, Failures: 0, Errors: 0, Skipped: 0, Time elapsed: 0.131 s -- in org.apache.juneau.rest.server.DebugMarshalling_AnnotationContract_Test
[INFO] Running org.apache.juneau.rest.server.RestContext_Test
[INFO] Tests run: 12, Failures: 0, Errors: 0, Skipped: 0, Time elapsed: 0.542 s -- in org.apache.juneau.rest.server.RestContext_Test
[INFO] Running org.apache.juneau.rest.server.observation.Observations_Test
[INFO] Tests run: 19, Failures: 0, Errors: 0, Skipped: 0, Time elapsed: 0.067 s -- in org.apache.juneau.rest.server.observation.Observations_Test
[INFO] Running org.apache.juneau.rest.server.RestOpContext_Test
[INFO] Tests run: 39, Failures: 0, Errors: 0, Skipped: 0, Time elapsed: 2.771 s -- in org.apache.juneau.rest.server.RestOpContext_Test
[INFO] Running org.apache.juneau.rest.server.MethodSafety_Test
[INFO] Tests run: 52, Failures: 0, Errors: 0, Skipped: 0, Time elapsed: 1.611 s -- in org.apache.juneau.rest.server.MethodSafety_Test
[INFO] Running org.apache.juneau.rest.server.httppart.RequestHeader_Test
[INFO] Tests run: 14, Failures: 0, Errors: 0, Skipped: 0, Time elapsed: 0.046 s -- in org.apache.juneau.rest.server.httppart.RequestHeader_Test
[INFO] Running org.apache.juneau.rest.server.httppart.RequestFormParam_Test
[INFO] Tests run: 8, Failures: 0, Errors: 0, Skipped: 0, Time elapsed: 0.013 s -- in org.apache.juneau.rest.server.httppart.RequestFormParam_Test
[INFO] Running org.apache.juneau.rest.server.httppart.RequestFormParamList_Test
[INFO] Tests run: 8, Failures: 0, Errors: 0, Skipped: 0, Time elapsed: 0.130 s -- in org.apache.juneau.rest.server.httppart.RequestFormParamList_Test
[INFO] Running org.apache.juneau.rest.server.httppart.RequestContent_Test
[INFO] Tests run: 7, Failures: 0, Errors: 0, Skipped: 0, Time elapsed: 0.008 s -- in org.apache.juneau.rest.server.httppart.RequestContent_Test
[INFO] Running org.apache.juneau.rest.server.httppart.RequestHeaderList_Test
[INFO] Tests run: 27, Failures: 0, Errors: 0, Skipped: 0, Time elapsed: 0.094 s -- in org.apache.juneau.rest.server.httppart.RequestHeaderList_Test
[INFO] Running org.apache.juneau.rest.server.httppart.RequestHttpPart_Test
[INFO] Tests run: 35, Failures: 0, Errors: 0, Skipped: 0, Time elapsed: 0.046 s -- in org.apache.juneau.rest.server.httppart.RequestHttpPart_Test
[INFO] Running org.apache.juneau.rest.server.httppart.BasicNamedAttribute_Test
[INFO] Tests run: 15, Failures: 0, Errors: 0, Skipped: 0, Time elapsed: 0.015 s -- in org.apache.juneau.rest.server.httppart.BasicNamedAttribute_Test
[INFO] Running org.apache.juneau.rest.server.RestContext_Construction_Test
[INFO] Tests run: 22, Failures: 0, Errors: 0, Skipped: 0, Time elapsed: 0.599 s -- in org.apache.juneau.rest.server.RestContext_Construction_Test
[INFO] Running org.apache.juneau.rest.server.remote.RrpcServlet_Test
[INFO] Tests run: 5, Failures: 0, Errors: 0, Skipped: 0, Time elapsed: 0.131 s -- in org.apache.juneau.rest.server.remote.RrpcServlet_Test
[INFO] Running org.apache.juneau.rest.server.RestContext_NamedBeanMethods_Test
[INFO] Tests run: 18, Failures: 0, Errors: 0, Skipped: 0, Time elapsed: 0.719 s -- in org.apache.juneau.rest.server.RestContext_NamedBeanMethods_Test
[INFO] Running org.apache.juneau.rest.server.RestResponse_Test
[INFO] Tests run: 9, Failures: 0, Errors: 0, Skipped: 0, Time elapsed: 0.012 s -- in org.apache.juneau.rest.server.RestResponse_Test
[INFO] Running org.apache.juneau.rest.server.validation.BeanValidator_Test
[INFO] Tests run: 8, Failures: 0, Errors: 0, Skipped: 0, Time elapsed: 0.964 s -- in org.apache.juneau.rest.server.validation.BeanValidator_Test
[INFO] Running org.apache.juneau.rest.server.RestContext_ChildBeanInheritance_Test
[INFO] Tests run: 8, Failures: 0, Errors: 0, Skipped: 0, Time elapsed: 0.791 s -- in org.apache.juneau.rest.server.RestContext_ChildBeanInheritance_Test
[INFO] Running org.apache.juneau.utils.MethodInvokerTest
[INFO] Tests run: 4, Failures: 0, Errors: 0, Skipped: 0, Time elapsed: 0.011 s -- in org.apache.juneau.utils.MethodInvokerTest
[INFO] Running org.apache.juneau.mstat.MethodExecStore_Test
[INFO] Tests run: 8, Failures: 0, Errors: 0, Skipped: 0, Time elapsed: 0.015 s -- in org.apache.juneau.mstat.MethodExecStore_Test
[INFO] Running org.apache.juneau.mstat.ThrownStore_Test
[INFO] Tests run: 13, Failures: 0, Errors: 0, Skipped: 0, Time elapsed: 0.030 s -- in org.apache.juneau.mstat.ThrownStore_Test
[INFO]
[INFO] Results:
[INFO]
[ERROR] Errors:
[ERROR] QueryableSettings_Test.a09_default_leavesBuilderDefaultsUntouched:116 » BeanQuerySyntax Regex search took too long.
[INFO]
[ERROR] Tests run: 1463, Failures: 0, Errors: 1, Skipped: 0
[INFO]
[INFO]
[INFO] ------------------------------------------------------------------------
[INFO] Skipping Apache Juneau
[INFO] This project has been banned from the build due to previous failures.
[INFO] ------------------------------------------------------------------------
[INFO] ------------------------------------------------------------------------
[INFO] Reactor Summary for Apache Juneau 10.0.0-SNAPSHOT:
[INFO]
[INFO] Apache Juneau ...................................... SUCCESS [ 50.660 s]
[INFO] Apache Juneau Bill of Materials .................... SUCCESS [ 4.614 s]
[INFO] Apache Juneau Core ................................. SUCCESS [ 8.449 s]
[INFO] Apache Juneau Commons .............................. SUCCESS [02:16 min]
[INFO] Apache Juneau Test Utilities ....................... SUCCESS [ 6.608 s]
[INFO] Apache Juneau Testing Toolkit ...................... SUCCESS [ 32.471 s]
[INFO] Apache Juneau Marshall ............................. SUCCESS [05:05 min]
[INFO] Apache Juneau Beans ................................ SUCCESS [ 5.012 s]
[INFO] Apache Juneau RFC 7807 Beans ....................... SUCCESS [ 13.311 s]
[INFO] Apache Juneau Marshall Test Utilities .............. SUCCESS [ 10.803 s]
[INFO] Apache Juneau REST ................................. SUCCESS [ 10.806 s]
[INFO] Apache Juneau REST Common .......................... SUCCESS [ 38.904 s]
[INFO] Apache Juneau Config ............................... SUCCESS [ 26.850 s]
[INFO] Apache Juneau Common Beans ......................... SUCCESS [ 18.569 s]
[INFO] Apache Juneau HTML5 Beans .......................... SUCCESS [01:07 min]
[INFO] Apache Juneau JSON Schema Beans .................... SUCCESS [ 20.991 s]
[INFO] Apache Juneau Swagger 2.0 Beans .................... SUCCESS [ 25.363 s]
[INFO] Apache Juneau OpenAPI 3.0 Beans .................... SUCCESS [ 31.663 s]
[INFO] Apache Juneau REST Server .......................... FAILURE [03:08 min]
[INFO] Apache Juneau REST Client .......................... SKIPPED
[INFO] Apache Juneau REST Common (Classic) ................ SKIPPED
[INFO] Apache Juneau REST Client (Classic) ................ SKIPPED
[INFO] Apache Juneau REST Mock ............................ SKIPPED
[INFO] Apache Juneau Microservices ........................ SKIPPED
[INFO] Apache Juneau Microservice ......................... SKIPPED
[INFO] Apache Juneau REST Server Message Bus .............. SKIPPED
[INFO] Apache Juneau REST Server Bus WebSocket ............ SKIPPED
[INFO] Apache Juneau Microservice Jetty ................... SKIPPED
[INFO] Apache Juneau Dependency Bundles ................... SKIPPED
[INFO] Apache Juneau Jetty Microservice Bundle ............ SKIPPED
[INFO] Apache Juneau Microservice Tomcat .................. SKIPPED
[INFO] Apache Juneau Tomcat Microservice Bundle ........... SKIPPED
[INFO] Apache Juneau REST Server Spring Boot .............. SKIPPED
[INFO] Apache Juneau Spring Boot Bundle ................... SKIPPED
[INFO] Apache Juneau REST Server Micrometer ............... SKIPPED
[INFO] Apache Juneau REST Server OpenTelemetry ............ SKIPPED
[INFO] Apache Juneau OTLP Observability Bundle ............ SKIPPED
[INFO] Apache Juneau BeanQuery SQL ........................ SKIPPED
[INFO] Apache Juneau BeanQuery Postgres ................... SKIPPED
[INFO] juneau/core/marshall-rdf ........................... SKIPPED
[INFO] Apache Juneau REST Server RDF ...................... SKIPPED
[INFO] Apache Juneau JSON-RPC Beans ....................... SKIPPED
[INFO] Apache Juneau REST Server MCP ...................... SKIPPED
[INFO] Apache Juneau MCP Beans (2025-06-18) ............... SKIPPED
[INFO] Apache Juneau REST Server MCP (2025-06-18) ......... SKIPPED
[INFO] Apache Juneau MCP Beans (2026-07-28) ............... SKIPPED
[INFO] Apache Juneau REST Server Reactive Streams Core .... SKIPPED
[INFO] Apache Juneau REST Auth OAuth Flow ................. SKIPPED
[INFO] Apache Juneau REST Server JWT ...................... SKIPPED
[INFO] Apache Juneau REST Server OAuth .................... SKIPPED
[INFO] Apache Juneau REST Server MCP (2026-07-28) ......... SKIPPED
[INFO] Apache Juneau REST Server SAML ..................... SKIPPED
[INFO] Apache Juneau REST Server OIDC Relying Party ....... SKIPPED
[INFO] Apache Juneau REST Server Logging Backends ......... SKIPPED
[INFO] Apache Juneau REST Server DataTables ............... SKIPPED
[INFO] Apache Juneau Run Report ........................... SKIPPED
[INFO] Apache Juneau REST Server Widgets .................. SKIPPED
[INFO] Apache Juneau REST Server Console UI ............... SKIPPED
[INFO] Apache Juneau REST Server Views .................... SKIPPED
[INFO] Apache Juneau REST Server Views Markdown ........... SKIPPED
[INFO] Apache Juneau REST Server Terminal ................. SKIPPED
[INFO] Apache Juneau REST Server View — FreeMarker ........ SKIPPED
[INFO] Apache Juneau REST Server Console UI — FreeMarker .. SKIPPED
[INFO] Apache Juneau REST Server Terminal Bus ............. SKIPPED
[INFO] Apache Juneau REST Server Reactive Streams ......... SKIPPED
[INFO] Apache Juneau REST Server View — JSP ............... SKIPPED
[INFO] Apache Juneau REST Server View — Thymeleaf ......... SKIPPED
[INFO] Apache Juneau REST Server View — Mustache .......... SKIPPED
[INFO] Apache Juneau REST Client MCP ...................... SKIPPED
[INFO] Apache Juneau REST Client MCP (2025-06-18) ......... SKIPPED
[INFO] Apache Juneau REST Client MCP (2026-07-28) ......... SKIPPED
[INFO] Apache Juneau REST Client MCP Auth ................. SKIPPED
[INFO] Apache Juneau NG REST Client — Apache HttpClient 4.5 Transport SKIPPED
[INFO] Apache Juneau NG REST Client — Apache HttpClient 5.x Transport SKIPPED
[INFO] Apache Juneau NG REST Client — OkHttp Transport .... SKIPPED
[INFO] Apache Juneau NG REST Client — Jetty HttpClient Transport SKIPPED
[INFO] Apache Juneau Microservice Test Support ............ SKIPPED
[INFO] Apache Juneau Microservice Examples ................ SKIPPED
[INFO] Apache Juneau Server Config ........................ SKIPPED
[INFO] Apache Juneau Server Config Server ................. SKIPPED
[INFO] Apache Juneau Secret Store - macOS Keychain ........ SKIPPED
[INFO] Apache Juneau Run Wrapper .......................... SKIPPED
[INFO] Apache Juneau Atom Beans ........................... SKIPPED
[INFO] Apache Juneau Examples ............................. SKIPPED
[INFO] Apache Juneau Core Examples ........................ SKIPPED
[INFO] Apache Juneau MCP Examples ......................... SKIPPED
[INFO] Apache Juneau Petstore ............................. SKIPPED
[INFO] Apache Juneau Petstore Core ........................ SKIPPED
[INFO] Apache Juneau Petstore Jetty ....................... SKIPPED
[INFO] Apache Juneau Petstore Spring Boot ................. SKIPPED
[INFO] Apache Juneau HAL Beans ............................ SKIPPED
[INFO] Apache Juneau JSON:API Beans ....................... SKIPPED
[INFO] Apache Juneau JSON Patch Beans ..................... SKIPPED
[INFO] Apache Juneau Integration Tests .................... SKIPPED
[INFO] Apache Juneau Shaded Artifacts ..................... SKIPPED
[INFO] Apache Juneau Core (Shaded) ........................ SKIPPED
[INFO] Apache Juneau REST Client (Shaded) ................. SKIPPED
[INFO] Apache Juneau REST Server (Shaded) ................. SKIPPED
[INFO] Apache Juneau REST Server Spring Boot (Shaded) ..... SKIPPED
[INFO] Apache Juneau All (Shaded) ......................... SKIPPED
[INFO] Apache Juneau Distribution ......................... SKIPPED
[INFO] ------------------------------------------------------------------------
[INFO] BUILD FAILURE
[INFO] ------------------------------------------------------------------------
[INFO] Total time: 16:46 min
[INFO] Finished at: 2026-10-19T00:37:05Z
[INFO] ------------------------------------------------------------------------
[ERROR] Failed to execute goal org.apache.maven.plugins:maven-surefire-plugin:3.5.4:test (default-test) on project juneau-rest-server:
[ERROR]
[ERROR] See <https://ci-builds.apache.org/job/Juneau/job/Juneau-Java-17/ws/juneau-rest/juneau-rest-server/target/surefire-reports> for the individual test results.
[ERROR] See dump files (if any exist) [date].dump, [date]-jvmRun[N].dump and [date].dumpstream.
[ERROR] -> [Help 1]
[ERROR]
[ERROR] To see the full stack trace of the errors, re-run Maven with the -e switch.
[ERROR] Re-run Maven using the -X switch to enable full debug logging.
[ERROR]
[ERROR] For more information about the errors and possible solutions, please read the following articles:
[ERROR] [Help 1] http://cwiki.apache.org/confluence/display/MAVEN/MojoFailureException
[ERROR]
[ERROR] After correcting the problems, you can resume the build with the command
[ERROR] mvn <args> -rf :juneau-rest-server
Build step 'Invoke top-level Maven targets' marked build as failure
Recording test results
[Checks API] No suitable checks publisher found.
Jenkins build is back to normal : Juneau » Juneau-Java-17 #2763
Posted by Apache Jenkins Server <je...@builds.apache.org>.
See <https://ci-builds.apache.org/job/Juneau/job/Juneau-Java-17/2763/display/redirect?page=changes>