You are viewing a plain text version of this content. The canonical link for it is here.
Posted to commits@beam.apache.org by Apache Jenkins Server <je...@builds.apache.org> on 2018/09/20 00:11:39 UTC
Build failed in Jenkins: beam_PerformanceTests_XmlIOIT #775
See <https://builds.apache.org/job/beam_PerformanceTests_XmlIOIT/775/display/redirect?page=changes>
Changes:
[daniel.o.programmer] [BEAM-4780] Updating to DockerJobBundleFactory in ReferenceRunner.
[amaliujia] create external table
[amaliujia] change CREATE TABLE to CREATE EXTERNAL TABLE in tests.
[amaliujia] throw ParseException to remind using create external table when input
[schroederc] [BEAM-5382] Add fallback for non-binary MergeAccumulatorsFn
[schroederc] Add test for bare nonBinaryMergeFn
------------------------------------------
[...truncated 215.08 KB...]
:beam-runners-core-java:classes (Thread[Task worker for ':' Thread 8,5,main]) completed. Took 0.001 secs.
:beam-runners-core-java:shadowJar (Thread[Task worker for ':' Thread 8,5,main]) started.
> Task :beam-runners-google-cloud-dataflow-java:compileJava UP-TO-DATE
Build cache key for task ':beam-runners-google-cloud-dataflow-java:compileJava' is f6428f8ba0d9d8bd440e4b7620acc948
Skipping task ':beam-runners-google-cloud-dataflow-java:compileJava' as it is up-to-date.
:beam-runners-google-cloud-dataflow-java:compileJava (Thread[Task worker for ':' Thread 3,5,main]) completed. Took 0.507 secs.
:beam-runners-google-cloud-dataflow-java:classes (Thread[Task worker for ':' Thread 3,5,main]) started.
> Task :beam-runners-google-cloud-dataflow-java:classes UP-TO-DATE
Skipping task ':beam-runners-google-cloud-dataflow-java:classes' as it has no actions.
:beam-runners-google-cloud-dataflow-java:classes (Thread[Task worker for ':' Thread 3,5,main]) completed. Took 0.0 secs.
:beam-runners-google-cloud-dataflow-java:shadowJar (Thread[Task worker for ':' Thread 3,5,main]) started.
> Task :beam-runners-core-java:shadowJar
Build cache key for task ':beam-runners-core-java:shadowJar' is fa57f4c14d72ca0e289968695e3171b2
Caching disabled for task ':beam-runners-core-java:shadowJar': Caching has not been enabled for the task
Task ':beam-runners-core-java:shadowJar' is not up-to-date because:
Input property 'configurations' file <https://builds.apache.org/job/beam_PerformanceTests_XmlIOIT/ws/src/runners/core-construction-java/build/libs/beam-runners-core-construction-java-2.8.0-SNAPSHOT.jar> has changed.
Input property 'configurations' file <https://builds.apache.org/job/beam_PerformanceTests_XmlIOIT/ws/src/model/fn-execution/build/libs/beam-model-fn-execution-2.8.0-SNAPSHOT.jar> has changed.
Input property 'configurations' file <https://builds.apache.org/job/beam_PerformanceTests_XmlIOIT/ws/src/model/job-management/build/libs/beam-model-job-management-2.8.0-SNAPSHOT.jar> has changed.
*******************
GRADLE SHADOW STATS
Total Jars: 2 (includes project)
Total Time: 2.215s [2215ms]
Average Time/Jar: 1.1075s [1107.5ms]
*******************
:beam-runners-core-java:shadowJar (Thread[Task worker for ':' Thread 8,5,main]) completed. Took 2.622 secs.
:beam-sdks-java-harness:compileJava (Thread[Task worker for ':' Thread 8,5,main]) started.
> Task :beam-runners-google-cloud-dataflow-java:shadowJar
Build cache key for task ':beam-runners-google-cloud-dataflow-java:shadowJar' is a014a97303188636efb1f64dd5e3584e
Caching disabled for task ':beam-runners-google-cloud-dataflow-java:shadowJar': Caching has not been enabled for the task
Task ':beam-runners-google-cloud-dataflow-java:shadowJar' is not up-to-date because:
Input property 'configurations' file <https://builds.apache.org/job/beam_PerformanceTests_XmlIOIT/ws/src/runners/core-construction-java/build/libs/beam-runners-core-construction-java-2.8.0-SNAPSHOT.jar> has changed.
Input property 'configurations' file <https://builds.apache.org/job/beam_PerformanceTests_XmlIOIT/ws/src/model/job-management/build/libs/beam-model-job-management-2.8.0-SNAPSHOT.jar> has changed.
*******************
GRADLE SHADOW STATS
Total Jars: 2 (includes project)
Total Time: 2.165s [2165ms]
Average Time/Jar: 1.0825s [1082.5ms]
*******************
:beam-runners-google-cloud-dataflow-java:shadowJar (Thread[Task worker for ':' Thread 3,5,main]) completed. Took 2.638 secs.
> Task :beam-sdks-java-harness:compileJava UP-TO-DATE
Build cache key for task ':beam-sdks-java-harness:compileJava' is dcb589ec1cf131fb0f22640b0fe9a60e
Skipping task ':beam-sdks-java-harness:compileJava' as it is up-to-date.
:beam-sdks-java-harness:compileJava (Thread[Task worker for ':' Thread 8,5,main]) completed. Took 0.617 secs.
:beam-sdks-java-harness:classes (Thread[Task worker for ':' Thread 8,5,main]) started.
> Task :beam-sdks-java-harness:classes UP-TO-DATE
Skipping task ':beam-sdks-java-harness:classes' as it has no actions.
:beam-sdks-java-harness:classes (Thread[Task worker for ':' Thread 8,5,main]) completed. Took 0.0 secs.
:beam-sdks-java-harness:jar (Thread[Task worker for ':' Thread 11,5,main]) started.
> Task :beam-sdks-java-harness:jar UP-TO-DATE
Build cache key for task ':beam-sdks-java-harness:jar' is 4a07dfcfa99b023191a684da42957e62
Caching disabled for task ':beam-sdks-java-harness:jar': Caching has not been enabled for the task
Skipping task ':beam-sdks-java-harness:jar' as it is up-to-date.
:beam-sdks-java-harness:jar (Thread[Task worker for ':' Thread 11,5,main]) completed. Took 0.003 secs.
:beam-sdks-java-harness:shadowJar (Thread[Task worker for ':' Thread 11,5,main]) started.
> Task :beam-sdks-java-harness:shadowJar
Build cache key for task ':beam-sdks-java-harness:shadowJar' is 0447c98f0a409a7effac441db1bc6a0f
Caching disabled for task ':beam-sdks-java-harness:shadowJar': Caching has not been enabled for the task
Task ':beam-sdks-java-harness:shadowJar' is not up-to-date because:
Input property 'configurations' file <https://builds.apache.org/job/beam_PerformanceTests_XmlIOIT/ws/src/sdks/java/fn-execution/build/libs/beam-sdks-java-fn-execution-2.8.0-SNAPSHOT.jar> has changed.
Input property 'configurations' file <https://builds.apache.org/job/beam_PerformanceTests_XmlIOIT/ws/src/runners/core-java/build/libs/beam-runners-core-java-2.8.0-SNAPSHOT.jar> has changed.
Input property 'configurations' file <https://builds.apache.org/job/beam_PerformanceTests_XmlIOIT/ws/src/runners/core-construction-java/build/libs/beam-runners-core-construction-java-2.8.0-SNAPSHOT.jar> has changed.
*******************
GRADLE SHADOW STATS
Total Jars: 43 (includes project)
Total Time: 36.151s [36151ms]
Average Time/Jar: 0.8407209302326001s [840.7209302326ms]
*******************
:beam-sdks-java-harness:shadowJar (Thread[Task worker for ':' Thread 11,5,main]) completed. Took 36.662 secs.
:beam-runners-java-fn-execution:compileJava (Thread[Task worker for ':' Thread 11,5,main]) started.
> Task :beam-runners-java-fn-execution:compileJava UP-TO-DATE
Build cache key for task ':beam-runners-java-fn-execution:compileJava' is 56a36fe62e4183e36adcb1cb4f6aefe8
Skipping task ':beam-runners-java-fn-execution:compileJava' as it is up-to-date.
:beam-runners-java-fn-execution:compileJava (Thread[Task worker for ':' Thread 11,5,main]) completed. Took 4.901 secs.
:beam-runners-java-fn-execution:classes (Thread[Task worker for ':' Thread 11,5,main]) started.
> Task :beam-runners-java-fn-execution:classes UP-TO-DATE
Skipping task ':beam-runners-java-fn-execution:classes' as it has no actions.
:beam-runners-java-fn-execution:classes (Thread[Task worker for ':' Thread 11,5,main]) completed. Took 0.0 secs.
:beam-runners-java-fn-execution:shadowJar (Thread[Task worker for ':' Thread 11,5,main]) started.
> Task :beam-runners-java-fn-execution:shadowJar
Build cache key for task ':beam-runners-java-fn-execution:shadowJar' is e9467af522f6b2555087df5bff9fb9aa
Caching disabled for task ':beam-runners-java-fn-execution:shadowJar': Caching has not been enabled for the task
Task ':beam-runners-java-fn-execution:shadowJar' is not up-to-date because:
Input property 'configurations' file <https://builds.apache.org/job/beam_PerformanceTests_XmlIOIT/ws/src/runners/core-construction-java/build/libs/beam-runners-core-construction-java-2.8.0-SNAPSHOT.jar> has changed.
Input property 'configurations' file <https://builds.apache.org/job/beam_PerformanceTests_XmlIOIT/ws/src/sdks/java/fn-execution/build/libs/beam-sdks-java-fn-execution-2.8.0-SNAPSHOT.jar> has changed.
Input property 'configurations' file <https://builds.apache.org/job/beam_PerformanceTests_XmlIOIT/ws/src/model/fn-execution/build/libs/beam-model-fn-execution-2.8.0-SNAPSHOT.jar> has changed.
*******************
GRADLE SHADOW STATS
Total Jars: 2 (includes project)
Total Time: 2.975s [2975ms]
Average Time/Jar: 1.4875s [1487.5ms]
*******************
:beam-runners-java-fn-execution:shadowJar (Thread[Task worker for ':' Thread 11,5,main]) completed. Took 3.187 secs.
:beam-runners-direct-java:compileJava (Thread[Task worker for ':' Thread 11,5,main]) started.
> Task :beam-runners-direct-java:compileJava
Build cache key for task ':beam-runners-direct-java:compileJava' is c5b435c86260838d24757f62f2bd3d82
Task ':beam-runners-direct-java:compileJava' is not up-to-date because:
Task has failed previously.
Custom actions are attached to task ':beam-runners-direct-java:compileJava'.
All input files are considered out-of-date for incremental task ':beam-runners-direct-java:compileJava'.
Compiling with error-prone compiler
> Task :beam-runners-direct-java:compileJava FAILED
:beam-runners-direct-java:compileJava (Thread[Task worker for ':' Thread 11,5,main]) completed. Took 7.866 secs.
Deprecated Gradle features were used in this build, making it incompatible with Gradle 5.0.
See https://docs.gradle.org/4.8/userguide/command_line_interface.html#sec:command_line_warnings
61 actionable tasks: 11 executed, 50 up-to-date
Publishing build scan...
https://gradle.com/s/is7ejpqyph2mu
STDERR: <https://builds.apache.org/job/beam_PerformanceTests_XmlIOIT/ws/src/runners/direct-java/src/main/java/org/apache/beam/runners/direct/portable/ReferenceRunner.java>:268: error: cannot find symbol
return DockerJobBundleFactory.create(jobInfo);
^
symbol: method create(JobInfo)
location: class DockerJobBundleFactory
Note: Some input files use or override a deprecated API.
Note: Recompile with -Xlint:deprecation for details.
Note: Some input files use unchecked or unsafe operations.
Note: Recompile with -Xlint:unchecked for details.
1 error
FAILURE: Build failed with an exception.
* What went wrong:
Execution failed for task ':beam-runners-direct-java:compileJava'.
> Compilation failed with exit code 1; see the compiler error output for details.
* Try:
Run with --debug option to get more log output. Run with --scan to get full insights.
* Exception is:
org.gradle.api.tasks.TaskExecutionException: Execution failed for task ':beam-runners-direct-java:compileJava'.
at org.gradle.api.internal.tasks.execution.ExecuteActionsTaskExecuter.executeActions(ExecuteActionsTaskExecuter.java:110)
at org.gradle.api.internal.tasks.execution.ExecuteActionsTaskExecuter.execute(ExecuteActionsTaskExecuter.java:77)
at org.gradle.api.internal.tasks.execution.OutputDirectoryCreatingTaskExecuter.execute(OutputDirectoryCreatingTaskExecuter.java:51)
at org.gradle.api.internal.tasks.execution.SkipCachedTaskExecuter.execute(SkipCachedTaskExecuter.java:105)
at org.gradle.api.internal.tasks.execution.SkipUpToDateTaskExecuter.execute(SkipUpToDateTaskExecuter.java:59)
at org.gradle.api.internal.tasks.execution.ResolveTaskOutputCachingStateExecuter.execute(ResolveTaskOutputCachingStateExecuter.java:54)
at org.gradle.api.internal.tasks.execution.ResolveBuildCacheKeyExecuter.execute(ResolveBuildCacheKeyExecuter.java:66)
at org.gradle.api.internal.tasks.execution.ValidatingTaskExecuter.execute(ValidatingTaskExecuter.java:59)
at org.gradle.api.internal.tasks.execution.SkipEmptySourceFilesTaskExecuter.execute(SkipEmptySourceFilesTaskExecuter.java:101)
at org.gradle.api.internal.tasks.execution.FinalizeInputFilePropertiesTaskExecuter.execute(FinalizeInputFilePropertiesTaskExecuter.java:44)
at org.gradle.api.internal.tasks.execution.CleanupStaleOutputsExecuter.execute(CleanupStaleOutputsExecuter.java:91)
at org.gradle.api.internal.tasks.execution.ResolveTaskArtifactStateTaskExecuter.execute(ResolveTaskArtifactStateTaskExecuter.java:62)
at org.gradle.api.internal.tasks.execution.SkipTaskWithNoActionsExecuter.execute(SkipTaskWithNoActionsExecuter.java:59)
at org.gradle.api.internal.tasks.execution.SkipOnlyIfTaskExecuter.execute(SkipOnlyIfTaskExecuter.java:54)
at org.gradle.api.internal.tasks.execution.ExecuteAtMostOnceTaskExecuter.execute(ExecuteAtMostOnceTaskExecuter.java:43)
at org.gradle.api.internal.tasks.execution.CatchExceptionTaskExecuter.execute(CatchExceptionTaskExecuter.java:34)
at org.gradle.api.internal.tasks.execution.EventFiringTaskExecuter$1.run(EventFiringTaskExecuter.java:51)
at org.gradle.internal.operations.DefaultBuildOperationExecutor$RunnableBuildOperationWorker.execute(DefaultBuildOperationExecutor.java:317)
at org.gradle.internal.operations.DefaultBuildOperationExecutor$RunnableBuildOperationWorker.execute(DefaultBuildOperationExecutor.java:309)
at org.gradle.internal.operations.DefaultBuildOperationExecutor.execute(DefaultBuildOperationExecutor.java:185)
at org.gradle.internal.operations.DefaultBuildOperationExecutor.run(DefaultBuildOperationExecutor.java:97)
at org.gradle.internal.operations.DelegatingBuildOperationExecutor.run(DelegatingBuildOperationExecutor.java:31)
at org.gradle.api.internal.tasks.execution.EventFiringTaskExecuter.execute(EventFiringTaskExecuter.java:46)
at org.gradle.execution.taskgraph.DefaultTaskExecutionGraph$ExecuteTaskAction.execute(DefaultTaskExecutionGraph.java:262)
at org.gradle.execution.taskgraph.DefaultTaskExecutionGraph$ExecuteTaskAction.execute(DefaultTaskExecutionGraph.java:246)
at org.gradle.execution.taskgraph.DefaultTaskPlanExecutor$TaskExecutorWorker$1.execute(DefaultTaskPlanExecutor.java:136)
at org.gradle.execution.taskgraph.DefaultTaskPlanExecutor$TaskExecutorWorker$1.execute(DefaultTaskPlanExecutor.java:130)
at org.gradle.execution.taskgraph.DefaultTaskPlanExecutor$TaskExecutorWorker.execute(DefaultTaskPlanExecutor.java:201)
at org.gradle.execution.taskgraph.DefaultTaskPlanExecutor$TaskExecutorWorker.executeWithTask(DefaultTaskPlanExecutor.java:192)
at org.gradle.execution.taskgraph.DefaultTaskPlanExecutor$TaskExecutorWorker.run(DefaultTaskPlanExecutor.java:130)
at org.gradle.internal.concurrent.ExecutorPolicy$CatchAndRecordFailures.onExecute(ExecutorPolicy.java:63)
at org.gradle.internal.concurrent.ManagedExecutorImpl$1.run(ManagedExecutorImpl.java:46)
at org.gradle.internal.concurrent.ThreadFactoryImpl$ManagedThreadRunnable.run(ThreadFactoryImpl.java:55)
Caused by: org.gradle.api.internal.tasks.compile.CompilationFailedException: Compilation failed with exit code 1; see the compiler error output for details.
at net.ltgt.gradle.errorprone.ErrorProneCompiler.execute(ErrorProneCompiler.java:74)
at net.ltgt.gradle.errorprone.ErrorProneCompiler.execute(ErrorProneCompiler.java:23)
at org.gradle.api.internal.tasks.compile.NormalizingJavaCompiler.delegateAndHandleErrors(NormalizingJavaCompiler.java:86)
at org.gradle.api.internal.tasks.compile.NormalizingJavaCompiler.execute(NormalizingJavaCompiler.java:47)
at org.gradle.api.internal.tasks.compile.NormalizingJavaCompiler.execute(NormalizingJavaCompiler.java:33)
at org.gradle.api.internal.tasks.compile.CleaningJavaCompilerSupport.execute(CleaningJavaCompilerSupport.java:40)
at org.gradle.api.internal.tasks.compile.CleaningJavaCompilerSupport.execute(CleaningJavaCompilerSupport.java:27)
at org.gradle.api.tasks.compile.JavaCompile.performCompilation(JavaCompile.java:161)
at org.gradle.api.tasks.compile.JavaCompile.compile(JavaCompile.java:146)
at org.gradle.api.tasks.compile.JavaCompile.compile(JavaCompile.java:118)
at org.gradle.internal.reflect.JavaMethod.invoke(JavaMethod.java:73)
at org.gradle.api.internal.project.taskfactory.IncrementalTaskAction.doExecute(IncrementalTaskAction.java:50)
at org.gradle.api.internal.project.taskfactory.StandardTaskAction.execute(StandardTaskAction.java:39)
at org.gradle.api.internal.project.taskfactory.StandardTaskAction.execute(StandardTaskAction.java:26)
at org.gradle.api.internal.tasks.execution.ExecuteActionsTaskExecuter$1.run(ExecuteActionsTaskExecuter.java:131)
at org.gradle.internal.operations.DefaultBuildOperationExecutor$RunnableBuildOperationWorker.execute(DefaultBuildOperationExecutor.java:317)
at org.gradle.internal.operations.DefaultBuildOperationExecutor$RunnableBuildOperationWorker.execute(DefaultBuildOperationExecutor.java:309)
at org.gradle.internal.operations.DefaultBuildOperationExecutor.execute(DefaultBuildOperationExecutor.java:185)
at org.gradle.internal.operations.DefaultBuildOperationExecutor.run(DefaultBuildOperationExecutor.java:97)
at org.gradle.internal.operations.DelegatingBuildOperationExecutor.run(DelegatingBuildOperationExecutor.java:31)
at org.gradle.api.internal.tasks.execution.ExecuteActionsTaskExecuter.executeAction(ExecuteActionsTaskExecuter.java:120)
at org.gradle.api.internal.tasks.execution.ExecuteActionsTaskExecuter.executeActions(ExecuteActionsTaskExecuter.java:99)
... 32 more
* Get more help at https://help.gradle.org
BUILD FAILED in 1m 32s
2018-09-20 00:11:38,665 a614c248 MainThread beam_integration_benchmark(1/1) ERROR Error during benchmark beam_integration_benchmark
Traceback (most recent call last):
File "<https://builds.apache.org/job/beam_PerformanceTests_XmlIOIT/ws/PerfKitBenchmarker/perfkitbenchmarker/pkb.py",> line 695, in RunBenchmark
DoRunPhase(spec, collector, detailed_timer)
File "<https://builds.apache.org/job/beam_PerformanceTests_XmlIOIT/ws/PerfKitBenchmarker/perfkitbenchmarker/pkb.py",> line 575, in DoRunPhase
samples = spec.BenchmarkRun(spec)
File "<https://builds.apache.org/job/beam_PerformanceTests_XmlIOIT/ws/PerfKitBenchmarker/perfkitbenchmarker/linux_benchmarks/beam_integration_benchmark.py",> line 160, in Run
job_type=job_type)
File "<https://builds.apache.org/job/beam_PerformanceTests_XmlIOIT/ws/PerfKitBenchmarker/perfkitbenchmarker/providers/gcp/gcp_dpb_dataflow.py",> line 90, in SubmitJob
assert retcode == 0, "Integration Test Failed."
AssertionError: Integration Test Failed.
2018-09-20 00:11:38,666 a614c248 MainThread beam_integration_benchmark(1/1) INFO Cleaning up benchmark beam_integration_benchmark
2018-09-20 00:11:38,667 a614c248 MainThread beam_integration_benchmark(1/1) ERROR Exception running benchmark
Traceback (most recent call last):
File "<https://builds.apache.org/job/beam_PerformanceTests_XmlIOIT/ws/PerfKitBenchmarker/perfkitbenchmarker/pkb.py",> line 832, in RunBenchmarkTask
RunBenchmark(spec, collector)
File "<https://builds.apache.org/job/beam_PerformanceTests_XmlIOIT/ws/PerfKitBenchmarker/perfkitbenchmarker/pkb.py",> line 695, in RunBenchmark
DoRunPhase(spec, collector, detailed_timer)
File "<https://builds.apache.org/job/beam_PerformanceTests_XmlIOIT/ws/PerfKitBenchmarker/perfkitbenchmarker/pkb.py",> line 575, in DoRunPhase
samples = spec.BenchmarkRun(spec)
File "<https://builds.apache.org/job/beam_PerformanceTests_XmlIOIT/ws/PerfKitBenchmarker/perfkitbenchmarker/linux_benchmarks/beam_integration_benchmark.py",> line 160, in Run
job_type=job_type)
File "<https://builds.apache.org/job/beam_PerformanceTests_XmlIOIT/ws/PerfKitBenchmarker/perfkitbenchmarker/providers/gcp/gcp_dpb_dataflow.py",> line 90, in SubmitJob
assert retcode == 0, "Integration Test Failed."
AssertionError: Integration Test Failed.
2018-09-20 00:11:38,668 a614c248 MainThread beam_integration_benchmark(1/1) ERROR Benchmark 1/1 beam_integration_benchmark (UID: beam_integration_benchmark0) failed. Execution will continue.
2018-09-20 00:11:38,685 a614c248 MainThread INFO Benchmark run statuses:
---------------------------------------------------------------------------------
Name UID Status Failed Substatus
---------------------------------------------------------------------------------
beam_integration_benchmark beam_integration_benchmark0 FAILED
---------------------------------------------------------------------------------
Success rate: 0.00% (0/1)
2018-09-20 00:11:38,686 a614c248 MainThread INFO Complete logs can be found at: <https://builds.apache.org/job/beam_PerformanceTests_XmlIOIT/ws/runs/a614c248/pkb.log>
2018-09-20 00:11:38,686 a614c248 MainThread INFO Completion statuses can be found at: <https://builds.apache.org/job/beam_PerformanceTests_XmlIOIT/ws/runs/a614c248/completion_statuses.json>
Build step 'Execute shell' marked build as failure
Jenkins build is back to normal : beam_PerformanceTests_XmlIOIT
#776
Posted by Apache Jenkins Server <je...@builds.apache.org>.
See <https://builds.apache.org/job/beam_PerformanceTests_XmlIOIT/776/display/redirect?page=changes>