You are viewing a plain text version of this content. The canonical link for it is here.
Posted to builds@beam.apache.org by Apache Jenkins Server <je...@builds.apache.org> on 2022/09/26 20:01:50 UTC

Build failed in Jenkins: beam_LoadTests_Python_Combine_Dataflow_Streaming #763

See <https://ci-beam.apache.org/job/beam_LoadTests_Python_Combine_Dataflow_Streaming/763/display/redirect?page=changes>

Changes:

[noreply] Bump Java FnApi Container version to beam-master-20220923 (#23352)

[noreply] Bump org.nosphere.apache.rat from 0.7.0 to 0.8.0 (#23330)


------------------------------------------
[...truncated 22.95 KB...]
Collecting google-cloud-datastore<2,>=1.8.0
  Using cached google_cloud_datastore-1.15.5-py2.py3-none-any.whl (134 kB)
Collecting google-cloud-pubsub<3,>=2.1.0
  Using cached google_cloud_pubsub-2.13.7-py2.py3-none-any.whl (236 kB)
Collecting google-cloud-pubsublite<2,>=1.2.0
  Using cached google_cloud_pubsublite-1.5.0-py2.py3-none-any.whl (270 kB)
Collecting google-cloud-bigquery<4,>=1.6.0
  Using cached google_cloud_bigquery-3.3.2-py2.py3-none-any.whl (211 kB)
Collecting google-cloud-bigquery-storage<2.14,>=2.6.3
  Using cached google_cloud_bigquery_storage-2.13.2-py2.py3-none-any.whl (180 kB)
Collecting google-cloud-core<3,>=0.28.1
  Using cached google_cloud_core-2.3.2-py2.py3-none-any.whl (29 kB)
Collecting google-cloud-bigtable<2,>=0.31.1
  Using cached google_cloud_bigtable-1.7.2-py2.py3-none-any.whl (267 kB)
Collecting google-cloud-spanner<2,>=1.13.0
  Using cached google_cloud_spanner-1.19.3-py2.py3-none-any.whl (255 kB)
Collecting grpcio-gcp<1,>=0.2.2
  Using cached grpcio_gcp-0.2.2-py2.py3-none-any.whl (9.4 kB)
Collecting google-cloud-dlp<4,>=3.0.0
  Using cached google_cloud_dlp-3.9.0-py2.py3-none-any.whl (124 kB)
Collecting google-cloud-language<2,>=1.3.0
  Using cached google_cloud_language-1.3.2-py2.py3-none-any.whl (83 kB)
Collecting google-cloud-videointelligence<2,>=1.8.0
  Using cached google_cloud_videointelligence-1.16.3-py2.py3-none-any.whl (183 kB)
Collecting google-cloud-vision<2,>=0.38.0
  Using cached google_cloud_vision-1.0.2-py2.py3-none-any.whl (435 kB)
Collecting google-cloud-recommendations-ai<0.8.0,>=0.1.0
  Using cached google_cloud_recommendations_ai-0.7.1-py2.py3-none-any.whl (148 kB)
Requirement already satisfied: six>=1.11.0 in <https://ci-beam.apache.org/job/beam_LoadTests_Python_Combine_Dataflow_Streaming/ws/src/build/gradleenv/1329484227/lib/python3.7/site-packages> (from azure-core>=1.7.0->apache-beam==2.43.0.dev0) (1.16.0)
Collecting msrest>=0.6.21
  Using cached msrest-0.7.1-py3-none-any.whl (85 kB)
Collecting jmespath<2.0.0,>=0.7.1
  Using cached jmespath-1.0.1-py3-none-any.whl (20 kB)
Collecting botocore<1.28.0,>=1.27.80
  Using cached botocore-1.27.80-py3-none-any.whl (9.1 MB)
Collecting s3transfer<0.7.0,>=0.6.0
  Using cached s3transfer-0.6.0-py3-none-any.whl (79 kB)
Collecting cffi>=1.12
  Using cached cffi-1.15.1-cp37-cp37m-manylinux_2_17_x86_64.manylinux2014_x86_64.whl (427 kB)
Collecting googleapis-common-protos<2.0dev,>=1.56.2
  Using cached googleapis_common_protos-1.56.4-py2.py3-none-any.whl (211 kB)
Collecting fasteners>=0.14
  Using cached fasteners-0.18-py3-none-any.whl (18 kB)
Collecting oauth2client>=1.4.12
  Using cached oauth2client-4.1.3-py2.py3-none-any.whl (98 kB)
Collecting pyasn1-modules>=0.2.1
  Using cached pyasn1_modules-0.2.8-py2.py3-none-any.whl (155 kB)
Collecting rsa<5,>=3.1.4
  Using cached rsa-4.9-py3-none-any.whl (34 kB)
Requirement already satisfied: packaging<22.0.0dev,>=14.3 in <https://ci-beam.apache.org/job/beam_LoadTests_Python_Combine_Dataflow_Streaming/ws/src/build/gradleenv/1329484227/lib/python3.7/site-packages> (from google-cloud-bigquery<4,>=1.6.0->apache-beam==2.43.0.dev0) (21.3)
Collecting google-resumable-media<3.0dev,>=0.6.0
  Using cached google_resumable_media-2.3.3-py2.py3-none-any.whl (76 kB)
Collecting grpc-google-iam-v1<0.13dev,>=0.12.3
  Using cached grpc_google_iam_v1-0.12.4-py2.py3-none-any.whl (26 kB)
Collecting grpcio-status>=1.16.0
  Using cached grpcio_status-1.49.1-py3-none-any.whl (14 kB)
Collecting overrides<7.0.0,>=6.0.1
  Using cached overrides-6.2.0-py3-none-any.whl (17 kB)
Collecting docopt
  Using cached docopt-0.6.2-py2.py3-none-any.whl
Requirement already satisfied: pyparsing!=3.0.0,!=3.0.1,!=3.0.2,!=3.0.3,<4,>=2.4.2 in <https://ci-beam.apache.org/job/beam_LoadTests_Python_Combine_Dataflow_Streaming/ws/src/build/gradleenv/1329484227/lib/python3.7/site-packages> (from httplib2<0.21.0,>=0.8->apache-beam==2.43.0.dev0) (3.0.9)
Collecting pbr>=0.11
  Using cached pbr-5.10.0-py2.py3-none-any.whl (112 kB)
Requirement already satisfied: py>=1.8.2 in <https://ci-beam.apache.org/job/beam_LoadTests_Python_Combine_Dataflow_Streaming/ws/src/build/gradleenv/1329484227/lib/python3.7/site-packages> (from pytest<8.0,>=7.1.2->apache-beam==2.43.0.dev0) (1.11.0)
Collecting attrs>=19.2.0
  Using cached attrs-22.1.0-py2.py3-none-any.whl (58 kB)
Collecting tomli>=1.0.0
  Using cached tomli-2.0.1-py3-none-any.whl (12 kB)
Requirement already satisfied: importlib-metadata>=0.12 in <https://ci-beam.apache.org/job/beam_LoadTests_Python_Combine_Dataflow_Streaming/ws/src/build/gradleenv/1329484227/lib/python3.7/site-packages> (from pytest<8.0,>=7.1.2->apache-beam==2.43.0.dev0) (2.1.3)
Collecting iniconfig
  Using cached iniconfig-1.1.1-py2.py3-none-any.whl (5.0 kB)
Requirement already satisfied: pluggy<2.0,>=0.12 in <https://ci-beam.apache.org/job/beam_LoadTests_Python_Combine_Dataflow_Streaming/ws/src/build/gradleenv/1329484227/lib/python3.7/site-packages> (from pytest<8.0,>=7.1.2->apache-beam==2.43.0.dev0) (1.0.0)
Collecting execnet>=1.1
  Using cached execnet-1.9.0-py2.py3-none-any.whl (39 kB)
Collecting pytest-forked
  Using cached pytest_forked-1.4.0-py3-none-any.whl (4.9 kB)
Collecting urllib3<1.27,>=1.21.1
  Using cached urllib3-1.26.12-py2.py3-none-any.whl (140 kB)
Collecting idna<4,>=2.5
  Using cached idna-3.4-py3-none-any.whl (61 kB)
Collecting certifi>=2017.4.17
  Using cached certifi-2022.9.24-py3-none-any.whl (161 kB)
Collecting charset-normalizer<3,>=2
  Using cached charset_normalizer-2.1.1-py3-none-any.whl (39 kB)
Collecting scipy>=1.1.0
  Using cached scipy-1.7.3-cp37-cp37m-manylinux_2_12_x86_64.manylinux2010_x86_64.whl (38.1 MB)
Collecting threadpoolctl>=2.0.0
  Using cached threadpoolctl-3.1.0-py3-none-any.whl (14 kB)
Collecting greenlet!=0.4.17
  Using cached greenlet-1.1.3-cp37-cp37m-manylinux_2_17_x86_64.manylinux2014_x86_64.whl (150 kB)
Collecting wrapt
  Using cached wrapt-1.14.1-cp37-cp37m-manylinux_2_5_x86_64.manylinux1_x86_64.manylinux_2_17_x86_64.manylinux2014_x86_64.whl (75 kB)
Collecting docker>=4.0.0
  Using cached docker-6.0.0-py3-none-any.whl (147 kB)
Collecting deprecation
  Using cached deprecation-2.1.0-py2.py3-none-any.whl (11 kB)
Collecting pymysql
  Using cached PyMySQL-1.0.2-py3-none-any.whl (43 kB)
Collecting pycparser
  Using cached pycparser-2.21-py2.py3-none-any.whl (118 kB)
Collecting websocket-client>=0.32.0
  Using cached websocket_client-1.4.1-py3-none-any.whl (55 kB)
Collecting google-crc32c<2.0dev,>=1.0
  Using cached google_crc32c-1.5.0-cp37-cp37m-manylinux_2_17_x86_64.manylinux2014_x86_64.whl (32 kB)
Collecting grpcio-status>=1.16.0
  Using cached grpcio_status-1.48.2-py3-none-any.whl (14 kB)
Requirement already satisfied: zipp>=0.5 in <https://ci-beam.apache.org/job/beam_LoadTests_Python_Combine_Dataflow_Streaming/ws/src/build/gradleenv/1329484227/lib/python3.7/site-packages> (from importlib-metadata>=0.12->pytest<8.0,>=7.1.2->apache-beam==2.43.0.dev0) (3.8.1)
Collecting requests-oauthlib>=0.5.0
  Using cached requests_oauthlib-1.3.1-py2.py3-none-any.whl (23 kB)
Collecting isodate>=0.6.0
  Using cached isodate-0.6.1-py2.py3-none-any.whl (41 kB)
Collecting pyasn1>=0.1.7
  Using cached pyasn1-0.4.8-py2.py3-none-any.whl (77 kB)
Collecting oauthlib>=3.0.0
  Using cached oauthlib-3.2.1-py3-none-any.whl (151 kB)
Building wheels for collected packages: apache-beam
  Building wheel for apache-beam (setup.py): started
  Building wheel for apache-beam (setup.py): finished with status 'done'
  Created wheel for apache-beam: filename=apache_beam-2.43.0.dev0-py3-none-any.whl size=2865704 sha256=774b59dc651c4ad603fec83c251ec0c978d95acba80a6ddaa754e2eb67f24796
  Stored in directory: /home/jenkins/.cache/pip/wheels/e6/1f/28/9337974c607f5f016ef124646a645ebf2fb34bdd32df5f9dd8
Successfully built apache-beam
Installing collected packages: pytz, pyasn1, parameterized, iniconfig, docopt, crcmod, zstandard, wrapt, websocket-client, urllib3, typing-extensions, tomli, threadpoolctl, tenacity, rsa, regex, pyyaml, python-dateutil, pymysql, pymongo, pyhamcrest, pydot, pycparser, pyasn1-modules, psycopg2-binary, proto-plus, pbr, overrides, orjson, objsize, oauthlib, numpy, joblib, jmespath, isodate, idna, httplib2, greenlet, googleapis-common-protos, google-crc32c, fasteners, fastavro, execnet, dill, cloudpickle, charset-normalizer, certifi, cachetools, attrs, sqlalchemy, scipy, requests, pyarrow, pandas, oauth2client, mock, grpcio-status, grpcio-gcp, google-resumable-media, google-auth, freezegun, deprecation, cffi, botocore, scikit-learn, s3transfer, requests-oauthlib, requests_mock, pytest, hdfs, grpc-google-iam-v1, google-auth-httplib2, google-apitools, google-api-core, docker, cryptography, azure-core, testcontainers, pytest-timeout, pytest-forked, msrest, google-cloud-core, boto3, apache-beam, pytest-xdist, google-cloud-vision, google-cloud-videointelligence, google-cloud-spanner, google-cloud-recommendations-ai, google-cloud-pubsub, google-cloud-language, google-cloud-dlp, google-cloud-datastore, google-cloud-bigtable, google-cloud-bigquery-storage, azure-storage-blob, google-cloud-pubsublite, google-cloud-bigquery
Successfully installed apache-beam-2.43.0.dev0 attrs-22.1.0 azure-core-1.25.1 azure-storage-blob-12.13.1 boto3-1.24.80 botocore-1.27.80 cachetools-4.2.4 certifi-2022.9.24 cffi-1.15.1 charset-normalizer-2.1.1 cloudpickle-2.2.0 crcmod-1.7 cryptography-38.0.1 deprecation-2.1.0 dill-0.3.1.1 docker-6.0.0 docopt-0.6.2 execnet-1.9.0 fastavro-1.6.1 fasteners-0.18 freezegun-1.2.2 google-api-core-2.10.1 google-apitools-0.5.31 google-auth-2.11.1 google-auth-httplib2-0.1.0 google-cloud-bigquery-3.3.2 google-cloud-bigquery-storage-2.13.2 google-cloud-bigtable-1.7.2 google-cloud-core-2.3.2 google-cloud-datastore-1.15.5 google-cloud-dlp-3.9.0 google-cloud-language-1.3.2 google-cloud-pubsub-2.13.7 google-cloud-pubsublite-1.5.0 google-cloud-recommendations-ai-0.7.1 google-cloud-spanner-1.19.3 google-cloud-videointelligence-1.16.3 google-cloud-vision-1.0.2 google-crc32c-1.5.0 google-resumable-media-2.3.3 googleapis-common-protos-1.56.4 greenlet-1.1.3 grpc-google-iam-v1-0.12.4 grpcio-gcp-0.2.2 grpcio-status-1.48.2 hdfs-2.7.0 httplib2-0.20.4 idna-3.4 iniconfig-1.1.1 isodate-0.6.1 jmespath-1.0.1 joblib-1.2.0 mock-2.0.0 msrest-0.7.1 numpy-1.21.6 oauth2client-4.1.3 oauthlib-3.2.1 objsize-0.5.2 orjson-3.8.0 overrides-6.2.0 pandas-1.3.5 parameterized-0.8.1 pbr-5.10.0 proto-plus-1.22.1 psycopg2-binary-2.9.3 pyarrow-9.0.0 pyasn1-0.4.8 pyasn1-modules-0.2.8 pycparser-2.21 pydot-1.4.2 pyhamcrest-1.10.1 pymongo-3.12.3 pymysql-1.0.2 pytest-7.1.3 pytest-forked-1.4.0 pytest-timeout-2.1.0 pytest-xdist-2.5.0 python-dateutil-2.8.2 pytz-2022.2.1 pyyaml-6.0 regex-2022.9.13 requests-2.28.1 requests-oauthlib-1.3.1 requests_mock-1.10.0 rsa-4.9 s3transfer-0.6.0 scikit-learn-1.0.2 scipy-1.7.3 sqlalchemy-1.4.41 tenacity-5.1.5 testcontainers-3.7.0 threadpoolctl-3.1.0 tomli-2.0.1 typing-extensions-4.3.0 urllib3-1.26.12 websocket-client-1.4.1 wrapt-1.14.1 zstandard-0.18.0

> Task :sdks:python:apache_beam:testing:load_tests:run
INFO:apache_beam.runners.portability.stager:Copying Beam SDK "<https://ci-beam.apache.org/job/beam_LoadTests_Python_Combine_Dataflow_Streaming/ws/src/sdks/python/build/apache-beam.tar.gz"> to staging location.
INFO:apache_beam.runners.dataflow.dataflow_runner:Pipeline has additional dependencies to be installed in SDK **** container, consider using the SDK container image pre-building workflow to avoid repetitive installations. Learn more on https://cloud.google.com/dataflow/docs/guides/using-custom-containers#prebuild
INFO:root:Default Python SDK image for environment is apache/beam_python3.7_sdk:2.43.0.dev
INFO:root:Using provided Python SDK container image: gcr.io/cloud-dataflow/v1beta3/python37-fnapi:beam-master-20220914
INFO:root:Python SDK container image set to "gcr.io/cloud-dataflow/v1beta3/python37-fnapi:beam-master-20220914" for Docker environment
INFO:apache_beam.runners.dataflow.internal.apiclient:Defaulting to the temp_location as staging_location: gs://temp-storage-for-perf-tests/smoketests
INFO:apache_beam.internal.gcp.auth:Setting socket default timeout to 60 seconds.
INFO:apache_beam.internal.gcp.auth:socket default timeout is 60.0 seconds.
INFO:apache_beam.runners.dataflow.internal.apiclient:Starting GCS upload to gs://temp-storage-for-perf-tests/smoketests/load-tests-python-dataflow-streaming-combine-1-0926150214.1664204870.909627/dataflow_python_sdk.tar...
INFO:apache_beam.runners.dataflow.internal.apiclient:Completed GCS upload to gs://temp-storage-for-perf-tests/smoketests/load-tests-python-dataflow-streaming-combine-1-0926150214.1664204870.909627/dataflow_python_sdk.tar in 0 seconds.
INFO:apache_beam.runners.dataflow.internal.apiclient:Starting GCS upload to gs://temp-storage-for-perf-tests/smoketests/load-tests-python-dataflow-streaming-combine-1-0926150214.1664204870.909627/pipeline.pb...
INFO:apache_beam.runners.dataflow.internal.apiclient:Completed GCS upload to gs://temp-storage-for-perf-tests/smoketests/load-tests-python-dataflow-streaming-combine-1-0926150214.1664204870.909627/pipeline.pb in 0 seconds.
INFO:apache_beam.runners.dataflow.internal.apiclient:Create job: <Job
 clientRequestId: '20220926150750910593-7261'
 createTime: '2022-09-26T15:07:51.923977Z'
 currentStateTime: '1970-01-01T00:00:00Z'
 id: '2022-09-26_08_07_51-4302923166990615882'
 location: 'us-central1'
 name: 'load-tests-python-dataflow-streaming-combine-1-0926150214'
 projectId: 'apache-beam-testing'
 stageStates: []
 startTime: '2022-09-26T15:07:51.923977Z'
 steps: []
 tempFiles: []
 type: TypeValueValuesEnum(JOB_TYPE_STREAMING, 2)>
INFO:apache_beam.runners.dataflow.internal.apiclient:Created job with id: [2022-09-26_08_07_51-4302923166990615882]
INFO:apache_beam.runners.dataflow.internal.apiclient:Submitted job: 2022-09-26_08_07_51-4302923166990615882
INFO:apache_beam.runners.dataflow.internal.apiclient:To access the Dataflow monitoring console, please navigate to https://console.cloud.google.com/dataflow/jobs/us-central1/2022-09-26_08_07_51-4302923166990615882?project=apache-beam-testing
INFO:apache_beam.runners.dataflow.dataflow_runner:Job 2022-09-26_08_07_51-4302923166990615882 is in state JOB_STATE_PENDING
INFO:apache_beam.runners.dataflow.dataflow_runner:2022-09-26T15:08:01.534Z: JOB_MESSAGE_BASIC: Worker configuration: e2-standard-2 in us-central1-a.
INFO:apache_beam.runners.dataflow.dataflow_runner:2022-09-26T15:08:02.844Z: JOB_MESSAGE_DETAILED: Expanding SplittableParDo operations into optimizable parts.
INFO:apache_beam.runners.dataflow.dataflow_runner:2022-09-26T15:08:02.884Z: JOB_MESSAGE_DETAILED: Expanding CollectionToSingleton operations into optimizable parts.
INFO:apache_beam.runners.dataflow.dataflow_runner:2022-09-26T15:08:02.959Z: JOB_MESSAGE_DETAILED: Expanding CoGroupByKey operations into optimizable parts.
INFO:apache_beam.runners.dataflow.dataflow_runner:2022-09-26T15:08:03.060Z: JOB_MESSAGE_DETAILED: Expanding SplittableProcessKeyed operations into optimizable parts.
INFO:apache_beam.runners.dataflow.dataflow_runner:2022-09-26T15:08:03.141Z: JOB_MESSAGE_DETAILED: Expanding GroupByKey operations into streaming Read/Write steps
INFO:apache_beam.runners.dataflow.dataflow_runner:2022-09-26T15:08:03.240Z: JOB_MESSAGE_DETAILED: Lifting ValueCombiningMappingFns into MergeBucketsMappingFns
INFO:apache_beam.runners.dataflow.dataflow_runner:2022-09-26T15:08:03.304Z: JOB_MESSAGE_DEBUG: Annotating graph with Autotuner information.
INFO:apache_beam.runners.dataflow.dataflow_runner:2022-09-26T15:08:03.379Z: JOB_MESSAGE_DETAILED: Fusing adjacent ParDo, Read, Write, and Flatten operations
INFO:apache_beam.runners.dataflow.dataflow_runner:2022-09-26T15:08:03.433Z: JOB_MESSAGE_DETAILED: Fusing consumer Read synthetic/Map(<lambda at iobase.py:908>) into Read synthetic/Impulse
INFO:apache_beam.runners.dataflow.dataflow_runner:2022-09-26T15:08:03.464Z: JOB_MESSAGE_DETAILED: Fusing consumer ref_AppliedPTransform_Read-synthetic-SDFBoundedSourceReader-ParDo-SDFBoundedSourceDoFn-_6/PairWithRestriction into Read synthetic/Map(<lambda at iobase.py:908>)
INFO:apache_beam.runners.dataflow.dataflow_runner:2022-09-26T15:08:03.500Z: JOB_MESSAGE_DETAILED: Fusing consumer ref_AppliedPTransform_Read-synthetic-SDFBoundedSourceReader-ParDo-SDFBoundedSourceDoFn-_6/SplitWithSizing into ref_AppliedPTransform_Read-synthetic-SDFBoundedSourceReader-ParDo-SDFBoundedSourceDoFn-_6/PairWithRestriction
INFO:apache_beam.runners.dataflow.dataflow_runner:2022-09-26T15:08:03.545Z: JOB_MESSAGE_DETAILED: Fusing consumer Measure time: Start into ref_AppliedPTransform_Read-synthetic-SDFBoundedSourceReader-ParDo-SDFBoundedSourceDoFn-_6/ProcessElementAndRestrictionWithSizing
INFO:apache_beam.runners.dataflow.dataflow_runner:2022-09-26T15:08:03.585Z: JOB_MESSAGE_DETAILED: Fusing consumer Combine with Top 0/KeyWithVoid into Measure time: Start
INFO:apache_beam.runners.dataflow.dataflow_runner:2022-09-26T15:08:03.676Z: JOB_MESSAGE_DETAILED: Fusing consumer Combine with Top 0/CombinePerKey/Combine/ConvertToAccumulators into Combine with Top 0/KeyWithVoid
INFO:apache_beam.runners.dataflow.dataflow_runner:2022-09-26T15:08:03.794Z: JOB_MESSAGE_DETAILED: Fusing consumer Combine with Top 0/CombinePerKey/GroupByKey/WriteStream into Combine with Top 0/CombinePerKey/Combine/ConvertToAccumulators
INFO:apache_beam.runners.dataflow.dataflow_runner:2022-09-26T15:08:03.831Z: JOB_MESSAGE_DETAILED: Fusing consumer Combine with Top 0/CombinePerKey/Combine into Combine with Top 0/CombinePerKey/GroupByKey/ReadStream
INFO:apache_beam.runners.dataflow.dataflow_runner:2022-09-26T15:08:03.871Z: JOB_MESSAGE_DETAILED: Fusing consumer Combine with Top 0/CombinePerKey/Combine/Extract into Combine with Top 0/CombinePerKey/Combine
INFO:apache_beam.runners.dataflow.dataflow_runner:2022-09-26T15:08:03.898Z: JOB_MESSAGE_DETAILED: Fusing consumer Combine with Top 0/UnKey into Combine with Top 0/CombinePerKey/Combine/Extract
INFO:apache_beam.runners.dataflow.dataflow_runner:2022-09-26T15:08:03.934Z: JOB_MESSAGE_DETAILED: Fusing consumer Consume 0 into Combine with Top 0/UnKey
INFO:apache_beam.runners.dataflow.dataflow_runner:2022-09-26T15:08:03.963Z: JOB_MESSAGE_DETAILED: Fusing consumer Measure time: End 0 into Consume 0
INFO:apache_beam.runners.dataflow.dataflow_runner:2022-09-26T15:08:04.061Z: JOB_MESSAGE_BASIC: Running job using Streaming Engine
INFO:apache_beam.runners.dataflow.dataflow_runner:2022-09-26T15:08:04.109Z: JOB_MESSAGE_DEBUG: Workflow config is missing a default resource spec.
INFO:apache_beam.runners.dataflow.dataflow_runner:2022-09-26T15:08:04.157Z: JOB_MESSAGE_DEBUG: Adding StepResource setup and teardown to workflow graph.
INFO:apache_beam.runners.dataflow.dataflow_runner:2022-09-26T15:08:04.206Z: JOB_MESSAGE_DEBUG: Adding workflow start and stop steps.
INFO:apache_beam.runners.dataflow.dataflow_runner:2022-09-26T15:08:04.247Z: JOB_MESSAGE_DEBUG: Assigning stage ids.
INFO:apache_beam.runners.dataflow.dataflow_runner:2022-09-26T15:08:04.363Z: JOB_MESSAGE_DEBUG: Starting **** pool setup.
INFO:apache_beam.runners.dataflow.dataflow_runner:2022-09-26T15:08:04.400Z: JOB_MESSAGE_BASIC: Starting 5 ****s in us-central1-a...
INFO:apache_beam.runners.dataflow.dataflow_runner:2022-09-26T15:08:04.541Z: JOB_MESSAGE_DEBUG: Starting **** pool setup.
INFO:apache_beam.runners.dataflow.dataflow_runner:Job 2022-09-26_08_07_51-4302923166990615882 is in state JOB_STATE_RUNNING
INFO:apache_beam.runners.dataflow.dataflow_runner:2022-09-26T15:08:13.312Z: JOB_MESSAGE_BASIC: Your project already contains 100 Dataflow-created metric descriptors, so new user metrics of the form custom.googleapis.com/* will not be created. However, all user metrics are also available in the metric dataflow.googleapis.com/job/user_counter. If you rely on the custom metrics, you can delete old / unused metric descriptors. See https://developers.google.com/apis-explorer/#p/monitoring/v3/monitoring.projects.metricDescriptors.list and https://developers.google.com/apis-explorer/#p/monitoring/v3/monitoring.projects.metricDescriptors.delete
INFO:apache_beam.runners.dataflow.dataflow_runner:2022-09-26T15:08:45.011Z: JOB_MESSAGE_DETAILED: Autoscaling: Raised the number of ****s to 5 so that the pipeline can catch up with its backlog and keep up with its input rate.
INFO:apache_beam.runners.dataflow.dataflow_runner:2022-09-26T15:09:14.694Z: JOB_MESSAGE_DETAILED: Workers have started successfully.
INFO:apache_beam.runners.dataflow.dataflow_runner:2022-09-26T16:07:30.039Z: JOB_MESSAGE_DETAILED: Autoscaling: Raised the number of ****s to 5 so that the pipeline can catch up with its backlog and keep up with its input rate.
INFO:apache_beam.runners.dataflow.dataflow_runner:2022-09-26T16:08:31.763Z: JOB_MESSAGE_DETAILED: Autoscaling: Raised the number of ****s to 5 so that the pipeline can catch up with its backlog and keep up with its input rate.
INFO:apache_beam.runners.dataflow.dataflow_runner:2022-09-26T16:51:42.824Z: JOB_MESSAGE_DETAILED: Autoscaling: Raised the number of ****s to 5 so that the pipeline can catch up with its backlog and keep up with its input rate.
INFO:apache_beam.runners.dataflow.dataflow_runner:2022-09-26T16:55:34.599Z: JOB_MESSAGE_DETAILED: Autoscaling: Raised the number of ****s to 5 so that the pipeline can catch up with its backlog and keep up with its input rate.
INFO:apache_beam.runners.dataflow.dataflow_runner:2022-09-26T17:02:37.109Z: JOB_MESSAGE_DETAILED: Autoscaling: Raised the number of ****s to 5 so that the pipeline can catch up with its backlog and keep up with its input rate.
INFO:apache_beam.runners.dataflow.dataflow_runner:2022-09-26T17:38:39.050Z: JOB_MESSAGE_DETAILED: Autoscaling: Raised the number of ****s to 5 so that the pipeline can catch up with its backlog and keep up with its input rate.
INFO:apache_beam.runners.dataflow.dataflow_runner:2022-09-26T17:53:42.379Z: JOB_MESSAGE_DETAILED: Autoscaling: Raised the number of ****s to 5 so that the pipeline can catch up with its backlog and keep up with its input rate.
INFO:apache_beam.runners.dataflow.dataflow_runner:2022-09-26T18:26:13.248Z: JOB_MESSAGE_DETAILED: Autoscaling: Raised the number of ****s to 5 so that the pipeline can catch up with its backlog and keep up with its input rate.
INFO:apache_beam.runners.dataflow.dataflow_runner:2022-09-26T18:48:46.273Z: JOB_MESSAGE_DETAILED: Autoscaling: Raised the number of ****s to 5 so that the pipeline can catch up with its backlog and keep up with its input rate.
INFO:apache_beam.runners.dataflow.dataflow_runner:2022-09-26T19:14:45.826Z: JOB_MESSAGE_DETAILED: Autoscaling: Raised the number of ****s to 5 so that the pipeline can catch up with its backlog and keep up with its input rate.
INFO:apache_beam.runners.dataflow.dataflow_runner:2022-09-26T19:39:49.721Z: JOB_MESSAGE_DETAILED: Autoscaling: Raised the number of ****s to 5 so that the pipeline can catch up with its backlog and keep up with its input rate.
INFO:apache_beam.runners.dataflow.dataflow_runner:Job 2022-09-26_08_07_51-4302923166990615882 is in state JOB_STATE_CANCELLING
INFO:apache_beam.runners.dataflow.dataflow_runner:2022-09-26T20:00:55.490Z: JOB_MESSAGE_BASIC: Cancel request is committed for workflow job: 2022-09-26_08_07_51-4302923166990615882.
INFO:apache_beam.runners.dataflow.dataflow_runner:2022-09-26T20:00:55.536Z: JOB_MESSAGE_DETAILED: Cleaning up.
INFO:apache_beam.runners.dataflow.dataflow_runner:2022-09-26T20:00:55.606Z: JOB_MESSAGE_DEBUG: Starting **** pool teardown.
INFO:apache_beam.runners.dataflow.dataflow_runner:2022-09-26T20:00:55.642Z: JOB_MESSAGE_BASIC: Stopping **** pool...
INFO:apache_beam.runners.dataflow.dataflow_runner:2022-09-26T20:00:55.687Z: JOB_MESSAGE_DEBUG: Starting **** pool teardown.
INFO:apache_beam.runners.dataflow.dataflow_runner:2022-09-26T20:00:55.716Z: JOB_MESSAGE_BASIC: Stopping **** pool...
Traceback (most recent call last):
  File "/usr/lib/python3.7/runpy.py", line 193, in _run_module_as_main
    "__main__", mod_spec)
  File "/usr/lib/python3.7/runpy.py", line 85, in _run_code
    exec(code, run_globals)
  File "<https://ci-beam.apache.org/job/beam_LoadTests_Python_Combine_Dataflow_Streaming/ws/src/sdks/python/apache_beam/testing/load_tests/combine_test.py",> line 129, in <module>
    CombineTest().run()
  File "<https://ci-beam.apache.org/job/beam_LoadTests_Python_Combine_Dataflow_Streaming/ws/src/sdks/python/apache_beam/testing/load_tests/load_test.py",> line 151, in run
    self.result.wait_until_finish(duration=self.timeout_ms)
  File "<https://ci-beam.apache.org/job/beam_LoadTests_Python_Combine_Dataflow_Streaming/ws/src/sdks/python/apache_beam/runners/dataflow/dataflow_runner.py",> line 1665, in wait_until_finish
    '{}'.format(consoleUrl))
AssertionError: Job did not reach to a terminal state after waiting indefinitely. Console URL: https://console.cloud.google.com/dataflow/jobs/<RegionId>/2022-09-26_08_07_51-4302923166990615882?project=<ProjectId>

> Task :sdks:python:apache_beam:testing:load_tests:run FAILED

FAILURE: Build failed with an exception.

* Where:
Build file '<https://ci-beam.apache.org/job/beam_LoadTests_Python_Combine_Dataflow_Streaming/ws/src/sdks/python/apache_beam/testing/load_tests/build.gradle'> line: 70

* What went wrong:
Execution failed for task ':sdks:python:apache_beam:testing:load_tests:run'.
> error occurred

* Try:
> Run with --stacktrace option to get the stack trace.
> Run with --info or --debug option to get more log output.

* Get more help at https://help.gradle.org

Deprecated Gradle features were used in this build, making it incompatible with Gradle 8.0.

You can use '--warning-mode all' to show the individual deprecation warnings and determine if they come from your own scripts or plugins.

See https://docs.gradle.org/7.5.1/userguide/command_line_interface.html#sec:command_line_warnings

BUILD FAILED in 4h 55m 15s
15 actionable tasks: 9 executed, 4 from cache, 2 up-to-date

Publishing build scan...
https://gradle.com/s/wx4vb3mpawhco

Build step 'Invoke Gradle script' changed build result to FAILURE
Build step 'Invoke Gradle script' marked build as failure

---------------------------------------------------------------------
To unsubscribe, e-mail: builds-unsubscribe@beam.apache.org
For additional commands, e-mail: builds-help@beam.apache.org


Jenkins build is back to normal : beam_LoadTests_Python_Combine_Dataflow_Streaming #766

Posted by Apache Jenkins Server <je...@builds.apache.org>.
See <https://ci-beam.apache.org/job/beam_LoadTests_Python_Combine_Dataflow_Streaming/766/display/redirect?page=changes>


---------------------------------------------------------------------
To unsubscribe, e-mail: builds-unsubscribe@beam.apache.org
For additional commands, e-mail: builds-help@beam.apache.org


Build failed in Jenkins: beam_LoadTests_Python_Combine_Dataflow_Streaming #765

Posted by Apache Jenkins Server <je...@builds.apache.org>.
See <https://ci-beam.apache.org/job/beam_LoadTests_Python_Combine_Dataflow_Streaming/765/display/redirect?page=changes>

Changes:

[shaojwu] make identifier of Date&DateTime to be a public static field

[shaojwu] make identifier of Time to be a public static field

[noreply] RunInference Benchmarks UI (#23371)

[noreply] set upper bound on google-cloud-profiler (#23354)

[noreply] Add ISSUE#23071 to CHANGES.md (#23297)

[noreply] Pin objsize version to avoid regression in 0.6.0 (#23396)


------------------------------------------
[...truncated 23.06 KB...]
Collecting pyhamcrest!=1.10.0,<2.0.0,>=1.9
  Using cached PyHamcrest-1.10.1-py3-none-any.whl (48 kB)
Collecting pyyaml<7.0.0,>=3.12
  Using cached PyYAML-6.0-cp37-cp37m-manylinux_2_5_x86_64.manylinux1_x86_64.manylinux_2_12_x86_64.manylinux2010_x86_64.whl (596 kB)
Collecting requests_mock<2.0,>=1.7
  Using cached requests_mock-1.10.0-py2.py3-none-any.whl (28 kB)
Collecting tenacity<6.0,>=5.0.2
  Using cached tenacity-5.1.5-py2.py3-none-any.whl (34 kB)
Collecting pytest<8.0,>=7.1.2
  Using cached pytest-7.1.3-py3-none-any.whl (298 kB)
Collecting pytest-xdist<3,>=2.5.0
  Using cached pytest_xdist-2.5.0-py3-none-any.whl (41 kB)
Collecting pytest-timeout<3,>=2.1.0
  Using cached pytest_timeout-2.1.0-py3-none-any.whl (12 kB)
Collecting scikit-learn>=0.20.0
  Using cached scikit_learn-1.0.2-cp37-cp37m-manylinux_2_17_x86_64.manylinux2014_x86_64.whl (24.8 MB)
Collecting sqlalchemy<2.0,>=1.3
  Using cached SQLAlchemy-1.4.41-cp37-cp37m-manylinux_2_5_x86_64.manylinux1_x86_64.manylinux_2_17_x86_64.manylinux2014_x86_64.whl (1.6 MB)
Collecting psycopg2-binary<3.0.0,>=2.8.5
  Using cached psycopg2_binary-2.9.3-cp37-cp37m-manylinux_2_17_x86_64.manylinux2014_x86_64.whl (3.0 MB)
Collecting testcontainers[mysql]<4.0.0,>=3.0.3
  Using cached testcontainers-3.7.0-py2.py3-none-any.whl (43 kB)
Collecting cryptography>=36.0.0
  Using cached cryptography-38.0.1-cp36-abi3-manylinux_2_28_x86_64.whl (4.2 MB)
Collecting azure-storage-blob>=12.3.2
  Using cached azure_storage_blob-12.13.1-py3-none-any.whl (377 kB)
Collecting azure-core>=1.7.0
  Using cached azure_core-1.25.1-py3-none-any.whl (178 kB)
Requirement already satisfied: six>=1.11.0 in <https://ci-beam.apache.org/job/beam_LoadTests_Python_Combine_Dataflow_Streaming/ws/src/build/gradleenv/1329484227/lib/python3.7/site-packages> (from azure-core>=1.7.0->apache-beam==2.43.0.dev0) (1.16.0)
Collecting msrest>=0.6.21
  Using cached msrest-0.7.1-py3-none-any.whl (85 kB)
Collecting s3transfer<0.7.0,>=0.6.0
  Using cached s3transfer-0.6.0-py3-none-any.whl (79 kB)
Collecting botocore<1.28.0,>=1.27.82
  Using cached botocore-1.27.82-py3-none-any.whl (9.2 MB)
Collecting jmespath<2.0.0,>=0.7.1
  Using cached jmespath-1.0.1-py3-none-any.whl (20 kB)
Collecting cffi>=1.12
  Using cached cffi-1.15.1-cp37-cp37m-manylinux_2_17_x86_64.manylinux2014_x86_64.whl (427 kB)
Collecting googleapis-common-protos<2.0dev,>=1.56.2
  Using cached googleapis_common_protos-1.56.4-py2.py3-none-any.whl (211 kB)
Collecting oauth2client>=1.4.12
  Using cached oauth2client-4.1.3-py2.py3-none-any.whl (98 kB)
Collecting fasteners>=0.14
  Using cached fasteners-0.18-py3-none-any.whl (18 kB)
Collecting rsa<5,>=3.1.4
  Using cached rsa-4.9-py3-none-any.whl (34 kB)
Collecting pyasn1-modules>=0.2.1
  Using cached pyasn1_modules-0.2.8-py2.py3-none-any.whl (155 kB)
Requirement already satisfied: packaging<22.0.0dev,>=14.3 in <https://ci-beam.apache.org/job/beam_LoadTests_Python_Combine_Dataflow_Streaming/ws/src/build/gradleenv/1329484227/lib/python3.7/site-packages> (from google-cloud-bigquery<4,>=1.6.0->apache-beam==2.43.0.dev0) (21.3)
Collecting google-resumable-media<3.0dev,>=0.6.0
  Using cached google_resumable_media-2.3.3-py2.py3-none-any.whl (76 kB)
Collecting grpc-google-iam-v1<0.13dev,>=0.12.3
  Using cached grpc_google_iam_v1-0.12.4-py2.py3-none-any.whl (26 kB)
Collecting grpcio-status>=1.16.0
  Using cached grpcio_status-1.49.1-py3-none-any.whl (14 kB)
Collecting overrides<7.0.0,>=6.0.1
  Using cached overrides-6.2.0-py3-none-any.whl (17 kB)
Collecting docopt
  Using cached docopt-0.6.2-py2.py3-none-any.whl
Requirement already satisfied: pyparsing!=3.0.0,!=3.0.1,!=3.0.2,!=3.0.3,<4,>=2.4.2 in <https://ci-beam.apache.org/job/beam_LoadTests_Python_Combine_Dataflow_Streaming/ws/src/build/gradleenv/1329484227/lib/python3.7/site-packages> (from httplib2<0.21.0,>=0.8->apache-beam==2.43.0.dev0) (3.0.9)
Collecting pbr>=0.11
  Using cached pbr-5.10.0-py2.py3-none-any.whl (112 kB)
Requirement already satisfied: py>=1.8.2 in <https://ci-beam.apache.org/job/beam_LoadTests_Python_Combine_Dataflow_Streaming/ws/src/build/gradleenv/1329484227/lib/python3.7/site-packages> (from pytest<8.0,>=7.1.2->apache-beam==2.43.0.dev0) (1.11.0)
Collecting iniconfig
  Using cached iniconfig-1.1.1-py2.py3-none-any.whl (5.0 kB)
Collecting tomli>=1.0.0
  Using cached tomli-2.0.1-py3-none-any.whl (12 kB)
Collecting attrs>=19.2.0
  Using cached attrs-22.1.0-py2.py3-none-any.whl (58 kB)
Requirement already satisfied: pluggy<2.0,>=0.12 in <https://ci-beam.apache.org/job/beam_LoadTests_Python_Combine_Dataflow_Streaming/ws/src/build/gradleenv/1329484227/lib/python3.7/site-packages> (from pytest<8.0,>=7.1.2->apache-beam==2.43.0.dev0) (1.0.0)
Requirement already satisfied: importlib-metadata>=0.12 in <https://ci-beam.apache.org/job/beam_LoadTests_Python_Combine_Dataflow_Streaming/ws/src/build/gradleenv/1329484227/lib/python3.7/site-packages> (from pytest<8.0,>=7.1.2->apache-beam==2.43.0.dev0) (2.1.3)
Collecting execnet>=1.1
  Using cached execnet-1.9.0-py2.py3-none-any.whl (39 kB)
Collecting pytest-forked
  Using cached pytest_forked-1.4.0-py3-none-any.whl (4.9 kB)
Collecting certifi>=2017.4.17
  Using cached certifi-2022.9.24-py3-none-any.whl (161 kB)
Collecting idna<4,>=2.5
  Using cached idna-3.4-py3-none-any.whl (61 kB)
Collecting charset-normalizer<3,>=2
  Using cached charset_normalizer-2.1.1-py3-none-any.whl (39 kB)
Collecting urllib3<1.27,>=1.21.1
  Using cached urllib3-1.26.12-py2.py3-none-any.whl (140 kB)
Collecting scipy>=1.1.0
  Using cached scipy-1.7.3-cp37-cp37m-manylinux_2_12_x86_64.manylinux2010_x86_64.whl (38.1 MB)
Collecting threadpoolctl>=2.0.0
  Using cached threadpoolctl-3.1.0-py3-none-any.whl (14 kB)
Collecting greenlet!=0.4.17
  Using cached greenlet-1.1.3-cp37-cp37m-manylinux_2_17_x86_64.manylinux2014_x86_64.whl (150 kB)
Collecting wrapt
  Using cached wrapt-1.14.1-cp37-cp37m-manylinux_2_5_x86_64.manylinux1_x86_64.manylinux_2_17_x86_64.manylinux2014_x86_64.whl (75 kB)
Collecting deprecation
  Using cached deprecation-2.1.0-py2.py3-none-any.whl (11 kB)
Collecting docker>=4.0.0
  Using cached docker-6.0.0-py3-none-any.whl (147 kB)
Collecting pymysql
  Using cached PyMySQL-1.0.2-py3-none-any.whl (43 kB)
Collecting pycparser
  Using cached pycparser-2.21-py2.py3-none-any.whl (118 kB)
Collecting websocket-client>=0.32.0
  Using cached websocket_client-1.4.1-py3-none-any.whl (55 kB)
Collecting google-crc32c<2.0dev,>=1.0
  Using cached google_crc32c-1.5.0-cp37-cp37m-manylinux_2_17_x86_64.manylinux2014_x86_64.whl (32 kB)
Collecting grpcio-status>=1.16.0
  Using cached grpcio_status-1.48.2-py3-none-any.whl (14 kB)
Requirement already satisfied: zipp>=0.5 in <https://ci-beam.apache.org/job/beam_LoadTests_Python_Combine_Dataflow_Streaming/ws/src/build/gradleenv/1329484227/lib/python3.7/site-packages> (from importlib-metadata>=0.12->pytest<8.0,>=7.1.2->apache-beam==2.43.0.dev0) (3.8.1)
Collecting requests-oauthlib>=0.5.0
  Using cached requests_oauthlib-1.3.1-py2.py3-none-any.whl (23 kB)
Collecting isodate>=0.6.0
  Using cached isodate-0.6.1-py2.py3-none-any.whl (41 kB)
Collecting pyasn1>=0.1.7
  Using cached pyasn1-0.4.8-py2.py3-none-any.whl (77 kB)
Collecting oauthlib>=3.0.0
  Using cached oauthlib-3.2.1-py3-none-any.whl (151 kB)
Building wheels for collected packages: apache-beam
  Building wheel for apache-beam (setup.py): started
  Building wheel for apache-beam (setup.py): finished with status 'done'
  Created wheel for apache-beam: filename=apache_beam-2.43.0.dev0-py3-none-any.whl size=2867129 sha256=a361c3012aec3bbf94c87635bafb4cfee647dbc031aa8f6c535f306dc98b744f
  Stored in directory: /home/jenkins/.cache/pip/wheels/e6/1f/28/9337974c607f5f016ef124646a645ebf2fb34bdd32df5f9dd8
Successfully built apache-beam
Installing collected packages: pytz, pyasn1, parameterized, iniconfig, docopt, crcmod, zstandard, wrapt, websocket-client, urllib3, typing-extensions, tomli, threadpoolctl, tenacity, rsa, regex, pyyaml, python-dateutil, pymysql, pymongo, pyhamcrest, pydot, pycparser, pyasn1-modules, psycopg2-binary, proto-plus, pbr, overrides, orjson, objsize, oauthlib, numpy, joblib, jmespath, isodate, idna, httplib2, greenlet, googleapis-common-protos, google-crc32c, fasteners, fastavro, execnet, dill, cloudpickle, charset-normalizer, certifi, cachetools, attrs, sqlalchemy, scipy, requests, pyarrow, pandas, oauth2client, mock, grpcio-status, grpcio-gcp, google-resumable-media, google-auth, freezegun, deprecation, cffi, botocore, scikit-learn, s3transfer, requests-oauthlib, requests_mock, pytest, hdfs, grpc-google-iam-v1, google-auth-httplib2, google-apitools, google-api-core, docker, cryptography, azure-core, testcontainers, pytest-timeout, pytest-forked, msrest, google-cloud-core, boto3, apache-beam, pytest-xdist, google-cloud-vision, google-cloud-videointelligence, google-cloud-spanner, google-cloud-recommendations-ai, google-cloud-pubsub, google-cloud-language, google-cloud-dlp, google-cloud-datastore, google-cloud-bigtable, google-cloud-bigquery-storage, azure-storage-blob, google-cloud-pubsublite, google-cloud-bigquery
Successfully installed apache-beam-2.43.0.dev0 attrs-22.1.0 azure-core-1.25.1 azure-storage-blob-12.13.1 boto3-1.24.82 botocore-1.27.82 cachetools-4.2.4 certifi-2022.9.24 cffi-1.15.1 charset-normalizer-2.1.1 cloudpickle-2.2.0 crcmod-1.7 cryptography-38.0.1 deprecation-2.1.0 dill-0.3.1.1 docker-6.0.0 docopt-0.6.2 execnet-1.9.0 fastavro-1.6.1 fasteners-0.18 freezegun-1.2.2 google-api-core-2.10.1 google-apitools-0.5.31 google-auth-2.12.0 google-auth-httplib2-0.1.0 google-cloud-bigquery-3.3.2 google-cloud-bigquery-storage-2.13.2 google-cloud-bigtable-1.7.2 google-cloud-core-2.3.2 google-cloud-datastore-1.15.5 google-cloud-dlp-3.9.0 google-cloud-language-1.3.2 google-cloud-pubsub-2.13.7 google-cloud-pubsublite-1.5.0 google-cloud-recommendations-ai-0.7.1 google-cloud-spanner-1.19.3 google-cloud-videointelligence-1.16.3 google-cloud-vision-1.0.2 google-crc32c-1.5.0 google-resumable-media-2.3.3 googleapis-common-protos-1.56.4 greenlet-1.1.3 grpc-google-iam-v1-0.12.4 grpcio-gcp-0.2.2 grpcio-status-1.48.2 hdfs-2.7.0 httplib2-0.20.4 idna-3.4 iniconfig-1.1.1 isodate-0.6.1 jmespath-1.0.1 joblib-1.2.0 mock-2.0.0 msrest-0.7.1 numpy-1.21.6 oauth2client-4.1.3 oauthlib-3.2.1 objsize-0.5.2 orjson-3.8.0 overrides-6.2.0 pandas-1.3.5 parameterized-0.8.1 pbr-5.10.0 proto-plus-1.22.1 psycopg2-binary-2.9.3 pyarrow-9.0.0 pyasn1-0.4.8 pyasn1-modules-0.2.8 pycparser-2.21 pydot-1.4.2 pyhamcrest-1.10.1 pymongo-3.12.3 pymysql-1.0.2 pytest-7.1.3 pytest-forked-1.4.0 pytest-timeout-2.1.0 pytest-xdist-2.5.0 python-dateutil-2.8.2 pytz-2022.2.1 pyyaml-6.0 regex-2022.9.13 requests-2.28.1 requests-oauthlib-1.3.1 requests_mock-1.10.0 rsa-4.9 s3transfer-0.6.0 scikit-learn-1.0.2 scipy-1.7.3 sqlalchemy-1.4.41 tenacity-5.1.5 testcontainers-3.7.0 threadpoolctl-3.1.0 tomli-2.0.1 typing-extensions-4.3.0 urllib3-1.26.12 websocket-client-1.4.1 wrapt-1.14.1 zstandard-0.18.0

> Task :sdks:python:apache_beam:testing:load_tests:run
INFO:apache_beam.runners.portability.stager:Copying Beam SDK "<https://ci-beam.apache.org/job/beam_LoadTests_Python_Combine_Dataflow_Streaming/ws/src/sdks/python/build/apache-beam.tar.gz"> to staging location.
INFO:apache_beam.runners.dataflow.dataflow_runner:Pipeline has additional dependencies to be installed in SDK **** container, consider using the SDK container image pre-building workflow to avoid repetitive installations. Learn more on https://cloud.google.com/dataflow/docs/guides/using-custom-containers#prebuild
INFO:root:Default Python SDK image for environment is apache/beam_python3.7_sdk:2.43.0.dev
INFO:root:Using provided Python SDK container image: gcr.io/cloud-dataflow/v1beta3/python37-fnapi:beam-master-20220914
INFO:root:Python SDK container image set to "gcr.io/cloud-dataflow/v1beta3/python37-fnapi:beam-master-20220914" for Docker environment
INFO:apache_beam.runners.dataflow.internal.apiclient:Defaulting to the temp_location as staging_location: gs://temp-storage-for-perf-tests/smoketests
INFO:apache_beam.internal.gcp.auth:Setting socket default timeout to 60 seconds.
INFO:apache_beam.internal.gcp.auth:socket default timeout is 60.0 seconds.
INFO:apache_beam.runners.dataflow.internal.apiclient:Starting GCS upload to gs://temp-storage-for-perf-tests/smoketests/load-tests-python-dataflow-streaming-combine-1-0928150202.1664377668.473461/dataflow_python_sdk.tar...
INFO:apache_beam.runners.dataflow.internal.apiclient:Completed GCS upload to gs://temp-storage-for-perf-tests/smoketests/load-tests-python-dataflow-streaming-combine-1-0928150202.1664377668.473461/dataflow_python_sdk.tar in 0 seconds.
INFO:apache_beam.runners.dataflow.internal.apiclient:Starting GCS upload to gs://temp-storage-for-perf-tests/smoketests/load-tests-python-dataflow-streaming-combine-1-0928150202.1664377668.473461/pipeline.pb...
INFO:apache_beam.runners.dataflow.internal.apiclient:Completed GCS upload to gs://temp-storage-for-perf-tests/smoketests/load-tests-python-dataflow-streaming-combine-1-0928150202.1664377668.473461/pipeline.pb in 0 seconds.
INFO:apache_beam.runners.dataflow.internal.apiclient:Create job: <Job
 clientRequestId: '20220928150748474432-7713'
 createTime: '2022-09-28T15:07:49.512846Z'
 currentStateTime: '1970-01-01T00:00:00Z'
 id: '2022-09-28_08_07_49-10838804540937881587'
 location: 'us-central1'
 name: 'load-tests-python-dataflow-streaming-combine-1-0928150202'
 projectId: 'apache-beam-testing'
 stageStates: []
 startTime: '2022-09-28T15:07:49.512846Z'
 steps: []
 tempFiles: []
 type: TypeValueValuesEnum(JOB_TYPE_STREAMING, 2)>
INFO:apache_beam.runners.dataflow.internal.apiclient:Created job with id: [2022-09-28_08_07_49-10838804540937881587]
INFO:apache_beam.runners.dataflow.internal.apiclient:Submitted job: 2022-09-28_08_07_49-10838804540937881587
INFO:apache_beam.runners.dataflow.internal.apiclient:To access the Dataflow monitoring console, please navigate to https://console.cloud.google.com/dataflow/jobs/us-central1/2022-09-28_08_07_49-10838804540937881587?project=apache-beam-testing
INFO:apache_beam.runners.dataflow.dataflow_runner:Job 2022-09-28_08_07_49-10838804540937881587 is in state JOB_STATE_PENDING
INFO:apache_beam.runners.dataflow.dataflow_runner:2022-09-28T15:07:59.963Z: JOB_MESSAGE_BASIC: Worker configuration: e2-standard-2 in us-central1-a.
INFO:apache_beam.runners.dataflow.dataflow_runner:2022-09-28T15:08:04.738Z: JOB_MESSAGE_DETAILED: Expanding SplittableParDo operations into optimizable parts.
INFO:apache_beam.runners.dataflow.dataflow_runner:2022-09-28T15:08:04.775Z: JOB_MESSAGE_DETAILED: Expanding CollectionToSingleton operations into optimizable parts.
INFO:apache_beam.runners.dataflow.dataflow_runner:2022-09-28T15:08:04.834Z: JOB_MESSAGE_DETAILED: Expanding CoGroupByKey operations into optimizable parts.
INFO:apache_beam.runners.dataflow.dataflow_runner:2022-09-28T15:08:04.910Z: JOB_MESSAGE_DETAILED: Expanding SplittableProcessKeyed operations into optimizable parts.
INFO:apache_beam.runners.dataflow.dataflow_runner:2022-09-28T15:08:04.942Z: JOB_MESSAGE_DETAILED: Expanding GroupByKey operations into streaming Read/Write steps
INFO:apache_beam.runners.dataflow.dataflow_runner:2022-09-28T15:08:05.001Z: JOB_MESSAGE_DETAILED: Lifting ValueCombiningMappingFns into MergeBucketsMappingFns
INFO:apache_beam.runners.dataflow.dataflow_runner:2022-09-28T15:08:05.054Z: JOB_MESSAGE_DEBUG: Annotating graph with Autotuner information.
INFO:apache_beam.runners.dataflow.dataflow_runner:2022-09-28T15:08:05.094Z: JOB_MESSAGE_DETAILED: Fusing adjacent ParDo, Read, Write, and Flatten operations
INFO:apache_beam.runners.dataflow.dataflow_runner:2022-09-28T15:08:05.118Z: JOB_MESSAGE_DETAILED: Fusing consumer Read synthetic/Map(<lambda at iobase.py:908>) into Read synthetic/Impulse
INFO:apache_beam.runners.dataflow.dataflow_runner:2022-09-28T15:08:05.151Z: JOB_MESSAGE_DETAILED: Fusing consumer ref_AppliedPTransform_Read-synthetic-SDFBoundedSourceReader-ParDo-SDFBoundedSourceDoFn-_6/PairWithRestriction into Read synthetic/Map(<lambda at iobase.py:908>)
INFO:apache_beam.runners.dataflow.dataflow_runner:2022-09-28T15:08:05.186Z: JOB_MESSAGE_DETAILED: Fusing consumer ref_AppliedPTransform_Read-synthetic-SDFBoundedSourceReader-ParDo-SDFBoundedSourceDoFn-_6/SplitWithSizing into ref_AppliedPTransform_Read-synthetic-SDFBoundedSourceReader-ParDo-SDFBoundedSourceDoFn-_6/PairWithRestriction
INFO:apache_beam.runners.dataflow.dataflow_runner:2022-09-28T15:08:05.218Z: JOB_MESSAGE_DETAILED: Fusing consumer Measure time: Start into ref_AppliedPTransform_Read-synthetic-SDFBoundedSourceReader-ParDo-SDFBoundedSourceDoFn-_6/ProcessElementAndRestrictionWithSizing
INFO:apache_beam.runners.dataflow.dataflow_runner:2022-09-28T15:08:05.248Z: JOB_MESSAGE_DETAILED: Fusing consumer Combine with Top 0/KeyWithVoid into Measure time: Start
INFO:apache_beam.runners.dataflow.dataflow_runner:2022-09-28T15:08:05.272Z: JOB_MESSAGE_DETAILED: Fusing consumer Combine with Top 0/CombinePerKey/Combine/ConvertToAccumulators into Combine with Top 0/KeyWithVoid
INFO:apache_beam.runners.dataflow.dataflow_runner:2022-09-28T15:08:05.303Z: JOB_MESSAGE_DETAILED: Fusing consumer Combine with Top 0/CombinePerKey/GroupByKey/WriteStream into Combine with Top 0/CombinePerKey/Combine/ConvertToAccumulators
INFO:apache_beam.runners.dataflow.dataflow_runner:2022-09-28T15:08:05.324Z: JOB_MESSAGE_DETAILED: Fusing consumer Combine with Top 0/CombinePerKey/Combine into Combine with Top 0/CombinePerKey/GroupByKey/ReadStream
INFO:apache_beam.runners.dataflow.dataflow_runner:2022-09-28T15:08:05.345Z: JOB_MESSAGE_DETAILED: Fusing consumer Combine with Top 0/CombinePerKey/Combine/Extract into Combine with Top 0/CombinePerKey/Combine
INFO:apache_beam.runners.dataflow.dataflow_runner:2022-09-28T15:08:05.366Z: JOB_MESSAGE_DETAILED: Fusing consumer Combine with Top 0/UnKey into Combine with Top 0/CombinePerKey/Combine/Extract
INFO:apache_beam.runners.dataflow.dataflow_runner:2022-09-28T15:08:05.401Z: JOB_MESSAGE_DETAILED: Fusing consumer Consume 0 into Combine with Top 0/UnKey
INFO:apache_beam.runners.dataflow.dataflow_runner:2022-09-28T15:08:05.431Z: JOB_MESSAGE_DETAILED: Fusing consumer Measure time: End 0 into Consume 0
INFO:apache_beam.runners.dataflow.dataflow_runner:2022-09-28T15:08:05.536Z: JOB_MESSAGE_BASIC: Running job using Streaming Engine
INFO:apache_beam.runners.dataflow.dataflow_runner:2022-09-28T15:08:05.575Z: JOB_MESSAGE_DEBUG: Workflow config is missing a default resource spec.
INFO:apache_beam.runners.dataflow.dataflow_runner:2022-09-28T15:08:05.600Z: JOB_MESSAGE_DEBUG: Adding StepResource setup and teardown to workflow graph.
INFO:apache_beam.runners.dataflow.dataflow_runner:2022-09-28T15:08:05.622Z: JOB_MESSAGE_DEBUG: Adding workflow start and stop steps.
INFO:apache_beam.runners.dataflow.dataflow_runner:2022-09-28T15:08:05.649Z: JOB_MESSAGE_DEBUG: Assigning stage ids.
INFO:apache_beam.runners.dataflow.dataflow_runner:2022-09-28T15:08:05.706Z: JOB_MESSAGE_DEBUG: Starting **** pool setup.
INFO:apache_beam.runners.dataflow.dataflow_runner:2022-09-28T15:08:05.726Z: JOB_MESSAGE_BASIC: Starting 5 ****s in us-central1-a...
INFO:apache_beam.runners.dataflow.dataflow_runner:2022-09-28T15:08:05.766Z: JOB_MESSAGE_DEBUG: Starting **** pool setup.
INFO:apache_beam.runners.dataflow.dataflow_runner:Job 2022-09-28_08_07_49-10838804540937881587 is in state JOB_STATE_RUNNING
INFO:apache_beam.runners.dataflow.dataflow_runner:2022-09-28T15:08:22.863Z: JOB_MESSAGE_BASIC: Your project already contains 100 Dataflow-created metric descriptors, so new user metrics of the form custom.googleapis.com/* will not be created. However, all user metrics are also available in the metric dataflow.googleapis.com/job/user_counter. If you rely on the custom metrics, you can delete old / unused metric descriptors. See https://developers.google.com/apis-explorer/#p/monitoring/v3/monitoring.projects.metricDescriptors.list and https://developers.google.com/apis-explorer/#p/monitoring/v3/monitoring.projects.metricDescriptors.delete
INFO:apache_beam.runners.dataflow.dataflow_runner:2022-09-28T15:08:48.485Z: JOB_MESSAGE_DETAILED: Autoscaling: Raised the number of ****s to 5 so that the pipeline can catch up with its backlog and keep up with its input rate.
INFO:apache_beam.runners.dataflow.dataflow_runner:2022-09-28T15:09:17.517Z: JOB_MESSAGE_DETAILED: Workers have started successfully.
INFO:apache_beam.runners.dataflow.dataflow_runner:2022-09-28T16:06:03.700Z: JOB_MESSAGE_DETAILED: Autoscaling: Raised the number of ****s to 5 so that the pipeline can catch up with its backlog and keep up with its input rate.
INFO:apache_beam.runners.dataflow.dataflow_runner:2022-09-28T16:08:05.210Z: JOB_MESSAGE_DETAILED: Autoscaling: Raised the number of ****s to 5 so that the pipeline can catch up with its backlog and keep up with its input rate.
INFO:apache_beam.runners.dataflow.dataflow_runner:2022-09-28T16:50:07.005Z: JOB_MESSAGE_DETAILED: Autoscaling: Raised the number of ****s to 5 so that the pipeline can catch up with its backlog and keep up with its input rate.
INFO:apache_beam.runners.dataflow.dataflow_runner:2022-09-28T17:01:09.569Z: JOB_MESSAGE_DETAILED: Autoscaling: Raised the number of ****s to 5 so that the pipeline can catch up with its backlog and keep up with its input rate.
INFO:apache_beam.runners.dataflow.dataflow_runner:2022-09-28T17:34:12.455Z: JOB_MESSAGE_DETAILED: Autoscaling: Raised the number of ****s to 5 so that the pipeline can catch up with its backlog and keep up with its input rate.
INFO:apache_beam.runners.dataflow.dataflow_runner:2022-09-28T17:54:11.659Z: JOB_MESSAGE_DETAILED: Autoscaling: Raised the number of ****s to 5 so that the pipeline can catch up with its backlog and keep up with its input rate.
INFO:apache_beam.runners.dataflow.dataflow_runner:2022-09-28T18:23:14.389Z: JOB_MESSAGE_DETAILED: Autoscaling: Raised the number of ****s to 5 so that the pipeline can catch up with its backlog and keep up with its input rate.
INFO:apache_beam.runners.dataflow.dataflow_runner:2022-09-28T18:46:18.157Z: JOB_MESSAGE_DETAILED: Autoscaling: Raised the number of ****s to 5 so that the pipeline can catch up with its backlog and keep up with its input rate.
INFO:apache_beam.runners.dataflow.dataflow_runner:2022-09-28T19:12:19.532Z: JOB_MESSAGE_DETAILED: Autoscaling: Raised the number of ****s to 5 so that the pipeline can catch up with its backlog and keep up with its input rate.
INFO:apache_beam.runners.dataflow.dataflow_runner:2022-09-28T19:34:21.233Z: JOB_MESSAGE_DETAILED: Autoscaling: Raised the number of ****s to 5 so that the pipeline can catch up with its backlog and keep up with its input rate.
INFO:apache_beam.runners.dataflow.dataflow_runner:Job 2022-09-28_08_07_49-10838804540937881587 is in state JOB_STATE_CANCELLING
INFO:apache_beam.runners.dataflow.dataflow_runner:2022-09-28T20:01:12.204Z: JOB_MESSAGE_BASIC: Cancel request is committed for workflow job: 2022-09-28_08_07_49-10838804540937881587.
INFO:apache_beam.runners.dataflow.dataflow_runner:2022-09-28T20:01:12.244Z: JOB_MESSAGE_DETAILED: Cleaning up.
INFO:apache_beam.runners.dataflow.dataflow_runner:2022-09-28T20:01:12.317Z: JOB_MESSAGE_DEBUG: Starting **** pool teardown.
INFO:apache_beam.runners.dataflow.dataflow_runner:2022-09-28T20:01:12.344Z: JOB_MESSAGE_BASIC: Stopping **** pool...
INFO:apache_beam.runners.dataflow.dataflow_runner:2022-09-28T20:01:12.371Z: JOB_MESSAGE_DEBUG: Starting **** pool teardown.
INFO:apache_beam.runners.dataflow.dataflow_runner:2022-09-28T20:01:12.397Z: JOB_MESSAGE_BASIC: Stopping **** pool...
INFO:apache_beam.runners.dataflow.dataflow_runner:2022-09-28T20:01:13.604Z: JOB_MESSAGE_DETAILED: Autoscaling: Reduced the number of ****s to 4 based on low average **** CPU utilization, and the pipeline having sufficiently low backlog and keeping up with input rate.
Traceback (most recent call last):
  File "/usr/lib/python3.7/runpy.py", line 193, in _run_module_as_main
    "__main__", mod_spec)
  File "/usr/lib/python3.7/runpy.py", line 85, in _run_code
    exec(code, run_globals)
  File "<https://ci-beam.apache.org/job/beam_LoadTests_Python_Combine_Dataflow_Streaming/ws/src/sdks/python/apache_beam/testing/load_tests/combine_test.py",> line 129, in <module>
    CombineTest().run()
  File "<https://ci-beam.apache.org/job/beam_LoadTests_Python_Combine_Dataflow_Streaming/ws/src/sdks/python/apache_beam/testing/load_tests/load_test.py",> line 151, in run
    self.result.wait_until_finish(duration=self.timeout_ms)
  File "<https://ci-beam.apache.org/job/beam_LoadTests_Python_Combine_Dataflow_Streaming/ws/src/sdks/python/apache_beam/runners/dataflow/dataflow_runner.py",> line 1665, in wait_until_finish
    '{}'.format(consoleUrl))
AssertionError: Job did not reach to a terminal state after waiting indefinitely. Console URL: https://console.cloud.google.com/dataflow/jobs/<RegionId>/2022-09-28_08_07_49-10838804540937881587?project=<ProjectId>

> Task :sdks:python:apache_beam:testing:load_tests:run FAILED

FAILURE: Build failed with an exception.

* Where:
Build file '<https://ci-beam.apache.org/job/beam_LoadTests_Python_Combine_Dataflow_Streaming/ws/src/sdks/python/apache_beam/testing/load_tests/build.gradle'> line: 70

* What went wrong:
Execution failed for task ':sdks:python:apache_beam:testing:load_tests:run'.
> error occurred

* Try:
> Run with --stacktrace option to get the stack trace.
> Run with --info or --debug option to get more log output.

* Get more help at https://help.gradle.org

Deprecated Gradle features were used in this build, making it incompatible with Gradle 8.0.

You can use '--warning-mode all' to show the individual deprecation warnings and determine if they come from your own scripts or plugins.

See https://docs.gradle.org/7.5.1/userguide/command_line_interface.html#sec:command_line_warnings

BUILD FAILED in 4h 55m 13s
15 actionable tasks: 9 executed, 4 from cache, 2 up-to-date

Publishing build scan...
https://gradle.com/s/qskvaoo4i4bxa

Build step 'Invoke Gradle script' changed build result to FAILURE
Build step 'Invoke Gradle script' marked build as failure

---------------------------------------------------------------------
To unsubscribe, e-mail: builds-unsubscribe@beam.apache.org
For additional commands, e-mail: builds-help@beam.apache.org


Build failed in Jenkins: beam_LoadTests_Python_Combine_Dataflow_Streaming #764

Posted by Apache Jenkins Server <je...@builds.apache.org>.
See <https://ci-beam.apache.org/job/beam_LoadTests_Python_Combine_Dataflow_Streaming/764/display/redirect?page=changes>

Changes:

[ningkang0957] Upgraded Flink on Dataproc support from Interacitve Beam

[noreply] GA Migration PreCommit and PostCommit Tables in CI.md (#23372)

[noreply] Stack Trace Decoration for Beam Samza Runner (#23221)

[noreply] [#22478]: Add read_time support to Google Firestore connector (#22966)

[noreply] Changes CoGroupByKey typehint from List to Iterable (#22984)

[noreply] Fix TextSource incorrect handling in channels that return short reads.

[noreply] Add a tensorflow example to the run_inference_basic notebook (#23173)


------------------------------------------
[...truncated 23.25 KB...]
  Using cached google_cloud_bigquery_storage-2.13.2-py2.py3-none-any.whl (180 kB)
Collecting google-cloud-core<3,>=0.28.1
  Using cached google_cloud_core-2.3.2-py2.py3-none-any.whl (29 kB)
Collecting google-cloud-bigtable<2,>=0.31.1
  Using cached google_cloud_bigtable-1.7.2-py2.py3-none-any.whl (267 kB)
Collecting google-cloud-spanner<2,>=1.13.0
  Using cached google_cloud_spanner-1.19.3-py2.py3-none-any.whl (255 kB)
Collecting grpcio-gcp<1,>=0.2.2
  Using cached grpcio_gcp-0.2.2-py2.py3-none-any.whl (9.4 kB)
Collecting google-cloud-dlp<4,>=3.0.0
  Using cached google_cloud_dlp-3.9.0-py2.py3-none-any.whl (124 kB)
Collecting google-cloud-language<2,>=1.3.0
  Using cached google_cloud_language-1.3.2-py2.py3-none-any.whl (83 kB)
Collecting google-cloud-videointelligence<2,>=1.8.0
  Using cached google_cloud_videointelligence-1.16.3-py2.py3-none-any.whl (183 kB)
Collecting google-cloud-vision<2,>=0.38.0
  Using cached google_cloud_vision-1.0.2-py2.py3-none-any.whl (435 kB)
Collecting google-cloud-recommendations-ai<0.8.0,>=0.1.0
  Using cached google_cloud_recommendations_ai-0.7.1-py2.py3-none-any.whl (148 kB)
Collecting boto3>=1.9
  Using cached boto3-1.24.81-py3-none-any.whl (132 kB)
Collecting azure-storage-blob>=12.3.2
  Using cached azure_storage_blob-12.13.1-py3-none-any.whl (377 kB)
Collecting azure-core>=1.7.0
  Using cached azure_core-1.25.1-py3-none-any.whl (178 kB)
Requirement already satisfied: six>=1.11.0 in <https://ci-beam.apache.org/job/beam_LoadTests_Python_Combine_Dataflow_Streaming/ws/src/build/gradleenv/1329484227/lib/python3.7/site-packages> (from azure-core>=1.7.0->apache-beam==2.43.0.dev0) (1.16.0)
Collecting msrest>=0.6.21
  Using cached msrest-0.7.1-py3-none-any.whl (85 kB)
Collecting botocore<1.28.0,>=1.27.81
  Using cached botocore-1.27.81-py3-none-any.whl (9.2 MB)
Collecting s3transfer<0.7.0,>=0.6.0
  Using cached s3transfer-0.6.0-py3-none-any.whl (79 kB)
Collecting jmespath<2.0.0,>=0.7.1
  Using cached jmespath-1.0.1-py3-none-any.whl (20 kB)
Collecting cffi>=1.12
  Using cached cffi-1.15.1-cp37-cp37m-manylinux_2_17_x86_64.manylinux2014_x86_64.whl (427 kB)
Collecting googleapis-common-protos<2.0dev,>=1.56.2
  Using cached googleapis_common_protos-1.56.4-py2.py3-none-any.whl (211 kB)
Collecting fasteners>=0.14
  Using cached fasteners-0.18-py3-none-any.whl (18 kB)
Collecting oauth2client>=1.4.12
  Using cached oauth2client-4.1.3-py2.py3-none-any.whl (98 kB)
Collecting rsa<5,>=3.1.4
  Using cached rsa-4.9-py3-none-any.whl (34 kB)
Collecting pyasn1-modules>=0.2.1
  Using cached pyasn1_modules-0.2.8-py2.py3-none-any.whl (155 kB)
Requirement already satisfied: packaging<22.0.0dev,>=14.3 in <https://ci-beam.apache.org/job/beam_LoadTests_Python_Combine_Dataflow_Streaming/ws/src/build/gradleenv/1329484227/lib/python3.7/site-packages> (from google-cloud-bigquery<4,>=1.6.0->apache-beam==2.43.0.dev0) (21.3)
Collecting google-resumable-media<3.0dev,>=0.6.0
  Using cached google_resumable_media-2.3.3-py2.py3-none-any.whl (76 kB)
Collecting grpc-google-iam-v1<0.13dev,>=0.12.3
  Using cached grpc_google_iam_v1-0.12.4-py2.py3-none-any.whl (26 kB)
Collecting grpcio-status>=1.16.0
  Using cached grpcio_status-1.49.1-py3-none-any.whl (14 kB)
Collecting overrides<7.0.0,>=6.0.1
  Using cached overrides-6.2.0-py3-none-any.whl (17 kB)
Collecting docopt
  Using cached docopt-0.6.2-py2.py3-none-any.whl
Requirement already satisfied: pyparsing!=3.0.0,!=3.0.1,!=3.0.2,!=3.0.3,<4,>=2.4.2 in <https://ci-beam.apache.org/job/beam_LoadTests_Python_Combine_Dataflow_Streaming/ws/src/build/gradleenv/1329484227/lib/python3.7/site-packages> (from httplib2<0.21.0,>=0.8->apache-beam==2.43.0.dev0) (3.0.9)
Collecting pbr>=0.11
  Using cached pbr-5.10.0-py2.py3-none-any.whl (112 kB)
Collecting iniconfig
  Using cached iniconfig-1.1.1-py2.py3-none-any.whl (5.0 kB)
Requirement already satisfied: pluggy<2.0,>=0.12 in <https://ci-beam.apache.org/job/beam_LoadTests_Python_Combine_Dataflow_Streaming/ws/src/build/gradleenv/1329484227/lib/python3.7/site-packages> (from pytest<8.0,>=7.1.2->apache-beam==2.43.0.dev0) (1.0.0)
Collecting attrs>=19.2.0
  Using cached attrs-22.1.0-py2.py3-none-any.whl (58 kB)
Requirement already satisfied: py>=1.8.2 in <https://ci-beam.apache.org/job/beam_LoadTests_Python_Combine_Dataflow_Streaming/ws/src/build/gradleenv/1329484227/lib/python3.7/site-packages> (from pytest<8.0,>=7.1.2->apache-beam==2.43.0.dev0) (1.11.0)
Collecting tomli>=1.0.0
  Using cached tomli-2.0.1-py3-none-any.whl (12 kB)
Requirement already satisfied: importlib-metadata>=0.12 in <https://ci-beam.apache.org/job/beam_LoadTests_Python_Combine_Dataflow_Streaming/ws/src/build/gradleenv/1329484227/lib/python3.7/site-packages> (from pytest<8.0,>=7.1.2->apache-beam==2.43.0.dev0) (2.1.3)
Collecting execnet>=1.1
  Using cached execnet-1.9.0-py2.py3-none-any.whl (39 kB)
Collecting pytest-forked
  Using cached pytest_forked-1.4.0-py3-none-any.whl (4.9 kB)
Collecting certifi>=2017.4.17
  Using cached certifi-2022.9.24-py3-none-any.whl (161 kB)
Collecting charset-normalizer<3,>=2
  Using cached charset_normalizer-2.1.1-py3-none-any.whl (39 kB)
Collecting urllib3<1.27,>=1.21.1
  Using cached urllib3-1.26.12-py2.py3-none-any.whl (140 kB)
Collecting idna<4,>=2.5
  Using cached idna-3.4-py3-none-any.whl (61 kB)
Collecting threadpoolctl>=2.0.0
  Using cached threadpoolctl-3.1.0-py3-none-any.whl (14 kB)
Collecting scipy>=1.1.0
  Using cached scipy-1.7.3-cp37-cp37m-manylinux_2_12_x86_64.manylinux2010_x86_64.whl (38.1 MB)
Collecting greenlet!=0.4.17
  Using cached greenlet-1.1.3-cp37-cp37m-manylinux_2_17_x86_64.manylinux2014_x86_64.whl (150 kB)
Collecting deprecation
  Using cached deprecation-2.1.0-py2.py3-none-any.whl (11 kB)
Collecting docker>=4.0.0
  Using cached docker-6.0.0-py3-none-any.whl (147 kB)
Collecting wrapt
  Using cached wrapt-1.14.1-cp37-cp37m-manylinux_2_5_x86_64.manylinux1_x86_64.manylinux_2_17_x86_64.manylinux2014_x86_64.whl (75 kB)
Collecting pymysql
  Using cached PyMySQL-1.0.2-py3-none-any.whl (43 kB)
Collecting pycparser
  Using cached pycparser-2.21-py2.py3-none-any.whl (118 kB)
Collecting websocket-client>=0.32.0
  Using cached websocket_client-1.4.1-py3-none-any.whl (55 kB)
Collecting google-crc32c<2.0dev,>=1.0
  Using cached google_crc32c-1.5.0-cp37-cp37m-manylinux_2_17_x86_64.manylinux2014_x86_64.whl (32 kB)
Collecting grpcio-status>=1.16.0
  Using cached grpcio_status-1.48.2-py3-none-any.whl (14 kB)
Requirement already satisfied: zipp>=0.5 in <https://ci-beam.apache.org/job/beam_LoadTests_Python_Combine_Dataflow_Streaming/ws/src/build/gradleenv/1329484227/lib/python3.7/site-packages> (from importlib-metadata>=0.12->pytest<8.0,>=7.1.2->apache-beam==2.43.0.dev0) (3.8.1)
Collecting requests-oauthlib>=0.5.0
  Using cached requests_oauthlib-1.3.1-py2.py3-none-any.whl (23 kB)
Collecting isodate>=0.6.0
  Using cached isodate-0.6.1-py2.py3-none-any.whl (41 kB)
Collecting pyasn1>=0.1.7
  Using cached pyasn1-0.4.8-py2.py3-none-any.whl (77 kB)
Collecting oauthlib>=3.0.0
  Using cached oauthlib-3.2.1-py3-none-any.whl (151 kB)
Building wheels for collected packages: apache-beam
  Building wheel for apache-beam (setup.py): started
  Building wheel for apache-beam (setup.py): finished with status 'done'
  Created wheel for apache-beam: filename=apache_beam-2.43.0.dev0-py3-none-any.whl size=2867104 sha256=fea182c39d2e44517f2ffd3640585f9bab6aad7458e9eb949cbf10880b684259
  Stored in directory: /home/jenkins/.cache/pip/wheels/e6/1f/28/9337974c607f5f016ef124646a645ebf2fb34bdd32df5f9dd8
Successfully built apache-beam
Installing collected packages: pytz, pyasn1, parameterized, iniconfig, docopt, crcmod, zstandard, wrapt, websocket-client, urllib3, typing-extensions, tomli, threadpoolctl, tenacity, rsa, regex, pyyaml, python-dateutil, pymysql, pymongo, pyhamcrest, pydot, pycparser, pyasn1-modules, psycopg2-binary, proto-plus, pbr, overrides, orjson, objsize, oauthlib, numpy, joblib, jmespath, isodate, idna, httplib2, greenlet, googleapis-common-protos, google-crc32c, fasteners, fastavro, execnet, dill, cloudpickle, charset-normalizer, certifi, cachetools, attrs, sqlalchemy, scipy, requests, pyarrow, pandas, oauth2client, mock, grpcio-status, grpcio-gcp, google-resumable-media, google-auth, freezegun, deprecation, cffi, botocore, scikit-learn, s3transfer, requests-oauthlib, requests_mock, pytest, hdfs, grpc-google-iam-v1, google-auth-httplib2, google-apitools, google-api-core, docker, cryptography, azure-core, testcontainers, pytest-timeout, pytest-forked, msrest, google-cloud-core, boto3, apache-beam, pytest-xdist, google-cloud-vision, google-cloud-videointelligence, google-cloud-spanner, google-cloud-recommendations-ai, google-cloud-pubsub, google-cloud-language, google-cloud-dlp, google-cloud-datastore, google-cloud-bigtable, google-cloud-bigquery-storage, azure-storage-blob, google-cloud-pubsublite, google-cloud-bigquery
Successfully installed apache-beam-2.43.0.dev0 attrs-22.1.0 azure-core-1.25.1 azure-storage-blob-12.13.1 boto3-1.24.81 botocore-1.27.81 cachetools-4.2.4 certifi-2022.9.24 cffi-1.15.1 charset-normalizer-2.1.1 cloudpickle-2.2.0 crcmod-1.7 cryptography-38.0.1 deprecation-2.1.0 dill-0.3.1.1 docker-6.0.0 docopt-0.6.2 execnet-1.9.0 fastavro-1.6.1 fasteners-0.18 freezegun-1.2.2 google-api-core-2.10.1 google-apitools-0.5.31 google-auth-2.11.1 google-auth-httplib2-0.1.0 google-cloud-bigquery-3.3.2 google-cloud-bigquery-storage-2.13.2 google-cloud-bigtable-1.7.2 google-cloud-core-2.3.2 google-cloud-datastore-1.15.5 google-cloud-dlp-3.9.0 google-cloud-language-1.3.2 google-cloud-pubsub-2.13.7 google-cloud-pubsublite-1.5.0 google-cloud-recommendations-ai-0.7.1 google-cloud-spanner-1.19.3 google-cloud-videointelligence-1.16.3 google-cloud-vision-1.0.2 google-crc32c-1.5.0 google-resumable-media-2.3.3 googleapis-common-protos-1.56.4 greenlet-1.1.3 grpc-google-iam-v1-0.12.4 grpcio-gcp-0.2.2 grpcio-status-1.48.2 hdfs-2.7.0 httplib2-0.20.4 idna-3.4 iniconfig-1.1.1 isodate-0.6.1 jmespath-1.0.1 joblib-1.2.0 mock-2.0.0 msrest-0.7.1 numpy-1.21.6 oauth2client-4.1.3 oauthlib-3.2.1 objsize-0.5.2 orjson-3.8.0 overrides-6.2.0 pandas-1.3.5 parameterized-0.8.1 pbr-5.10.0 proto-plus-1.22.1 psycopg2-binary-2.9.3 pyarrow-9.0.0 pyasn1-0.4.8 pyasn1-modules-0.2.8 pycparser-2.21 pydot-1.4.2 pyhamcrest-1.10.1 pymongo-3.12.3 pymysql-1.0.2 pytest-7.1.3 pytest-forked-1.4.0 pytest-timeout-2.1.0 pytest-xdist-2.5.0 python-dateutil-2.8.2 pytz-2022.2.1 pyyaml-6.0 regex-2022.9.13 requests-2.28.1 requests-oauthlib-1.3.1 requests_mock-1.10.0 rsa-4.9 s3transfer-0.6.0 scikit-learn-1.0.2 scipy-1.7.3 sqlalchemy-1.4.41 tenacity-5.1.5 testcontainers-3.7.0 threadpoolctl-3.1.0 tomli-2.0.1 typing-extensions-4.3.0 urllib3-1.26.12 websocket-client-1.4.1 wrapt-1.14.1 zstandard-0.18.0

> Task :sdks:python:apache_beam:testing:load_tests:run
INFO:apache_beam.runners.portability.stager:Copying Beam SDK "<https://ci-beam.apache.org/job/beam_LoadTests_Python_Combine_Dataflow_Streaming/ws/src/sdks/python/build/apache-beam.tar.gz"> to staging location.
INFO:apache_beam.runners.dataflow.dataflow_runner:Pipeline has additional dependencies to be installed in SDK **** container, consider using the SDK container image pre-building workflow to avoid repetitive installations. Learn more on https://cloud.google.com/dataflow/docs/guides/using-custom-containers#prebuild
INFO:root:Default Python SDK image for environment is apache/beam_python3.7_sdk:2.43.0.dev
INFO:root:Using provided Python SDK container image: gcr.io/cloud-dataflow/v1beta3/python37-fnapi:beam-master-20220914
INFO:root:Python SDK container image set to "gcr.io/cloud-dataflow/v1beta3/python37-fnapi:beam-master-20220914" for Docker environment
INFO:apache_beam.runners.dataflow.internal.apiclient:Defaulting to the temp_location as staging_location: gs://temp-storage-for-perf-tests/smoketests
INFO:apache_beam.internal.gcp.auth:Setting socket default timeout to 60 seconds.
INFO:apache_beam.internal.gcp.auth:socket default timeout is 60.0 seconds.
INFO:apache_beam.runners.dataflow.internal.apiclient:Starting GCS upload to gs://temp-storage-for-perf-tests/smoketests/load-tests-python-dataflow-streaming-combine-1-0927150207.1664291267.634174/dataflow_python_sdk.tar...
INFO:apache_beam.runners.dataflow.internal.apiclient:Completed GCS upload to gs://temp-storage-for-perf-tests/smoketests/load-tests-python-dataflow-streaming-combine-1-0927150207.1664291267.634174/dataflow_python_sdk.tar in 0 seconds.
INFO:apache_beam.runners.dataflow.internal.apiclient:Starting GCS upload to gs://temp-storage-for-perf-tests/smoketests/load-tests-python-dataflow-streaming-combine-1-0927150207.1664291267.634174/pipeline.pb...
INFO:apache_beam.runners.dataflow.internal.apiclient:Completed GCS upload to gs://temp-storage-for-perf-tests/smoketests/load-tests-python-dataflow-streaming-combine-1-0927150207.1664291267.634174/pipeline.pb in 0 seconds.
INFO:apache_beam.runners.dataflow.internal.apiclient:Create job: <Job
 clientRequestId: '20220927150747635231-8848'
 createTime: '2022-09-27T15:07:48.697809Z'
 currentStateTime: '1970-01-01T00:00:00Z'
 id: '2022-09-27_08_07_48-2105541837588288613'
 location: 'us-central1'
 name: 'load-tests-python-dataflow-streaming-combine-1-0927150207'
 projectId: 'apache-beam-testing'
 stageStates: []
 startTime: '2022-09-27T15:07:48.697809Z'
 steps: []
 tempFiles: []
 type: TypeValueValuesEnum(JOB_TYPE_STREAMING, 2)>
INFO:apache_beam.runners.dataflow.internal.apiclient:Created job with id: [2022-09-27_08_07_48-2105541837588288613]
INFO:apache_beam.runners.dataflow.internal.apiclient:Submitted job: 2022-09-27_08_07_48-2105541837588288613
INFO:apache_beam.runners.dataflow.internal.apiclient:To access the Dataflow monitoring console, please navigate to https://console.cloud.google.com/dataflow/jobs/us-central1/2022-09-27_08_07_48-2105541837588288613?project=apache-beam-testing
INFO:apache_beam.runners.dataflow.dataflow_runner:Job 2022-09-27_08_07_48-2105541837588288613 is in state JOB_STATE_PENDING
INFO:apache_beam.runners.dataflow.dataflow_runner:2022-09-27T15:07:57.203Z: JOB_MESSAGE_BASIC: Worker configuration: e2-standard-2 in us-central1-a.
INFO:apache_beam.runners.dataflow.dataflow_runner:2022-09-27T15:07:58.557Z: JOB_MESSAGE_DETAILED: Expanding SplittableParDo operations into optimizable parts.
INFO:apache_beam.runners.dataflow.dataflow_runner:2022-09-27T15:07:58.611Z: JOB_MESSAGE_DETAILED: Expanding CollectionToSingleton operations into optimizable parts.
INFO:apache_beam.runners.dataflow.dataflow_runner:2022-09-27T15:07:58.717Z: JOB_MESSAGE_DETAILED: Expanding CoGroupByKey operations into optimizable parts.
INFO:apache_beam.runners.dataflow.dataflow_runner:2022-09-27T15:07:58.803Z: JOB_MESSAGE_DETAILED: Expanding SplittableProcessKeyed operations into optimizable parts.
INFO:apache_beam.runners.dataflow.dataflow_runner:2022-09-27T15:07:58.837Z: JOB_MESSAGE_DETAILED: Expanding GroupByKey operations into streaming Read/Write steps
INFO:apache_beam.runners.dataflow.dataflow_runner:2022-09-27T15:07:58.894Z: JOB_MESSAGE_DETAILED: Lifting ValueCombiningMappingFns into MergeBucketsMappingFns
INFO:apache_beam.runners.dataflow.dataflow_runner:2022-09-27T15:07:58.972Z: JOB_MESSAGE_DEBUG: Annotating graph with Autotuner information.
INFO:apache_beam.runners.dataflow.dataflow_runner:2022-09-27T15:07:59.014Z: JOB_MESSAGE_DETAILED: Fusing adjacent ParDo, Read, Write, and Flatten operations
INFO:apache_beam.runners.dataflow.dataflow_runner:2022-09-27T15:07:59.069Z: JOB_MESSAGE_DETAILED: Fusing consumer Read synthetic/Map(<lambda at iobase.py:908>) into Read synthetic/Impulse
INFO:apache_beam.runners.dataflow.dataflow_runner:2022-09-27T15:07:59.100Z: JOB_MESSAGE_DETAILED: Fusing consumer ref_AppliedPTransform_Read-synthetic-SDFBoundedSourceReader-ParDo-SDFBoundedSourceDoFn-_6/PairWithRestriction into Read synthetic/Map(<lambda at iobase.py:908>)
INFO:apache_beam.runners.dataflow.dataflow_runner:2022-09-27T15:07:59.193Z: JOB_MESSAGE_DETAILED: Fusing consumer ref_AppliedPTransform_Read-synthetic-SDFBoundedSourceReader-ParDo-SDFBoundedSourceDoFn-_6/SplitWithSizing into ref_AppliedPTransform_Read-synthetic-SDFBoundedSourceReader-ParDo-SDFBoundedSourceDoFn-_6/PairWithRestriction
INFO:apache_beam.runners.dataflow.dataflow_runner:2022-09-27T15:07:59.226Z: JOB_MESSAGE_DETAILED: Fusing consumer Measure time: Start into ref_AppliedPTransform_Read-synthetic-SDFBoundedSourceReader-ParDo-SDFBoundedSourceDoFn-_6/ProcessElementAndRestrictionWithSizing
INFO:apache_beam.runners.dataflow.dataflow_runner:2022-09-27T15:07:59.268Z: JOB_MESSAGE_DETAILED: Fusing consumer Combine with Top 0/KeyWithVoid into Measure time: Start
INFO:apache_beam.runners.dataflow.dataflow_runner:2022-09-27T15:07:59.303Z: JOB_MESSAGE_DETAILED: Fusing consumer Combine with Top 0/CombinePerKey/Combine/ConvertToAccumulators into Combine with Top 0/KeyWithVoid
INFO:apache_beam.runners.dataflow.dataflow_runner:2022-09-27T15:07:59.346Z: JOB_MESSAGE_DETAILED: Fusing consumer Combine with Top 0/CombinePerKey/GroupByKey/WriteStream into Combine with Top 0/CombinePerKey/Combine/ConvertToAccumulators
INFO:apache_beam.runners.dataflow.dataflow_runner:2022-09-27T15:07:59.379Z: JOB_MESSAGE_DETAILED: Fusing consumer Combine with Top 0/CombinePerKey/Combine into Combine with Top 0/CombinePerKey/GroupByKey/ReadStream
INFO:apache_beam.runners.dataflow.dataflow_runner:2022-09-27T15:07:59.413Z: JOB_MESSAGE_DETAILED: Fusing consumer Combine with Top 0/CombinePerKey/Combine/Extract into Combine with Top 0/CombinePerKey/Combine
INFO:apache_beam.runners.dataflow.dataflow_runner:2022-09-27T15:07:59.448Z: JOB_MESSAGE_DETAILED: Fusing consumer Combine with Top 0/UnKey into Combine with Top 0/CombinePerKey/Combine/Extract
INFO:apache_beam.runners.dataflow.dataflow_runner:2022-09-27T15:07:59.482Z: JOB_MESSAGE_DETAILED: Fusing consumer Consume 0 into Combine with Top 0/UnKey
INFO:apache_beam.runners.dataflow.dataflow_runner:2022-09-27T15:07:59.515Z: JOB_MESSAGE_DETAILED: Fusing consumer Measure time: End 0 into Consume 0
INFO:apache_beam.runners.dataflow.dataflow_runner:2022-09-27T15:07:59.663Z: JOB_MESSAGE_BASIC: Running job using Streaming Engine
INFO:apache_beam.runners.dataflow.dataflow_runner:2022-09-27T15:07:59.709Z: JOB_MESSAGE_DEBUG: Workflow config is missing a default resource spec.
INFO:apache_beam.runners.dataflow.dataflow_runner:2022-09-27T15:07:59.738Z: JOB_MESSAGE_DEBUG: Adding StepResource setup and teardown to workflow graph.
INFO:apache_beam.runners.dataflow.dataflow_runner:2022-09-27T15:07:59.767Z: JOB_MESSAGE_DEBUG: Adding workflow start and stop steps.
INFO:apache_beam.runners.dataflow.dataflow_runner:2022-09-27T15:07:59.792Z: JOB_MESSAGE_DEBUG: Assigning stage ids.
INFO:apache_beam.runners.dataflow.dataflow_runner:2022-09-27T15:07:59.882Z: JOB_MESSAGE_DEBUG: Starting **** pool setup.
INFO:apache_beam.runners.dataflow.dataflow_runner:2022-09-27T15:07:59.920Z: JOB_MESSAGE_BASIC: Starting 5 ****s in us-central1-a...
INFO:apache_beam.runners.dataflow.dataflow_runner:2022-09-27T15:08:00.013Z: JOB_MESSAGE_DEBUG: Starting **** pool setup.
INFO:apache_beam.runners.dataflow.dataflow_runner:Job 2022-09-27_08_07_48-2105541837588288613 is in state JOB_STATE_RUNNING
INFO:apache_beam.runners.dataflow.dataflow_runner:2022-09-27T15:08:36.192Z: JOB_MESSAGE_BASIC: Your project already contains 100 Dataflow-created metric descriptors, so new user metrics of the form custom.googleapis.com/* will not be created. However, all user metrics are also available in the metric dataflow.googleapis.com/job/user_counter. If you rely on the custom metrics, you can delete old / unused metric descriptors. See https://developers.google.com/apis-explorer/#p/monitoring/v3/monitoring.projects.metricDescriptors.list and https://developers.google.com/apis-explorer/#p/monitoring/v3/monitoring.projects.metricDescriptors.delete
INFO:apache_beam.runners.dataflow.dataflow_runner:2022-09-27T15:08:40.290Z: JOB_MESSAGE_DETAILED: Autoscaling: Raised the number of ****s to 4 so that the pipeline can catch up with its backlog and keep up with its input rate.
INFO:apache_beam.runners.dataflow.dataflow_runner:2022-09-27T15:08:40.320Z: JOB_MESSAGE_DETAILED: Autoscaling: Resized **** pool to 4, though goal was 5.  This could be a quota issue.
INFO:apache_beam.runners.dataflow.dataflow_runner:2022-09-27T15:09:00.879Z: JOB_MESSAGE_DETAILED: Autoscaling: Raised the number of ****s to 5 so that the pipeline can catch up with its backlog and keep up with its input rate.
INFO:apache_beam.runners.dataflow.dataflow_runner:2022-09-27T15:09:07.193Z: JOB_MESSAGE_DETAILED: Workers have started successfully.
INFO:apache_beam.runners.dataflow.dataflow_runner:2022-09-27T16:06:56.356Z: JOB_MESSAGE_DETAILED: Autoscaling: Raised the number of ****s to 5 so that the pipeline can catch up with its backlog and keep up with its input rate.
INFO:apache_beam.runners.dataflow.dataflow_runner:2022-09-27T16:07:58.282Z: JOB_MESSAGE_DETAILED: Autoscaling: Raised the number of ****s to 5 so that the pipeline can catch up with its backlog and keep up with its input rate.
INFO:apache_beam.runners.dataflow.dataflow_runner:2022-09-27T16:50:59.659Z: JOB_MESSAGE_DETAILED: Autoscaling: Raised the number of ****s to 5 so that the pipeline can catch up with its backlog and keep up with its input rate.
INFO:apache_beam.runners.dataflow.dataflow_runner:2022-09-27T16:54:01.615Z: JOB_MESSAGE_DETAILED: Autoscaling: Raised the number of ****s to 5 so that the pipeline can catch up with its backlog and keep up with its input rate.
INFO:apache_beam.runners.dataflow.dataflow_runner:2022-09-27T17:02:03.632Z: JOB_MESSAGE_DETAILED: Autoscaling: Raised the number of ****s to 5 so that the pipeline can catch up with its backlog and keep up with its input rate.
INFO:apache_beam.runners.dataflow.dataflow_runner:2022-09-27T17:39:04.087Z: JOB_MESSAGE_DETAILED: Autoscaling: Raised the number of ****s to 5 so that the pipeline can catch up with its backlog and keep up with its input rate.
INFO:apache_beam.runners.dataflow.dataflow_runner:2022-09-27T17:56:08.268Z: JOB_MESSAGE_DETAILED: Autoscaling: Raised the number of ****s to 5 so that the pipeline can catch up with its backlog and keep up with its input rate.
INFO:apache_beam.runners.dataflow.dataflow_runner:2022-09-27T18:24:07.928Z: JOB_MESSAGE_DETAILED: Autoscaling: Raised the number of ****s to 5 so that the pipeline can catch up with its backlog and keep up with its input rate.
INFO:apache_beam.runners.dataflow.dataflow_runner:2022-09-27T18:45:11.360Z: JOB_MESSAGE_DETAILED: Autoscaling: Raised the number of ****s to 5 so that the pipeline can catch up with its backlog and keep up with its input rate.
INFO:apache_beam.runners.dataflow.dataflow_runner:2022-09-27T19:10:13.841Z: JOB_MESSAGE_DETAILED: Autoscaling: Raised the number of ****s to 5 so that the pipeline can catch up with its backlog and keep up with its input rate.
INFO:apache_beam.runners.dataflow.dataflow_runner:2022-09-27T19:34:13.126Z: JOB_MESSAGE_DETAILED: Autoscaling: Raised the number of ****s to 5 so that the pipeline can catch up with its backlog and keep up with its input rate.
INFO:apache_beam.runners.dataflow.dataflow_runner:2022-09-27T19:58:16.915Z: JOB_MESSAGE_DETAILED: Autoscaling: Raised the number of ****s to 5 so that the pipeline can catch up with its backlog and keep up with its input rate.
INFO:apache_beam.runners.dataflow.dataflow_runner:Job 2022-09-27_08_07_48-2105541837588288613 is in state JOB_STATE_CANCELLING
INFO:apache_beam.runners.dataflow.dataflow_runner:2022-09-27T20:00:50.807Z: JOB_MESSAGE_BASIC: Cancel request is committed for workflow job: 2022-09-27_08_07_48-2105541837588288613.
INFO:apache_beam.runners.dataflow.dataflow_runner:2022-09-27T20:00:50.839Z: JOB_MESSAGE_DETAILED: Cleaning up.
INFO:apache_beam.runners.dataflow.dataflow_runner:2022-09-27T20:00:50.917Z: JOB_MESSAGE_DEBUG: Starting **** pool teardown.
INFO:apache_beam.runners.dataflow.dataflow_runner:2022-09-27T20:00:50.949Z: JOB_MESSAGE_BASIC: Stopping **** pool...
INFO:apache_beam.runners.dataflow.dataflow_runner:2022-09-27T20:00:50.989Z: JOB_MESSAGE_DEBUG: Starting **** pool teardown.
INFO:apache_beam.runners.dataflow.dataflow_runner:2022-09-27T20:00:51.013Z: JOB_MESSAGE_BASIC: Stopping **** pool...
Traceback (most recent call last):
  File "/usr/lib/python3.7/runpy.py", line 193, in _run_module_as_main
    "__main__", mod_spec)
  File "/usr/lib/python3.7/runpy.py", line 85, in _run_code
    exec(code, run_globals)
  File "<https://ci-beam.apache.org/job/beam_LoadTests_Python_Combine_Dataflow_Streaming/ws/src/sdks/python/apache_beam/testing/load_tests/combine_test.py",> line 129, in <module>
    CombineTest().run()
  File "<https://ci-beam.apache.org/job/beam_LoadTests_Python_Combine_Dataflow_Streaming/ws/src/sdks/python/apache_beam/testing/load_tests/load_test.py",> line 151, in run
    self.result.wait_until_finish(duration=self.timeout_ms)
  File "<https://ci-beam.apache.org/job/beam_LoadTests_Python_Combine_Dataflow_Streaming/ws/src/sdks/python/apache_beam/runners/dataflow/dataflow_runner.py",> line 1665, in wait_until_finish
    '{}'.format(consoleUrl))
AssertionError: Job did not reach to a terminal state after waiting indefinitely. Console URL: https://console.cloud.google.com/dataflow/jobs/<RegionId>/2022-09-27_08_07_48-2105541837588288613?project=<ProjectId>

> Task :sdks:python:apache_beam:testing:load_tests:run FAILED

FAILURE: Build failed with an exception.

* Where:
Build file '<https://ci-beam.apache.org/job/beam_LoadTests_Python_Combine_Dataflow_Streaming/ws/src/sdks/python/apache_beam/testing/load_tests/build.gradle'> line: 70

* What went wrong:
Execution failed for task ':sdks:python:apache_beam:testing:load_tests:run'.
> error occurred

* Try:
> Run with --stacktrace option to get the stack trace.
> Run with --info or --debug option to get more log output.

* Get more help at https://help.gradle.org

Deprecated Gradle features were used in this build, making it incompatible with Gradle 8.0.

You can use '--warning-mode all' to show the individual deprecation warnings and determine if they come from your own scripts or plugins.

See https://docs.gradle.org/7.5.1/userguide/command_line_interface.html#sec:command_line_warnings

BUILD FAILED in 4h 55m 15s
15 actionable tasks: 9 executed, 4 from cache, 2 up-to-date

Publishing build scan...
https://gradle.com/s/2r267hywytnw2

Build step 'Invoke Gradle script' changed build result to FAILURE
Build step 'Invoke Gradle script' marked build as failure

---------------------------------------------------------------------
To unsubscribe, e-mail: builds-unsubscribe@beam.apache.org
For additional commands, e-mail: builds-help@beam.apache.org