You are viewing a plain text version of this content. The canonical link for it is here.
Posted to dev@pdfbox.apache.org by Apache Jenkins Server <je...@builds.apache.org> on 2023/06/13 12:15:09 UTC

Build failed in Jenkins: PDFBox » PDFBox-sonar2 #1059

See <https://ci-builds.apache.org/job/PDFBox/job/PDFBox-sonar2/1059/display/redirect?page=changes>

Changes:

[Tilman Hausherr] PDFBOX-5620: BitsPerComponent 16 is invalid for PDF/A-1b, as reported by vasterasstad in the VeraPDF project


------------------------------------------
[...truncated 30.40 KB...]
[INFO] Tests run: 22, Failures: 0, Errors: 0, Skipped: 0, Time elapsed: 0.047 s - in org.apache.xmpbox.schema.XMPMediaManagementTest
[INFO] Running org.apache.xmpbox.schema.XMPSchemaTest
[INFO] Tests run: 12, Failures: 0, Errors: 0, Skipped: 0, Time elapsed: 0.012 s - in org.apache.xmpbox.schema.XMPSchemaTest
[INFO] Running org.apache.xmpbox.schema.TestExifXmp
[INFO] Tests run: 2, Failures: 0, Errors: 0, Skipped: 0, Time elapsed: 0.247 s - in org.apache.xmpbox.schema.TestExifXmp
[INFO] Running org.apache.xmpbox.schema.AdobePDFTest
[INFO] Tests run: 8, Failures: 0, Errors: 0, Skipped: 0, Time elapsed: 0.021 s - in org.apache.xmpbox.schema.AdobePDFTest
[INFO] Running org.apache.xmpbox.schema.DublinCoreTest
[INFO] Tests run: 108, Failures: 0, Errors: 0, Skipped: 0, Time elapsed: 0.384 s - in org.apache.xmpbox.schema.DublinCoreTest
[INFO] Running org.apache.xmpbox.schema.PDFAIdentificationOthersTest
[INFO] Tests run: 3, Failures: 0, Errors: 0, Skipped: 0, Time elapsed: 0.013 s - in org.apache.xmpbox.schema.PDFAIdentificationOthersTest
[INFO] Running org.apache.xmpbox.schema.BasicJobTicketSchemaTest
[INFO] Tests run: 3, Failures: 0, Errors: 0, Skipped: 0, Time elapsed: 0.02 s - in org.apache.xmpbox.schema.BasicJobTicketSchemaTest
[INFO] Running org.apache.xmpbox.schema.PDFAIdentificationTest
[INFO] Tests run: 6, Failures: 0, Errors: 0, Skipped: 0, Time elapsed: 0.012 s - in org.apache.xmpbox.schema.PDFAIdentificationTest
[INFO] Running org.apache.xmpbox.schema.PhotoshopSchemaTest
[INFO] Tests run: 162, Failures: 0, Errors: 0, Skipped: 0, Time elapsed: 0.346 s - in org.apache.xmpbox.schema.PhotoshopSchemaTest
[INFO] Running org.apache.xmpbox.schema.XMPBasicTest
[INFO] Tests run: 22, Failures: 0, Errors: 0, Skipped: 0, Time elapsed: 0.032 s - in org.apache.xmpbox.schema.XMPBasicTest
[INFO] Running org.apache.xmpbox.schema.AdobePDFErrorsTest
[INFO] Tests run: 3, Failures: 0, Errors: 0, Skipped: 0, Time elapsed: 0.002 s - in org.apache.xmpbox.schema.AdobePDFErrorsTest
[INFO] 
[INFO] Results:
[INFO] 
[INFO] Tests run: 807, Failures: 0, Errors: 0, Skipped: 0
[INFO] 
[JENKINS] Recording test results
[INFO] 
[INFO] --- jacoco:0.8.10:report (report) @ xmpbox ---
[INFO] Loading execution data file <https://ci-builds.apache.org/job/PDFBox/job/PDFBox-sonar2/ws/xmpbox/target/jacoco.exec>
[INFO] Analyzed bundle 'Apache XmpBox' with 73 classes
[INFO] 
[INFO] --- animal-sniffer:1.23:check (check-java-version) @ xmpbox ---
[INFO] Checking unresolved references to org.codehaus.mojo.signature:java18:1.0
[INFO] 
[INFO] --- bundle:5.1.9:bundle (default-bundle) @ xmpbox ---
[INFO] Building bundle: <https://ci-builds.apache.org/job/PDFBox/job/PDFBox-sonar2/ws/xmpbox/target/xmpbox-3.0.0-SNAPSHOT.jar>
[INFO] Writing manifest: <https://ci-builds.apache.org/job/PDFBox/job/PDFBox-sonar2/ws/xmpbox/target/classes/META-INF/MANIFEST.MF>
[INFO] 
[INFO] --- site:3.12.1:attach-descriptor (attach-descriptor) @ xmpbox ---
[INFO] Skipping because packaging 'bundle' is not pom.
[INFO] 
[INFO] >>> source:3.2.1:jar (attach-sources) > generate-sources @ xmpbox >>>
[INFO] 
[INFO] --- enforcer:3.3.0:enforce (default) @ xmpbox ---
[INFO] 
[INFO] --- enforcer:3.3.0:enforce (enforce-maven-version) @ xmpbox ---
[INFO] 
[INFO] --- enforcer:3.3.0:enforce (enforce-java-version) @ xmpbox ---
[INFO] 
[INFO] --- jacoco:0.8.10:prepare-agent (default) @ xmpbox ---
[INFO] surefireArgLine set to -javaagent:/home/jenkins/.m2/repository/org/jacoco/org.jacoco.agent/0.8.10/org.jacoco.agent-0.8.10-runtime.jar=destfile=<https://ci-builds.apache.org/job/PDFBox/job/PDFBox-sonar2/ws/xmpbox/target/jacoco.exec>
[WARNING] Failed to getClass for org.apache.maven.plugins.source.SourceJarMojo
[INFO] 
[INFO] <<< source:3.2.1:jar (attach-sources) < generate-sources @ xmpbox <<<
[INFO] 
[INFO] 
[INFO] --- source:3.2.1:jar (attach-sources) @ xmpbox ---
[INFO] 
[INFO] ----------------------< org.apache.pdfbox:pdfbox >----------------------
[INFO] Building Apache PDFBox 3.0.0-SNAPSHOT                             [5/13]
[INFO]   from pdfbox/pom.xml
[INFO] -------------------------------[ bundle ]-------------------------------
[INFO] 
[INFO] --- enforcer:3.3.0:enforce (default) @ pdfbox ---
[INFO] 
[INFO] --- enforcer:3.3.0:enforce (enforce-maven-version) @ pdfbox ---
[INFO] 
[INFO] --- enforcer:3.3.0:enforce (enforce-java-version) @ pdfbox ---
[INFO] 
[INFO] --- jacoco:0.8.10:prepare-agent (default) @ pdfbox ---
[INFO] surefireArgLine set to -javaagent:/home/jenkins/.m2/repository/org/jacoco/org.jacoco.agent/0.8.10/org.jacoco.agent-0.8.10-runtime.jar=destfile=<https://ci-builds.apache.org/job/PDFBox/job/PDFBox-sonar2/ws/pdfbox/target/jacoco.exec>
[INFO] 
[INFO] --- remote-resources:1.7.0:process (process-resource-bundles) @ pdfbox ---
[INFO] Preparing remote bundle org.apache:apache-jar-resource-bundle:1.4
[INFO] Copying 3 resources from 1 bundle.
[INFO] Copying appended resource: META-INF/NOTICE
[INFO] Copying appended resource: META-INF/LICENSE
[INFO] 
[INFO] --- resources:3.3.0:resources (default-resources) @ pdfbox ---
[INFO] Copying 1 resource
[INFO] Copying 21 resources
[INFO] Copying 3 resources
[INFO] The encoding used to copy filtered properties files have not been set. This means that the same encoding will be used to copy filtered properties files as when copying other filtered resources. This might not be what you want! Run your build with --debug to see which files might be affected. Read more at https://maven.apache.org/plugins/maven-resources-plugin/examples/filtering-properties-files.html
[INFO] 
[INFO] --- compiler:3.10.1:compile (default-compile) @ pdfbox ---
[INFO] Changes detected - recompiling the module!
[INFO] Compiling 613 source files to <https://ci-builds.apache.org/job/PDFBox/job/PDFBox-sonar2/ws/pdfbox/target/classes>
[WARNING] <https://ci-builds.apache.org/job/PDFBox/job/PDFBox-sonar2/ws/pdfbox/src/main/java/org/apache/pdfbox/pdmodel/font/PDType3Font.java>:[202,18] getHeight(int) in org.apache.pdfbox.pdmodel.font.PDFontLike has been deprecated
[WARNING] <https://ci-builds.apache.org/job/PDFBox/job/PDFBox-sonar2/ws/pdfbox/src/main/java/org/apache/pdfbox/pdmodel/font/PDType0Font.java>:[468,18] getHeight(int) in org.apache.pdfbox.pdmodel.font.PDFontLike has been deprecated
[WARNING] <https://ci-builds.apache.org/job/PDFBox/job/PDFBox-sonar2/ws/pdfbox/src/main/java/org/apache/pdfbox/pdmodel/font/PDType0Font.java>:[470,30] getHeight(int) in org.apache.pdfbox.pdmodel.font.PDFontLike has been deprecated
[WARNING] <https://ci-builds.apache.org/job/PDFBox/job/PDFBox-sonar2/ws/pdfbox/src/main/java/org/apache/pdfbox/pdmodel/encryption/SecurityHandler.java>:[634,19] setValue(byte[]) in org.apache.pdfbox.cos.COSString has been deprecated
[WARNING] <https://ci-builds.apache.org/job/PDFBox/job/PDFBox-sonar2/ws/pdfbox/src/main/java/org/apache/pdfbox/pdmodel/encryption/SecurityHandler.java>:[657,15] setValue(byte[]) in org.apache.pdfbox.cos.COSString has been deprecated
[WARNING] <https://ci-builds.apache.org/job/PDFBox/job/PDFBox-sonar2/ws/pdfbox/src/main/java/org/apache/pdfbox/pdmodel/font/PDCIDFontType2.java>:[324,18] getHeight(int) in org.apache.pdfbox.pdmodel.font.PDFontLike has been deprecated
[WARNING] <https://ci-builds.apache.org/job/PDFBox/job/PDFBox-sonar2/ws/pdfbox/src/main/java/org/apache/pdfbox/pdmodel/font/PDType1CFont.java>:[368,18] getHeight(int) in org.apache.pdfbox.pdmodel.font.PDFontLike has been deprecated
[WARNING] <https://ci-builds.apache.org/job/PDFBox/job/PDFBox-sonar2/ws/pdfbox/src/main/java/org/apache/pdfbox/pdmodel/font/PDType1Font.java>:[377,18] getHeight(int) in org.apache.pdfbox.pdmodel.font.PDFontLike has been deprecated
[WARNING] <https://ci-builds.apache.org/job/PDFBox/job/PDFBox-sonar2/ws/pdfbox/src/main/java/org/apache/pdfbox/pdmodel/font/PDCIDFontType0.java>:[445,18] getHeight(int) in org.apache.pdfbox.pdmodel.font.PDFontLike has been deprecated
[WARNING] <https://ci-builds.apache.org/job/PDFBox/job/PDFBox-sonar2/ws/pdfbox/src/main/java/org/apache/pdfbox/pdmodel/font/PDTrueTypeFont.java>:[375,18] getHeight(int) in org.apache.pdfbox.pdmodel.font.PDFontLike has been deprecated
[INFO] <https://ci-builds.apache.org/job/PDFBox/job/PDFBox-sonar2/ws/pdfbox/src/main/java/org/apache/pdfbox/pdmodel/common/PDStream.java>: Some input files use unchecked or unsafe operations.
[INFO] <https://ci-builds.apache.org/job/PDFBox/job/PDFBox-sonar2/ws/pdfbox/src/main/java/org/apache/pdfbox/pdmodel/common/PDStream.java>: Recompile with -Xlint:unchecked for details.
[INFO] 
[INFO] --- download:1.7.0:wget (PDFBOX-1031-1) @ pdfbox ---
[INFO] File already exist, skipping
[INFO] 
[INFO] --- download:1.7.0:wget (PDFBOX-1031-2) @ pdfbox ---
[INFO] File already exist, skipping
[INFO] 
[INFO] --- download:1.7.0:wget (PDFBOX-1065-1) @ pdfbox ---
[INFO] File already exist, skipping
[INFO] 
[INFO] --- download:1.7.0:wget (PDFBOX-1065-2) @ pdfbox ---
[INFO] File already exist, skipping
[INFO] 
[INFO] --- download:1.7.0:wget (PDFBOX-1100-1) @ pdfbox ---
[INFO] File already exist, skipping
[INFO] 
[INFO] --- download:1.7.0:wget (PDFBOX-1100-2) @ pdfbox ---
[INFO] File already exist, skipping
[INFO] 
[INFO] --- download:1.7.0:wget (PDFBOX-3208) @ pdfbox ---
[INFO] File already exist, skipping
[INFO] 
[INFO] --- download:1.7.0:wget (PDFBOX-3656) @ pdfbox ---
[INFO] File already exist, skipping
[INFO] 
[INFO] --- download:1.7.0:wget (PDFBOX-3682) @ pdfbox ---
[INFO] File already exist, skipping
[INFO] 
[INFO] --- download:1.7.0:wget (PDFBOX-3940) @ pdfbox ---
[INFO] File already exist, skipping
[INFO] 
[INFO] --- download:1.7.0:wget (PDFBOX-3783) @ pdfbox ---
[INFO] File already exist, skipping
[INFO] 
[INFO] --- download:1.7.0:wget (PDFBOX-3785) @ pdfbox ---
[INFO] File already exist, skipping
[INFO] 
[INFO] --- download:1.7.0:wget (PDFBOX-3947) @ pdfbox ---
[INFO] File already exist, skipping
[INFO] 
[INFO] --- download:1.7.0:wget (PDFBOX-3948) @ pdfbox ---
[INFO] File already exist, skipping
[INFO] 
[INFO] --- download:1.7.0:wget (PDFBOX-3949) @ pdfbox ---
[INFO] File already exist, skipping
[INFO] 
[INFO] --- download:1.7.0:wget (PDFBOX-3950) @ pdfbox ---
[INFO] File already exist, skipping
[INFO] 
[INFO] --- download:1.7.0:wget (PDFBOX-3951) @ pdfbox ---
[INFO] File already exist, skipping
[INFO] 
[INFO] --- download:1.7.0:wget (PDFBOX-3964) @ pdfbox ---
[INFO] File already exist, skipping
[INFO] 
[INFO] --- download:1.7.0:wget (PDFBOX-3977) @ pdfbox ---
[INFO] File already exist, skipping
[INFO] 
[INFO] --- download:1.7.0:wget (Genko) @ pdfbox ---
[INFO] File already exist, skipping
[INFO] 
[INFO] --- download:1.7.0:wget (PDFBOX-3999) @ pdfbox ---
[INFO] File already exist, skipping
[INFO] 
[INFO] --- download:1.7.0:wget (PDFBOX-4106) @ pdfbox ---
[INFO] File already exist, skipping
[INFO] 
[INFO] ------------------------------------------------------------------------
[INFO] Skipping Apache PDFBox
[INFO] This project has been banned from the build due to previous failures.
[INFO] ------------------------------------------------------------------------
[INFO] ------------------------------------------------------------------------
[INFO] Reactor Summary for Apache PDFBox 3.0.0-SNAPSHOT:
[INFO] 
[INFO] PDFBox parent ...................................... SUCCESS [ 20.031 s]
[INFO] Apache PDFBox io ................................... SUCCESS [ 40.666 s]
[INFO] Apache FontBox ..................................... SUCCESS [ 29.015 s]
[INFO] Apache XmpBox ...................................... SUCCESS [ 15.315 s]
[INFO] Apache PDFBox ...................................... FAILURE [ 22.907 s]
[INFO] Apache Preflight ................................... SKIPPED
[INFO] Apache Preflight application ....................... SKIPPED
[INFO] Apache PDFBox Debugger ............................. SKIPPED
[INFO] Apache PDFBox tools ................................ SKIPPED
[INFO] Apache PDFBox application .......................... SKIPPED
[INFO] Apache PDFBox Debugger application ................. SKIPPED
[INFO] Apache PDFBox examples ............................. SKIPPED
[INFO] Apache PDFBox ...................................... SKIPPED
[INFO] ------------------------------------------------------------------------
[INFO] BUILD FAILURE
[INFO] ------------------------------------------------------------------------
[INFO] Total time:  02:50 min
[INFO] Finished at: 2023-06-13T12:14:43Z
[INFO] ------------------------------------------------------------------------
[WARNING] 
[WARNING] Plugin validation issues were detected in 10 plugin(s)
[WARNING] 
[WARNING]  * org.apache.maven.plugins:maven-scm-plugin:1.13.0
[WARNING]  * org.apache.maven.plugins:maven-source-plugin:3.2.1
[WARNING]  * org.jacoco:jacoco-maven-plugin:0.8.10
[WARNING]  * org.apache.maven.plugins:maven-site-plugin:3.12.1
[WARNING]  * org.apache.felix:maven-bundle-plugin:5.1.9
[WARNING]  * org.apache.maven.plugins:maven-compiler-plugin:3.10.1
[WARNING]  * org.apache.maven.plugins:maven-remote-resources-plugin:1.7.0
[WARNING]  * org.apache.maven.plugins:maven-surefire-plugin:2.22.2
[WARNING]  * org.apache.maven.plugins:maven-resources-plugin:3.3.0
[WARNING]  * org.codehaus.mojo:sonar-maven-plugin:3.9.1.2184
[WARNING] 
[WARNING] For more or less details, use 'maven.plugin.validation' property with one of the values (case insensitive): [BRIEF, DEFAULT, VERBOSE]
[WARNING] 
Waiting for Jenkins to finish collecting data
[ERROR] Failed to execute goal com.googlecode.maven-download-plugin:download-maven-plugin:1.7.0:wget (PDFBOX-4106) on project pdfbox: General error: Error while expanding <https://ci-builds.apache.org/job/PDFBox/job/PDFBox-sonar2/ws/pdfbox/target/fonts/ipag00303.zip>: Error on ZipFile <https://ci-builds.apache.org/job/PDFBox/job/PDFBox-sonar2/ws/pdfbox/target/fonts/ipag00303.zip>: Archive is not a ZIP archive -> [Help 1]
[ERROR] 
[ERROR] To see the full stack trace of the errors, re-run Maven with the -e switch.
[ERROR] Re-run Maven using the -X switch to enable full debug logging.
[ERROR] 
[ERROR] For more information about the errors and possible solutions, please read the following articles:
[ERROR] [Help 1] http://cwiki.apache.org/confluence/display/MAVEN/MojoExecutionException
[ERROR] 
[ERROR] After correcting the problems, you can resume the build with the command
[ERROR]   mvn <goals> -rf :pdfbox
[JENKINS] Archiving <https://ci-builds.apache.org/job/PDFBox/job/PDFBox-sonar2/ws/examples/pom.xml> to org.apache.pdfbox/pdfbox-examples/3.0.0-SNAPSHOT/pdfbox-examples-3.0.0-SNAPSHOT.pom
[JENKINS] Archiving <https://ci-builds.apache.org/job/PDFBox/job/PDFBox-sonar2/ws/parent/pom.xml> to org.apache.pdfbox/pdfbox-parent/3.0.0-SNAPSHOT/pdfbox-parent-3.0.0-SNAPSHOT.pom
[JENKINS] Archiving <https://ci-builds.apache.org/job/PDFBox/job/PDFBox-sonar2/ws/pdfbox/pom.xml> to org.apache.pdfbox/pdfbox/3.0.0-SNAPSHOT/pdfbox-3.0.0-SNAPSHOT.pom
[JENKINS] Archiving <https://ci-builds.apache.org/job/PDFBox/job/PDFBox-sonar2/ws/debugger-app/pom.xml> to org.apache.pdfbox/debugger-app/3.0.0-SNAPSHOT/debugger-app-3.0.0-SNAPSHOT.pom
[JENKINS] Archiving <https://ci-builds.apache.org/job/PDFBox/job/PDFBox-sonar2/ws/io/pom.xml> to org.apache.pdfbox/pdfbox-io/3.0.0-SNAPSHOT/pdfbox-io-3.0.0-SNAPSHOT.pom
[JENKINS] Archiving <https://ci-builds.apache.org/job/PDFBox/job/PDFBox-sonar2/ws/io/target/pdfbox-io-3.0.0-SNAPSHOT.jar> to org.apache.pdfbox/pdfbox-io/3.0.0-SNAPSHOT/pdfbox-io-3.0.0-SNAPSHOT.jar
[JENKINS] Archiving <https://ci-builds.apache.org/job/PDFBox/job/PDFBox-sonar2/ws/io/target/pdfbox-io-3.0.0-SNAPSHOT-sources.jar> to org.apache.pdfbox/pdfbox-io/3.0.0-SNAPSHOT/pdfbox-io-3.0.0-SNAPSHOT-sources.jar
[JENKINS] Archiving <https://ci-builds.apache.org/job/PDFBox/job/PDFBox-sonar2/ws/fontbox/pom.xml> to org.apache.pdfbox/fontbox/3.0.0-SNAPSHOT/fontbox-3.0.0-SNAPSHOT.pom
[JENKINS] Archiving <https://ci-builds.apache.org/job/PDFBox/job/PDFBox-sonar2/ws/fontbox/target/fontbox-3.0.0-SNAPSHOT.jar> to org.apache.pdfbox/fontbox/3.0.0-SNAPSHOT/fontbox-3.0.0-SNAPSHOT.jar
[JENKINS] Archiving <https://ci-builds.apache.org/job/PDFBox/job/PDFBox-sonar2/ws/fontbox/target/fontbox-3.0.0-SNAPSHOT-sources.jar> to org.apache.pdfbox/fontbox/3.0.0-SNAPSHOT/fontbox-3.0.0-SNAPSHOT-sources.jar
[JENKINS] Archiving <https://ci-builds.apache.org/job/PDFBox/job/PDFBox-sonar2/ws/xmpbox/pom.xml> to org.apache.pdfbox/xmpbox/3.0.0-SNAPSHOT/xmpbox-3.0.0-SNAPSHOT.pom
[JENKINS] Archiving <https://ci-builds.apache.org/job/PDFBox/job/PDFBox-sonar2/ws/xmpbox/target/xmpbox-3.0.0-SNAPSHOT.jar> to org.apache.pdfbox/xmpbox/3.0.0-SNAPSHOT/xmpbox-3.0.0-SNAPSHOT.jar
[JENKINS] Archiving <https://ci-builds.apache.org/job/PDFBox/job/PDFBox-sonar2/ws/xmpbox/target/xmpbox-3.0.0-SNAPSHOT-sources.jar> to org.apache.pdfbox/xmpbox/3.0.0-SNAPSHOT/xmpbox-3.0.0-SNAPSHOT-sources.jar
[JENKINS] Archiving <https://ci-builds.apache.org/job/PDFBox/job/PDFBox-sonar2/ws/tools/pom.xml> to org.apache.pdfbox/pdfbox-tools/3.0.0-SNAPSHOT/pdfbox-tools-3.0.0-SNAPSHOT.pom
[JENKINS] Archiving <https://ci-builds.apache.org/job/PDFBox/job/PDFBox-sonar2/ws/debugger/pom.xml> to org.apache.pdfbox/pdfbox-debugger/3.0.0-SNAPSHOT/pdfbox-debugger-3.0.0-SNAPSHOT.pom
[JENKINS] Archiving <https://ci-builds.apache.org/job/PDFBox/job/PDFBox-sonar2/ws/preflight-app/pom.xml> to org.apache.pdfbox/preflight-app/3.0.0-SNAPSHOT/preflight-app-3.0.0-SNAPSHOT.pom
[JENKINS] Archiving <https://ci-builds.apache.org/job/PDFBox/job/PDFBox-sonar2/ws/app/pom.xml> to org.apache.pdfbox/pdfbox-app/3.0.0-SNAPSHOT/pdfbox-app-3.0.0-SNAPSHOT.pom
[JENKINS] Archiving <https://ci-builds.apache.org/job/PDFBox/job/PDFBox-sonar2/ws/preflight/pom.xml> to org.apache.pdfbox/preflight/3.0.0-SNAPSHOT/preflight-3.0.0-SNAPSHOT.pom
[JENKINS] Archiving <https://ci-builds.apache.org/job/PDFBox/job/PDFBox-sonar2/ws/pom.xml> to org.apache.pdfbox/pdfbox-reactor/3.0.0-SNAPSHOT/pdfbox-reactor-3.0.0-SNAPSHOT.pom
No mail will be sent out, as 'PDFBox » PDFBox-sonar2 » Apache PDFBox examples #1059' does not have a result yet. Please make sure you set a proper result in case of pipeline/build scripts.
Sending e-mails to: dev@pdfbox.apache.org
No mail will be sent out, as 'PDFBox » PDFBox-sonar2 » Apache PDFBox Debugger application #1059' does not have a result yet. Please make sure you set a proper result in case of pipeline/build scripts.
No mail will be sent out, as 'PDFBox » PDFBox-sonar2 » Apache PDFBox tools #1059' does not have a result yet. Please make sure you set a proper result in case of pipeline/build scripts.
No mail will be sent out, as 'PDFBox » PDFBox-sonar2 » Apache PDFBox Debugger #1059' does not have a result yet. Please make sure you set a proper result in case of pipeline/build scripts.
No mail will be sent out, as 'PDFBox » PDFBox-sonar2 » Apache Preflight application #1059' does not have a result yet. Please make sure you set a proper result in case of pipeline/build scripts.
No mail will be sent out, as 'PDFBox » PDFBox-sonar2 » Apache PDFBox application #1059' does not have a result yet. Please make sure you set a proper result in case of pipeline/build scripts.
No mail will be sent out, as 'PDFBox » PDFBox-sonar2 » Apache Preflight #1059' does not have a result yet. Please make sure you set a proper result in case of pipeline/build scripts.
No mail will be sent out, as 'PDFBox » PDFBox-sonar2 » Apache PDFBox #1059' does not have a result yet. Please make sure you set a proper result in case of pipeline/build scripts.
channel stopped

---------------------------------------------------------------------
To unsubscribe, e-mail: dev-unsubscribe@pdfbox.apache.org
For additional commands, e-mail: dev-help@pdfbox.apache.org


Jenkins build is back to normal : PDFBox » PDFBox-sonar2 #1061

Posted by Apache Jenkins Server <je...@builds.apache.org>.
See <https://ci-builds.apache.org/job/PDFBox/job/PDFBox-sonar2/1061/display/redirect>


---------------------------------------------------------------------
To unsubscribe, e-mail: dev-unsubscribe@pdfbox.apache.org
For additional commands, e-mail: dev-help@pdfbox.apache.org


Build failed in Jenkins: PDFBox » PDFBox-sonar2 #1060

Posted by Apache Jenkins Server <je...@builds.apache.org>.
See <https://ci-builds.apache.org/job/PDFBox/job/PDFBox-sonar2/1060/display/redirect>

Changes:


------------------------------------------
[...truncated 384.69 KB...]
13.06.2023 13:21:16 WARN  cff.Type1CharString:170 - Unknown charstring command in glyph nine of font ZSSYJQ+HelveticaNeueLTStd-Blk
13.06.2023 13:21:16 WARN  cff.Type1CharString:170 - Unknown charstring command in glyph A of font OXCALM+HelveticaNeueLTStd-Roman
13.06.2023 13:21:16 WARN  cff.Type1CharString:170 - Unknown charstring command in glyph A of font OXCALM+HelveticaNeueLTStd-Roman
13.06.2023 13:21:16 WARN  cff.Type1CharString:170 - Unknown charstring command in glyph q of font OXCALM+HelveticaNeueLTStd-Roman
13.06.2023 13:21:16 WARN  cff.Type1CharString:170 - Unknown charstring command in glyph q of font OXCALM+HelveticaNeueLTStd-Roman
13.06.2023 13:21:16 WARN  cff.Type1CharString:170 - Unknown charstring command in glyph q of font OXCALM+HelveticaNeueLTStd-Roman
13.06.2023 13:21:16 WARN  cff.Type1CharString:170 - Unknown charstring command in glyph eight of font UQDPRA+HelveticaNeueLTStd-Bd
13.06.2023 13:21:16 WARN  cff.Type1CharString:170 - Unknown charstring command in glyph eight of font UQDPRA+HelveticaNeueLTStd-Bd
13.06.2023 13:21:16 WARN  cff.Type1CharString:170 - Unknown charstring command in glyph eight of font UQDPRA+HelveticaNeueLTStd-Bd
13.06.2023 13:21:16 WARN  cff.Type1CharString:170 - Unknown charstring command in glyph eight of font UQDPRA+HelveticaNeueLTStd-Bd
13.06.2023 13:21:16 WARN  cff.Type1CharString:170 - Unknown charstring command in glyph eight of font UQDPRA+HelveticaNeueLTStd-Bd
13.06.2023 13:21:16 WARN  cff.Type1CharString:170 - Unknown charstring command in glyph eight of font UQDPRA+HelveticaNeueLTStd-Bd
13.06.2023 13:21:16 WARN  cff.Type1CharString:170 - Unknown charstring command in glyph w of font OXCALM+HelveticaNeueLTStd-Roman
13.06.2023 13:21:16 WARN  cff.Type1CharString:170 - Unknown charstring command in glyph w of font OXCALM+HelveticaNeueLTStd-Roman
13.06.2023 13:21:16 WARN  cff.Type1CharString:170 - Unknown charstring command in glyph b of font UQDPRA+HelveticaNeueLTStd-Bd
13.06.2023 13:21:16 WARN  cff.Type1CharString:170 - Unknown charstring command in glyph b of font UQDPRA+HelveticaNeueLTStd-Bd
13.06.2023 13:21:16 WARN  cff.Type1CharString:170 - Unknown charstring command in glyph b of font UQDPRA+HelveticaNeueLTStd-Bd
13.06.2023 13:21:16 WARN  cff.Type1CharString:170 - Unknown charstring command in glyph d of font OXCALM+HelveticaNeueLTStd-Roman
13.06.2023 13:21:16 WARN  cff.Type1CharString:170 - Unknown charstring command in glyph d of font OXCALM+HelveticaNeueLTStd-Roman
13.06.2023 13:21:16 WARN  cff.Type1CharString:170 - Unknown charstring command in glyph d of font OXCALM+HelveticaNeueLTStd-Roman
13.06.2023 13:21:16 WARN  cff.Type1CharString:170 - Unknown charstring command in glyph b of font OXCALM+HelveticaNeueLTStd-Roman
13.06.2023 13:21:16 WARN  cff.Type1CharString:170 - Unknown charstring command in glyph b of font OXCALM+HelveticaNeueLTStd-Roman
13.06.2023 13:21:16 WARN  cff.Type1CharString:170 - Unknown charstring command in glyph b of font OXCALM+HelveticaNeueLTStd-Roman
13.06.2023 13:21:16 WARN  cff.Type1CharString:170 - Unknown charstring command in glyph g of font OXCALM+HelveticaNeueLTStd-Roman
13.06.2023 13:21:16 WARN  cff.Type1CharString:170 - Unknown charstring command in glyph g of font OXCALM+HelveticaNeueLTStd-Roman
13.06.2023 13:21:16 WARN  cff.Type1CharString:170 - Unknown charstring command in glyph g of font OXCALM+HelveticaNeueLTStd-Roman
13.06.2023 13:21:16 WARN  cff.Type1CharString:170 - Unknown charstring command in glyph g of font OXCALM+HelveticaNeueLTStd-Roman
13.06.2023 13:21:16 WARN  cff.Type1CharString:170 - Unknown charstring command in glyph three of font UQDPRA+HelveticaNeueLTStd-Bd
13.06.2023 13:21:16 WARN  cff.Type1CharString:170 - Unknown charstring command in glyph three of font UQDPRA+HelveticaNeueLTStd-Bd
13.06.2023 13:21:16 WARN  cff.Type1CharString:170 - Unknown charstring command in glyph three of font UQDPRA+HelveticaNeueLTStd-Bd
13.06.2023 13:21:16 WARN  cff.Type1CharString:170 - Unknown charstring command in glyph three of font UQDPRA+HelveticaNeueLTStd-Bd
13.06.2023 13:21:16 WARN  cff.Type1CharString:170 - Unknown charstring command in glyph three of font UQDPRA+HelveticaNeueLTStd-Bd
13.06.2023 13:21:16 WARN  cff.Type1CharString:170 - Unknown charstring command in glyph x of font OXCALM+HelveticaNeueLTStd-Roman
13.06.2023 13:21:16 WARN  cff.Type1CharString:170 - Unknown charstring command in glyph x of font OXCALM+HelveticaNeueLTStd-Roman
13.06.2023 13:21:16 WARN  cff.Type1CharString:170 - Unknown charstring command in glyph eight of font OXCALM+HelveticaNeueLTStd-Roman
13.06.2023 13:21:16 WARN  cff.Type1CharString:170 - Unknown charstring command in glyph eight of font OXCALM+HelveticaNeueLTStd-Roman
13.06.2023 13:21:16 WARN  cff.Type1CharString:170 - Unknown charstring command in glyph eight of font OXCALM+HelveticaNeueLTStd-Roman
13.06.2023 13:21:16 WARN  cff.Type1CharString:170 - Unknown charstring command in glyph eight of font OXCALM+HelveticaNeueLTStd-Roman
13.06.2023 13:21:16 WARN  cff.Type1CharString:170 - Unknown charstring command in glyph eight of font OXCALM+HelveticaNeueLTStd-Roman
13.06.2023 13:21:16 WARN  cff.Type1CharString:170 - Unknown charstring command in glyph eight of font OXCALM+HelveticaNeueLTStd-Roman
13.06.2023 13:21:16 WARN  cff.Type1CharString:170 - Unknown charstring command in glyph three of font OXCALM+HelveticaNeueLTStd-Roman
13.06.2023 13:21:16 WARN  cff.Type1CharString:170 - Unknown charstring command in glyph three of font OXCALM+HelveticaNeueLTStd-Roman
13.06.2023 13:21:16 WARN  cff.Type1CharString:170 - Unknown charstring command in glyph dollar of font OXCALM+HelveticaNeueLTStd-Roman
13.06.2023 13:21:16 WARN  cff.Type1CharString:170 - Unknown charstring command in glyph dollar of font OXCALM+HelveticaNeueLTStd-Roman
13.06.2023 13:21:16 WARN  cff.Type1CharString:170 - Unknown charstring command in glyph dollar of font OXCALM+HelveticaNeueLTStd-Roman
13.06.2023 13:21:16 WARN  cff.Type1CharString:170 - Unknown charstring command in glyph dollar of font OXCALM+HelveticaNeueLTStd-Roman
13.06.2023 13:21:16 WARN  cff.Type1CharString:170 - Unknown charstring command in glyph V of font OXCALM+HelveticaNeueLTStd-Roman
13.06.2023 13:21:16 WARN  cff.Type1CharString:170 - Unknown charstring command in glyph V of font OXCALM+HelveticaNeueLTStd-Roman
13.06.2023 13:21:17 WARN  cff.Type1CharString:170 - Unknown charstring command in glyph six of font OXCALM+HelveticaNeueLTStd-Roman
13.06.2023 13:21:17 WARN  cff.Type1CharString:170 - Unknown charstring command in glyph six of font OXCALM+HelveticaNeueLTStd-Roman
13.06.2023 13:21:17 WARN  cff.Type1CharString:170 - Unknown charstring command in glyph six of font OXCALM+HelveticaNeueLTStd-Roman
13.06.2023 13:21:17 WARN  cff.Type1CharString:170 - Unknown charstring command in glyph six of font OXCALM+HelveticaNeueLTStd-Roman
13.06.2023 13:21:17 WARN  cff.Type1CharString:170 - Unknown charstring command in glyph g of font UQDPRA+HelveticaNeueLTStd-Bd
13.06.2023 13:21:17 WARN  cff.Type1CharString:170 - Unknown charstring command in glyph g of font UQDPRA+HelveticaNeueLTStd-Bd
13.06.2023 13:21:17 WARN  cff.Type1CharString:170 - Unknown charstring command in glyph g of font UQDPRA+HelveticaNeueLTStd-Bd
13.06.2023 13:21:17 WARN  cff.Type1CharString:170 - Unknown charstring command in glyph seven of font UQDPRA+HelveticaNeueLTStd-Bd
13.06.2023 13:21:17 WARN  cff.Type1CharString:170 - Unknown charstring command in glyph seven of font UQDPRA+HelveticaNeueLTStd-Bd
13.06.2023 13:21:17 WARN  cff.Type1CharString:170 - Unknown charstring command in glyph question of font OXCALM+HelveticaNeueLTStd-Roman
13.06.2023 13:21:17 WARN  cff.Type1CharString:170 - Unknown charstring command in glyph question of font OXCALM+HelveticaNeueLTStd-Roman
13.06.2023 13:21:17 WARN  cff.Type1CharString:170 - Unknown charstring command in glyph question of font OXCALM+HelveticaNeueLTStd-Roman
13.06.2023 13:21:17 WARN  cff.Type1CharString:170 - Unknown charstring command in glyph p of font UQDPRA+HelveticaNeueLTStd-Bd
13.06.2023 13:21:17 WARN  cff.Type1CharString:170 - Unknown charstring command in glyph p of font UQDPRA+HelveticaNeueLTStd-Bd
13.06.2023 13:21:17 WARN  cff.Type1CharString:170 - Unknown charstring command in glyph p of font UQDPRA+HelveticaNeueLTStd-Bd
13.06.2023 13:21:17 WARN  cff.Type1CharString:170 - Unknown charstring command in glyph p of font UQDPRA+HelveticaNeueLTStd-Bd
13.06.2023 13:21:17 INFO  rendering.TestPDFToImage:200 - Writing: <https://ci-builds.apache.org/job/PDFBox/job/PDFBox-sonar2/ws/pdfbox/target/test-output/flatten/out/PDFBOX-4889.pdf-1.png>
13.06.2023 13:21:17 WARN  font.PDTrueTypeFont:142 - Using fallback font LiberationSerif for CourierNewPSMT
13.06.2023 13:21:17 WARN  pdmodel.PDDocument:1282 - do not call setAllSecurityToBeRemoved(true) before calling protect(), as protect() implies setAllSecurityToBeRemoved(false)
13.06.2023 13:21:17 WARN  pdmodel.PDDocument:977 - You are overwriting the existing file Acroform-PDFBOX-2333.pdf-Simple-40-bit-RC4-encrypted.pdf, this will produce a corrupted file if you're also reading from it
[INFO] Tests run: 2, Failures: 0, Errors: 0, Skipped: 0, Time elapsed: 6.14 s - in org.apache.pdfbox.rendering.TestQuality
13.06.2023 13:21:17 WARN  pdmodel.PDDocument:977 - You are overwriting the existing file pdfbox7577728858343287712.pdf, this will produce a corrupted file if you're also reading from it
13.06.2023 13:21:17 INFO  rendering.TestPDFToImage:200 - Writing: <https://ci-builds.apache.org/job/PDFBox/job/PDFBox-sonar2/ws/pdfbox/target/test-output/flatten/out/PDFBOX-4955.pdf-1.png>
13.06.2023 13:21:17 INFO  rendering.TestPDFToImage:231 - Comparing: PDFBOX-4889.pdf
13.06.2023 13:21:17 INFO  rendering.TestPDFToImage:285 - *** TEST OK *** for file: PDFBOX-4889.pdf-1.png
13.06.2023 13:21:17 INFO  rendering.TestPDFToImage:286 - Deleting: PDFBOX-4889.pdf-1.png
13.06.2023 13:21:17 WARN  pdmodel.PDDocument:977 - You are overwriting the existing file pdfbox11010754553405830990.pdf, this will produce a corrupted file if you're also reading from it
13.06.2023 13:21:17 INFO  rendering.TestPDFToImage:231 - Comparing: PDFBOX-4955.pdf
13.06.2023 13:21:17 INFO  rendering.TestPDFToImage:277 - *** TEST OK *** for file: PDFBOX-4955.pdf-1.png
13.06.2023 13:21:17 INFO  rendering.TestPDFToImage:278 - Deleting: PDFBOX-4955.pdf-1.png
[INFO] Tests run: 4, Failures: 0, Errors: 0, Skipped: 0, Time elapsed: 6.585 s - in org.apache.pdfbox.pdmodel.interactive.form.PDAcroFormFlattenTest
[INFO] Tests run: 1, Failures: 0, Errors: 0, Skipped: 0, Time elapsed: 6.741 s - in org.apache.pdfbox.multipdf.PDFMergerUtilityTest
13.06.2023 13:21:18 WARN  pdmodel.PDDocument:977 - You are overwriting the existing file Acroform-PDFBOX-2333.pdf-Simple-40-bit-RC4-decrypted.pdf, this will produce a corrupted file if you're also reading from it
[INFO] Tests run: 1, Failures: 0, Errors: 0, Skipped: 0, Time elapsed: 7.676 s - in org.apache.pdfbox.util.TestNumberFormatUtil
13.06.2023 13:21:19 WARN  pdmodel.PDDocument:1282 - do not call setAllSecurityToBeRemoved(true) before calling protect(), as protect() implies setAllSecurityToBeRemoved(false)
13.06.2023 13:21:19 WARN  pdmodel.PDDocument:977 - You are overwriting the existing file Acroform-PDFBOX-2333.pdf-Simple-128-bit-RC4-encrypted.pdf, this will produce a corrupted file if you're also reading from it
13.06.2023 13:21:20 WARN  pdmodel.PDDocument:977 - You are overwriting the existing file Acroform-PDFBOX-2333.pdf-Simple-128-bit-RC4-decrypted.pdf, this will produce a corrupted file if you're also reading from it
13.06.2023 13:21:21 WARN  pdmodel.PDDocument:1282 - do not call setAllSecurityToBeRemoved(true) before calling protect(), as protect() implies setAllSecurityToBeRemoved(false)
13.06.2023 13:21:21 WARN  pdmodel.PDDocument:977 - You are overwriting the existing file Acroform-PDFBOX-2333.pdf-Simple-128-bit-AES-encrypted.pdf, this will produce a corrupted file if you're also reading from it
13.06.2023 13:21:22 WARN  pdmodel.PDDocument:977 - You are overwriting the existing file Acroform-PDFBOX-2333.pdf-Simple-128-bit-AES-decrypted.pdf, this will produce a corrupted file if you're also reading from it
13.06.2023 13:21:23 WARN  pdmodel.PDDocument:1282 - do not call setAllSecurityToBeRemoved(true) before calling protect(), as protect() implies setAllSecurityToBeRemoved(false)
13.06.2023 13:21:23 WARN  pdmodel.PDDocument:977 - You are overwriting the existing file Acroform-PDFBOX-2333.pdf-Simple-256-bit-AES-encrypted.pdf, this will produce a corrupted file if you're also reading from it
13.06.2023 13:21:24 WARN  pdmodel.PDDocument:977 - You are overwriting the existing file Acroform-PDFBOX-2333.pdf-Simple-256-bit-AES-decrypted.pdf, this will produce a corrupted file if you're also reading from it
[INFO] Tests run: 1, Failures: 0, Errors: 0, Skipped: 0, Time elapsed: 13.137 s - in org.apache.pdfbox.encryption.TestSymmetricKeyEncryption
[INFO] Tests run: 1, Failures: 0, Errors: 0, Skipped: 0, Time elapsed: 13.252 s - in org.apache.pdfbox.filter.TestFilters
[INFO] 
[INFO] Results:
[INFO] 
[WARNING] Tests run: 658, Failures: 0, Errors: 0, Skipped: 3
[INFO] 
[JENKINS] Recording test results
[INFO] 
[INFO] --- jacoco:0.8.10:report (report) @ pdfbox ---
[INFO] Loading execution data file <https://ci-builds.apache.org/job/PDFBox/job/PDFBox-sonar2/ws/pdfbox/target/jacoco.exec>
[INFO] Analyzed bundle 'Apache PDFBox' with 699 classes
[INFO] 
[INFO] --- animal-sniffer:1.23:check (check-java-version) @ pdfbox ---
[INFO] Checking unresolved references to org.codehaus.mojo.signature:java18:1.0
[INFO] 
[INFO] --- bundle:5.1.9:bundle (default-bundle) @ pdfbox ---
[INFO] Building bundle: <https://ci-builds.apache.org/job/PDFBox/job/PDFBox-sonar2/ws/pdfbox/target/pdfbox-3.0.0-SNAPSHOT.jar>
[INFO] Writing manifest: <https://ci-builds.apache.org/job/PDFBox/job/PDFBox-sonar2/ws/pdfbox/target/classes/META-INF/MANIFEST.MF>
[INFO] 
[INFO] --- site:3.12.1:attach-descriptor (attach-descriptor) @ pdfbox ---
[INFO] Skipping because packaging 'bundle' is not pom.
[INFO] 
[INFO] >>> source:3.2.1:jar (attach-sources) > generate-sources @ pdfbox >>>
[INFO] 
[INFO] --- enforcer:3.3.0:enforce (default) @ pdfbox ---
[INFO] 
[INFO] --- enforcer:3.3.0:enforce (enforce-maven-version) @ pdfbox ---
[INFO] 
[INFO] --- enforcer:3.3.0:enforce (enforce-java-version) @ pdfbox ---
[INFO] 
[INFO] --- jacoco:0.8.10:prepare-agent (default) @ pdfbox ---
[INFO] surefireArgLine set to -javaagent:/home/jenkins/.m2/repository/org/jacoco/org.jacoco.agent/0.8.10/org.jacoco.agent-0.8.10-runtime.jar=destfile=<https://ci-builds.apache.org/job/PDFBox/job/PDFBox-sonar2/ws/pdfbox/target/jacoco.exec>
[WARNING] Failed to getClass for org.apache.maven.plugins.source.SourceJarMojo
[INFO] 
[INFO] <<< source:3.2.1:jar (attach-sources) < generate-sources @ pdfbox <<<
[INFO] 
[INFO] 
[INFO] --- source:3.2.1:jar (attach-sources) @ pdfbox ---
[INFO] Building jar: <https://ci-builds.apache.org/job/PDFBox/job/PDFBox-sonar2/ws/pdfbox/target/pdfbox-3.0.0-SNAPSHOT-sources.jar>
[INFO] 
[INFO] --------------------< org.apache.pdfbox:preflight >---------------------
[INFO] Building Apache Preflight 3.0.0-SNAPSHOT                          [6/13]
[INFO]   from preflight/pom.xml
[INFO] -------------------------------[ bundle ]-------------------------------
[INFO] 
[INFO] --- enforcer:3.3.0:enforce (default) @ preflight ---
[INFO] 
[INFO] --- enforcer:3.3.0:enforce (enforce-maven-version) @ preflight ---
[INFO] 
[INFO] --- enforcer:3.3.0:enforce (enforce-java-version) @ preflight ---
[INFO] 
[INFO] --- jacoco:0.8.10:prepare-agent (default) @ preflight ---
[INFO] surefireArgLine set to -javaagent:/home/jenkins/.m2/repository/org/jacoco/org.jacoco.agent/0.8.10/org.jacoco.agent-0.8.10-runtime.jar=destfile=<https://ci-builds.apache.org/job/PDFBox/job/PDFBox-sonar2/ws/preflight/target/jacoco.exec>
[INFO] 
[INFO] --- remote-resources:1.7.0:process (process-resource-bundles) @ preflight ---
[INFO] Preparing remote bundle org.apache:apache-jar-resource-bundle:1.4
[INFO] Copying 3 resources from 1 bundle.
[INFO] 
[INFO] --- resources:3.3.0:resources (default-resources) @ preflight ---
[INFO] skip non existing resourceDirectory <https://ci-builds.apache.org/job/PDFBox/job/PDFBox-sonar2/ws/preflight/src/main/resources>
[INFO] Copying 3 resources
[INFO] 
[INFO] --- compiler:3.10.1:compile (default-compile) @ preflight ---
[INFO] Changes detected - recompiling the module!
[INFO] Compiling 116 source files to <https://ci-builds.apache.org/job/PDFBox/job/PDFBox-sonar2/ws/preflight/target/classes>
[INFO] <https://ci-builds.apache.org/job/PDFBox/job/PDFBox-sonar2/ws/preflight/src/main/java/org/apache/pdfbox/preflight/font/descriptor/FontDescriptorHelper.java>: <https://ci-builds.apache.org/job/PDFBox/job/PDFBox-sonar2/ws/preflight/src/main/java/org/apache/pdfbox/preflight/font/descriptor/FontDescriptorHelper.java> uses unchecked or unsafe operations.
[INFO] <https://ci-builds.apache.org/job/PDFBox/job/PDFBox-sonar2/ws/preflight/src/main/java/org/apache/pdfbox/preflight/font/descriptor/FontDescriptorHelper.java>: Recompile with -Xlint:unchecked for details.
[INFO] 
[INFO] --- download:1.7.0:wget (get-isartor) @ preflight ---
[INFO] 
[INFO] --- download:1.7.0:wget (get-bavaria) @ preflight ---
[INFO] File already exist, skipping
[INFO] 
[INFO] ------------------------------------------------------------------------
[INFO] Skipping Apache PDFBox
[INFO] This project has been banned from the build due to previous failures.
[INFO] ------------------------------------------------------------------------
[INFO] ------------------------------------------------------------------------
[INFO] Reactor Summary for Apache PDFBox 3.0.0-SNAPSHOT:
[INFO] 
[INFO] PDFBox parent ...................................... SUCCESS [ 18.968 s]
[INFO] Apache PDFBox io ................................... SUCCESS [ 39.019 s]
[INFO] Apache FontBox ..................................... SUCCESS [ 24.115 s]
[INFO] Apache XmpBox ...................................... SUCCESS [ 12.582 s]
[INFO] Apache PDFBox ...................................... SUCCESS [01:08 min]
[INFO] Apache Preflight ................................... FAILURE [  5.376 s]
[INFO] Apache Preflight application ....................... SKIPPED
[INFO] Apache PDFBox Debugger ............................. SKIPPED
[INFO] Apache PDFBox tools ................................ SKIPPED
[INFO] Apache PDFBox application .......................... SKIPPED
[INFO] Apache PDFBox Debugger application ................. SKIPPED
[INFO] Apache PDFBox examples ............................. SKIPPED
[INFO] Apache PDFBox ...................................... SKIPPED
[INFO] ------------------------------------------------------------------------
[INFO] BUILD FAILURE
[INFO] ------------------------------------------------------------------------
[INFO] Total time:  03:30 min
[INFO] Finished at: 2023-06-13T13:22:02Z
[INFO] ------------------------------------------------------------------------
[WARNING] 
[WARNING] Plugin validation issues were detected in 10 plugin(s)
[WARNING] 
[WARNING]  * org.apache.maven.plugins:maven-scm-plugin:1.13.0
[WARNING]  * org.apache.maven.plugins:maven-source-plugin:3.2.1
[WARNING]  * org.jacoco:jacoco-maven-plugin:0.8.10
[WARNING]  * org.apache.maven.plugins:maven-site-plugin:3.12.1
[WARNING]  * org.apache.felix:maven-bundle-plugin:5.1.9
[WARNING]  * org.apache.maven.plugins:maven-compiler-plugin:3.10.1
[WARNING]  * org.apache.maven.plugins:maven-remote-resources-plugin:1.7.0
[WARNING]  * org.apache.maven.plugins:maven-surefire-plugin:2.22.2
[WARNING]  * org.apache.maven.plugins:maven-resources-plugin:3.3.0
[WARNING]  * org.codehaus.mojo:sonar-maven-plugin:3.9.1.2184
[WARNING] 
[WARNING] For more or less details, use 'maven.plugin.validation' property with one of the values (case insensitive): [BRIEF, DEFAULT, VERBOSE]
[WARNING] 
Waiting for Jenkins to finish collecting data
[ERROR] Failed to execute goal com.googlecode.maven-download-plugin:download-maven-plugin:1.7.0:wget (get-bavaria) on project preflight: General error: Error while expanding <https://ci-builds.apache.org/job/PDFBox/job/PDFBox-sonar2/ws/preflight/target/pdfs/2009-04-03-Bavaria-pdfa.zip>: Error on ZipFile <https://ci-builds.apache.org/job/PDFBox/job/PDFBox-sonar2/ws/preflight/target/pdfs/2009-04-03-Bavaria-pdfa.zip>: Archive is not a ZIP archive -> [Help 1]
[ERROR] 
[ERROR] To see the full stack trace of the errors, re-run Maven with the -e switch.
[ERROR] Re-run Maven using the -X switch to enable full debug logging.
[ERROR] 
[ERROR] For more information about the errors and possible solutions, please read the following articles:
[ERROR] [Help 1] http://cwiki.apache.org/confluence/display/MAVEN/MojoExecutionException
[ERROR] 
[ERROR] After correcting the problems, you can resume the build with the command
[ERROR]   mvn <goals> -rf :preflight
[JENKINS] Archiving <https://ci-builds.apache.org/job/PDFBox/job/PDFBox-sonar2/ws/examples/pom.xml> to org.apache.pdfbox/pdfbox-examples/3.0.0-SNAPSHOT/pdfbox-examples-3.0.0-SNAPSHOT.pom
[JENKINS] Archiving <https://ci-builds.apache.org/job/PDFBox/job/PDFBox-sonar2/ws/parent/pom.xml> to org.apache.pdfbox/pdfbox-parent/3.0.0-SNAPSHOT/pdfbox-parent-3.0.0-SNAPSHOT.pom
[JENKINS] Archiving <https://ci-builds.apache.org/job/PDFBox/job/PDFBox-sonar2/ws/pdfbox/pom.xml> to org.apache.pdfbox/pdfbox/3.0.0-SNAPSHOT/pdfbox-3.0.0-SNAPSHOT.pom
[JENKINS] Archiving <https://ci-builds.apache.org/job/PDFBox/job/PDFBox-sonar2/ws/pdfbox/target/pdfbox-3.0.0-SNAPSHOT.jar> to org.apache.pdfbox/pdfbox/3.0.0-SNAPSHOT/pdfbox-3.0.0-SNAPSHOT.jar
[JENKINS] Archiving <https://ci-builds.apache.org/job/PDFBox/job/PDFBox-sonar2/ws/pdfbox/target/pdfbox-3.0.0-SNAPSHOT-sources.jar> to org.apache.pdfbox/pdfbox/3.0.0-SNAPSHOT/pdfbox-3.0.0-SNAPSHOT-sources.jar
[JENKINS] Archiving <https://ci-builds.apache.org/job/PDFBox/job/PDFBox-sonar2/ws/debugger-app/pom.xml> to org.apache.pdfbox/debugger-app/3.0.0-SNAPSHOT/debugger-app-3.0.0-SNAPSHOT.pom
[JENKINS] Archiving <https://ci-builds.apache.org/job/PDFBox/job/PDFBox-sonar2/ws/io/pom.xml> to org.apache.pdfbox/pdfbox-io/3.0.0-SNAPSHOT/pdfbox-io-3.0.0-SNAPSHOT.pom
[JENKINS] Archiving <https://ci-builds.apache.org/job/PDFBox/job/PDFBox-sonar2/ws/io/target/pdfbox-io-3.0.0-SNAPSHOT.jar> to org.apache.pdfbox/pdfbox-io/3.0.0-SNAPSHOT/pdfbox-io-3.0.0-SNAPSHOT.jar
[JENKINS] Archiving <https://ci-builds.apache.org/job/PDFBox/job/PDFBox-sonar2/ws/io/target/pdfbox-io-3.0.0-SNAPSHOT-sources.jar> to org.apache.pdfbox/pdfbox-io/3.0.0-SNAPSHOT/pdfbox-io-3.0.0-SNAPSHOT-sources.jar
[JENKINS] Archiving <https://ci-builds.apache.org/job/PDFBox/job/PDFBox-sonar2/ws/fontbox/pom.xml> to org.apache.pdfbox/fontbox/3.0.0-SNAPSHOT/fontbox-3.0.0-SNAPSHOT.pom
[JENKINS] Archiving <https://ci-builds.apache.org/job/PDFBox/job/PDFBox-sonar2/ws/fontbox/target/fontbox-3.0.0-SNAPSHOT.jar> to org.apache.pdfbox/fontbox/3.0.0-SNAPSHOT/fontbox-3.0.0-SNAPSHOT.jar
[JENKINS] Archiving <https://ci-builds.apache.org/job/PDFBox/job/PDFBox-sonar2/ws/fontbox/target/fontbox-3.0.0-SNAPSHOT-sources.jar> to org.apache.pdfbox/fontbox/3.0.0-SNAPSHOT/fontbox-3.0.0-SNAPSHOT-sources.jar
[JENKINS] Archiving <https://ci-builds.apache.org/job/PDFBox/job/PDFBox-sonar2/ws/xmpbox/pom.xml> to org.apache.pdfbox/xmpbox/3.0.0-SNAPSHOT/xmpbox-3.0.0-SNAPSHOT.pom
[JENKINS] Archiving <https://ci-builds.apache.org/job/PDFBox/job/PDFBox-sonar2/ws/xmpbox/target/xmpbox-3.0.0-SNAPSHOT.jar> to org.apache.pdfbox/xmpbox/3.0.0-SNAPSHOT/xmpbox-3.0.0-SNAPSHOT.jar
[JENKINS] Archiving <https://ci-builds.apache.org/job/PDFBox/job/PDFBox-sonar2/ws/xmpbox/target/xmpbox-3.0.0-SNAPSHOT-sources.jar> to org.apache.pdfbox/xmpbox/3.0.0-SNAPSHOT/xmpbox-3.0.0-SNAPSHOT-sources.jar
[JENKINS] Archiving <https://ci-builds.apache.org/job/PDFBox/job/PDFBox-sonar2/ws/tools/pom.xml> to org.apache.pdfbox/pdfbox-tools/3.0.0-SNAPSHOT/pdfbox-tools-3.0.0-SNAPSHOT.pom
[JENKINS] Archiving <https://ci-builds.apache.org/job/PDFBox/job/PDFBox-sonar2/ws/debugger/pom.xml> to org.apache.pdfbox/pdfbox-debugger/3.0.0-SNAPSHOT/pdfbox-debugger-3.0.0-SNAPSHOT.pom
[JENKINS] Archiving <https://ci-builds.apache.org/job/PDFBox/job/PDFBox-sonar2/ws/preflight-app/pom.xml> to org.apache.pdfbox/preflight-app/3.0.0-SNAPSHOT/preflight-app-3.0.0-SNAPSHOT.pom
[JENKINS] Archiving <https://ci-builds.apache.org/job/PDFBox/job/PDFBox-sonar2/ws/app/pom.xml> to org.apache.pdfbox/pdfbox-app/3.0.0-SNAPSHOT/pdfbox-app-3.0.0-SNAPSHOT.pom
[JENKINS] Archiving <https://ci-builds.apache.org/job/PDFBox/job/PDFBox-sonar2/ws/preflight/pom.xml> to org.apache.pdfbox/preflight/3.0.0-SNAPSHOT/preflight-3.0.0-SNAPSHOT.pom
[JENKINS] Archiving <https://ci-builds.apache.org/job/PDFBox/job/PDFBox-sonar2/ws/pom.xml> to org.apache.pdfbox/pdfbox-reactor/3.0.0-SNAPSHOT/pdfbox-reactor-3.0.0-SNAPSHOT.pom
No mail will be sent out, as 'PDFBox » PDFBox-sonar2 » Apache PDFBox examples #1060' does not have a result yet. Please make sure you set a proper result in case of pipeline/build scripts.
Sending e-mails to: dev@pdfbox.apache.org
No mail will be sent out, as 'PDFBox » PDFBox-sonar2 » Apache PDFBox Debugger application #1060' does not have a result yet. Please make sure you set a proper result in case of pipeline/build scripts.
No mail will be sent out, as 'PDFBox » PDFBox-sonar2 » Apache PDFBox tools #1060' does not have a result yet. Please make sure you set a proper result in case of pipeline/build scripts.
No mail will be sent out, as 'PDFBox » PDFBox-sonar2 » Apache PDFBox Debugger #1060' does not have a result yet. Please make sure you set a proper result in case of pipeline/build scripts.
No mail will be sent out, as 'PDFBox » PDFBox-sonar2 » Apache Preflight application #1060' does not have a result yet. Please make sure you set a proper result in case of pipeline/build scripts.
No mail will be sent out, as 'PDFBox » PDFBox-sonar2 » Apache PDFBox application #1060' does not have a result yet. Please make sure you set a proper result in case of pipeline/build scripts.
Sending e-mails to: dev@pdfbox.apache.org
No mail will be sent out, as 'PDFBox » PDFBox-sonar2 » Apache PDFBox #1060' does not have a result yet. Please make sure you set a proper result in case of pipeline/build scripts.
channel stopped

---------------------------------------------------------------------
To unsubscribe, e-mail: dev-unsubscribe@pdfbox.apache.org
For additional commands, e-mail: dev-help@pdfbox.apache.org