You are viewing a plain text version of this content. The canonical link for it is here.
Posted to notifications@jclouds.apache.org by BuildHive <bu...@cloudbees.com> on 2014/05/26 05:32:19 UTC

Build failed in Jenkins: jclouds » jclouds-labs #1076

See <https://buildhive.cloudbees.com/job/jclouds/job/jclouds-labs/1076/changes>

Changes:

[jeremy.daggett] Fixed artifactId typo

------------------------------------------
[...truncated 95 lines...]
[INFO] Exclude: **/CHANGES.txt
[INFO] Exclude: **/README.md
[INFO] Exclude: **/README.txt
[INFO] Exclude: **/DEPENDENCIES
[INFO] Exclude: **/*json
[INFO] Exclude: **/*readme
[INFO] Exclude: **/*ProviderMetadata
[INFO] Exclude: **/*ApiMetadata
[INFO] Exclude: **/*LoggingModule
[INFO] Exclude: **/*ViewMBeanFactory
[INFO] Exclude: **/target/**
[INFO] Exclude: **/test-output/**
[INFO] Exclude: **/bin/**
[INFO] Exclude: **/.settings/**
[INFO] Exclude: **/.classpath
[INFO] Exclude: **/.dir-locals.el
[INFO] Exclude: **/.project
[INFO] Exclude: **/.idea/**
[INFO] Exclude: **/*.iml
[INFO] Exclude: **/*.eml
[INFO] Exclude: **/*.ipr
[INFO] Exclude: **/*.iws
[INFO] Exclude: **/*.DS_STORE
[INFO] Exclude: **/TAGS
[INFO] Exclude: **/.metadata/**
[INFO] Exclude: **/atlassian-ide-plugin.xml
[INFO] Exclude: **/.DS_Store
[INFO] Exclude: .mailmap
[INFO] Exclude: .git/**
[INFO] Exclude: **/.gitignore
[INFO] Exclude: **/.gitattributes
[INFO] Exclude: .repository/**
[INFO] Exclude: .repository/**
[INFO] Exclude: gc.log
[INFO] 404 resources included (use -debug for more details)
Warning:  org.apache.xerces.jaxp.SAXParserImpl$JAXPSAXParser: Property 'http://www.oracle.com/xml/jaxp/properties/entityExpansionLimit' is not recognized.
Compiler warnings:
  WARNING:  'org.apache.xerces.jaxp.SAXParserImpl: Property 'http://javax.xml.XMLConstants/property/accessExternalDTD' is not recognized.'
Warning:  org.apache.xerces.parsers.SAXParser: Feature 'http://javax.xml.XMLConstants/feature/secure-processing' is not recognized.
Warning:  org.apache.xerces.parsers.SAXParser: Property 'http://javax.xml.XMLConstants/property/accessExternalDTD' is not recognized.
Warning:  org.apache.xerces.parsers.SAXParser: Property 'http://www.oracle.com/xml/jaxp/properties/entityExpansionLimit' is not recognized.
[INFO] Rat check: Summary of files. Unapproved: 0 unknown: 0 generated: 0 approved: 403 licence.
[INFO] 
[INFO] --- maven-jar-plugin:2.4:test-jar (default) @ jclouds-labs ---
[WARNING] JAR will be empty - no content was marked for inclusion!
[INFO] Building jar: <https://buildhive.cloudbees.com/job/jclouds/job/jclouds-labs/ws/target/jclouds-labs-1.7.3-SNAPSHOT-tests.jar>
[INFO] 
[INFO] --- maven-surefire-plugin:2.12.4:test (integration) @ jclouds-labs ---
[INFO] No tests to run.
[JENKINS] Recording test results[INFO] 
[INFO] --- maven-duplicate-finder-plugin:1.0.5:check (default) @ jclouds-labs ---

[INFO] Checking compile classpath
[INFO] Checking runtime classpath
[INFO] Checking test classpath
[INFO]                                                                         
[INFO] ------------------------------------------------------------------------
[INFO] Building jclouds virtualbox api 1.7.3-SNAPSHOT
[INFO] ------------------------------------------------------------------------
Downloading: https://oss.sonatype.org/content/repositories/snapshots/org/apache/jclouds/jclouds-compute/1.7.3-SNAPSHOT/maven-metadata.xml
Downloading: http://repository.apache.org/snapshots/org/apache/jclouds/jclouds-compute/1.7.3-SNAPSHOT/maven-metadata.xml
Downloading: https://repository.apache.org/content/repositories/snapshots/org/apache/jclouds/jclouds-compute/1.7.3-SNAPSHOT/maven-metadata.xml
[WARNING] Could not transfer metadata org.apache.jclouds:jclouds-compute:1.7.3-SNAPSHOT/maven-metadata.xml from/to apache-snapshots (https://repository.apache.org/content/repositories/snapshots): Failed to transfer file: https://repository.apache.org/content/repositories/snapshots/org/apache/jclouds/jclouds-compute/1.7.3-SNAPSHOT/maven-metadata.xml. Return code is: 500 , ReasonPhrase:Server Error.
[WARNING] Could not transfer metadata org.apache.jclouds:jclouds-compute:1.7.3-SNAPSHOT/maven-metadata.xml from/to apache.snapshots (http://repository.apache.org/snapshots): Failed to transfer file: http://repository.apache.org/snapshots/org/apache/jclouds/jclouds-compute/1.7.3-SNAPSHOT/maven-metadata.xml. Return code is: 500 , ReasonPhrase:Server Error.
[WARNING] Failure to transfer org.apache.jclouds:jclouds-compute:1.7.3-SNAPSHOT/maven-metadata.xml from https://repository.apache.org/content/repositories/snapshots was cached in the local repository, resolution will not be reattempted until the update interval of apache-snapshots has elapsed or updates are forced. Original error: Could not transfer metadata org.apache.jclouds:jclouds-compute:1.7.3-SNAPSHOT/maven-metadata.xml from/to apache-snapshots (https://repository.apache.org/content/repositories/snapshots): Failed to transfer file: https://repository.apache.org/content/repositories/snapshots/org/apache/jclouds/jclouds-compute/1.7.3-SNAPSHOT/maven-metadata.xml. Return code is: 500 , ReasonPhrase:Server Error.
[WARNING] Failure to transfer org.apache.jclouds:jclouds-compute:1.7.3-SNAPSHOT/maven-metadata.xml from http://repository.apache.org/snapshots was cached in the local repository, resolution will not be reattempted until the update interval of apache.snapshots has elapsed or updates are forced. Original error: Could not transfer metadata org.apache.jclouds:jclouds-compute:1.7.3-SNAPSHOT/maven-metadata.xml from/to apache.snapshots (http://repository.apache.org/snapshots): Failed to transfer file: http://repository.apache.org/snapshots/org/apache/jclouds/jclouds-compute/1.7.3-SNAPSHOT/maven-metadata.xml. Return code is: 500 , ReasonPhrase:Server Error.
Downloading: https://repository.apache.org/content/repositories/snapshots/org/apache/jclouds/jclouds-compute/1.7.3-SNAPSHOT/jclouds-compute-1.7.3-SNAPSHOT.pom
Downloading: https://oss.sonatype.org/content/repositories/snapshots/org/apache/jclouds/jclouds-compute/1.7.3-SNAPSHOT/jclouds-compute-1.7.3-SNAPSHOT.pom
Downloading: http://repository.apache.org/snapshots/org/apache/jclouds/jclouds-compute/1.7.3-SNAPSHOT/jclouds-compute-1.7.3-SNAPSHOT.pom
[WARNING] The POM for org.apache.jclouds:jclouds-compute:jar:1.7.3-SNAPSHOT is missing, no dependency information available
Downloading: https://repository.apache.org/content/repositories/snapshots/org/apache/jclouds/api/byon/1.7.3-SNAPSHOT/maven-metadata.xml
Downloading: https://oss.sonatype.org/content/repositories/snapshots/org/apache/jclouds/api/byon/1.7.3-SNAPSHOT/maven-metadata.xml
Downloading: http://repository.apache.org/snapshots/org/apache/jclouds/api/byon/1.7.3-SNAPSHOT/maven-metadata.xml
[WARNING] Could not transfer metadata org.apache.jclouds.api:byon:1.7.3-SNAPSHOT/maven-metadata.xml from/to apache-snapshots (https://repository.apache.org/content/repositories/snapshots): Failed to transfer file: https://repository.apache.org/content/repositories/snapshots/org/apache/jclouds/api/byon/1.7.3-SNAPSHOT/maven-metadata.xml. Return code is: 500 , ReasonPhrase:Server Error.
[WARNING] Could not transfer metadata org.apache.jclouds.api:byon:1.7.3-SNAPSHOT/maven-metadata.xml from/to apache.snapshots (http://repository.apache.org/snapshots): Failed to transfer file: http://repository.apache.org/snapshots/org/apache/jclouds/api/byon/1.7.3-SNAPSHOT/maven-metadata.xml. Return code is: 500 , ReasonPhrase:Server Error.
[WARNING] Failure to transfer org.apache.jclouds.api:byon:1.7.3-SNAPSHOT/maven-metadata.xml from https://repository.apache.org/content/repositories/snapshots was cached in the local repository, resolution will not be reattempted until the update interval of apache-snapshots has elapsed or updates are forced. Original error: Could not transfer metadata org.apache.jclouds.api:byon:1.7.3-SNAPSHOT/maven-metadata.xml from/to apache-snapshots (https://repository.apache.org/content/repositories/snapshots): Failed to transfer file: https://repository.apache.org/content/repositories/snapshots/org/apache/jclouds/api/byon/1.7.3-SNAPSHOT/maven-metadata.xml. Return code is: 500 , ReasonPhrase:Server Error.
[WARNING] Failure to transfer org.apache.jclouds.api:byon:1.7.3-SNAPSHOT/maven-metadata.xml from http://repository.apache.org/snapshots was cached in the local repository, resolution will not be reattempted until the update interval of apache.snapshots has elapsed or updates are forced. Original error: Could not transfer metadata org.apache.jclouds.api:byon:1.7.3-SNAPSHOT/maven-metadata.xml from/to apache.snapshots (http://repository.apache.org/snapshots): Failed to transfer file: http://repository.apache.org/snapshots/org/apache/jclouds/api/byon/1.7.3-SNAPSHOT/maven-metadata.xml. Return code is: 500 , ReasonPhrase:Server Error.
Downloading: https://repository.apache.org/content/repositories/snapshots/org/apache/jclouds/api/byon/1.7.3-SNAPSHOT/byon-1.7.3-SNAPSHOT.pom
Downloading: https://oss.sonatype.org/content/repositories/snapshots/org/apache/jclouds/api/byon/1.7.3-SNAPSHOT/byon-1.7.3-SNAPSHOT.pom
Downloading: http://repository.apache.org/snapshots/org/apache/jclouds/api/byon/1.7.3-SNAPSHOT/byon-1.7.3-SNAPSHOT.pom
[WARNING] The POM for org.apache.jclouds.api:byon:jar:1.7.3-SNAPSHOT is missing, no dependency information available
Downloading: https://repository.apache.org/content/repositories/snapshots/org/apache/jclouds/driver/jclouds-sshj/1.7.3-SNAPSHOT/maven-metadata.xml
Downloading: https://oss.sonatype.org/content/repositories/snapshots/org/apache/jclouds/driver/jclouds-sshj/1.7.3-SNAPSHOT/maven-metadata.xml
Downloading: http://repository.apache.org/snapshots/org/apache/jclouds/driver/jclouds-sshj/1.7.3-SNAPSHOT/maven-metadata.xml
[WARNING] Could not transfer metadata org.apache.jclouds.driver:jclouds-sshj:1.7.3-SNAPSHOT/maven-metadata.xml from/to apache-snapshots (https://repository.apache.org/content/repositories/snapshots): Failed to transfer file: https://repository.apache.org/content/repositories/snapshots/org/apache/jclouds/driver/jclouds-sshj/1.7.3-SNAPSHOT/maven-metadata.xml. Return code is: 500 , ReasonPhrase:Server Error.
[WARNING] Could not transfer metadata org.apache.jclouds.driver:jclouds-sshj:1.7.3-SNAPSHOT/maven-metadata.xml from/to apache.snapshots (http://repository.apache.org/snapshots): Failed to transfer file: http://repository.apache.org/snapshots/org/apache/jclouds/driver/jclouds-sshj/1.7.3-SNAPSHOT/maven-metadata.xml. Return code is: 500 , ReasonPhrase:Server Error.
[WARNING] Failure to transfer org.apache.jclouds.driver:jclouds-sshj:1.7.3-SNAPSHOT/maven-metadata.xml from https://repository.apache.org/content/repositories/snapshots was cached in the local repository, resolution will not be reattempted until the update interval of apache-snapshots has elapsed or updates are forced. Original error: Could not transfer metadata org.apache.jclouds.driver:jclouds-sshj:1.7.3-SNAPSHOT/maven-metadata.xml from/to apache-snapshots (https://repository.apache.org/content/repositories/snapshots): Failed to transfer file: https://repository.apache.org/content/repositories/snapshots/org/apache/jclouds/driver/jclouds-sshj/1.7.3-SNAPSHOT/maven-metadata.xml. Return code is: 500 , ReasonPhrase:Server Error.
[WARNING] Failure to transfer org.apache.jclouds.driver:jclouds-sshj:1.7.3-SNAPSHOT/maven-metadata.xml from http://repository.apache.org/snapshots was cached in the local repository, resolution will not be reattempted until the update interval of apache.snapshots has elapsed or updates are forced. Original error: Could not transfer metadata org.apache.jclouds.driver:jclouds-sshj:1.7.3-SNAPSHOT/maven-metadata.xml from/to apache.snapshots (http://repository.apache.org/snapshots): Failed to transfer file: http://repository.apache.org/snapshots/org/apache/jclouds/driver/jclouds-sshj/1.7.3-SNAPSHOT/maven-metadata.xml. Return code is: 500 , ReasonPhrase:Server Error.
Downloading: https://repository.apache.org/content/repositories/snapshots/org/apache/jclouds/driver/jclouds-sshj/1.7.3-SNAPSHOT/jclouds-sshj-1.7.3-SNAPSHOT.pom
Downloading: https://oss.sonatype.org/content/repositories/snapshots/org/apache/jclouds/driver/jclouds-sshj/1.7.3-SNAPSHOT/jclouds-sshj-1.7.3-SNAPSHOT.pom
Downloading: http://repository.apache.org/snapshots/org/apache/jclouds/driver/jclouds-sshj/1.7.3-SNAPSHOT/jclouds-sshj-1.7.3-SNAPSHOT.pom
[WARNING] The POM for org.apache.jclouds.driver:jclouds-sshj:jar:1.7.3-SNAPSHOT is missing, no dependency information available
Downloading: https://repository.apache.org/content/repositories/snapshots/org/apache/jclouds/driver/jclouds-slf4j/1.7.3-SNAPSHOT/maven-metadata.xml
Downloading: https://oss.sonatype.org/content/repositories/snapshots/org/apache/jclouds/driver/jclouds-slf4j/1.7.3-SNAPSHOT/maven-metadata.xml
Downloading: http://repository.apache.org/snapshots/org/apache/jclouds/driver/jclouds-slf4j/1.7.3-SNAPSHOT/maven-metadata.xml
[WARNING] Could not transfer metadata org.apache.jclouds.driver:jclouds-slf4j:1.7.3-SNAPSHOT/maven-metadata.xml from/to apache-snapshots (https://repository.apache.org/content/repositories/snapshots): Failed to transfer file: https://repository.apache.org/content/repositories/snapshots/org/apache/jclouds/driver/jclouds-slf4j/1.7.3-SNAPSHOT/maven-metadata.xml. Return code is: 500 , ReasonPhrase:Server Error.
[WARNING] Could not transfer metadata org.apache.jclouds.driver:jclouds-slf4j:1.7.3-SNAPSHOT/maven-metadata.xml from/to apache.snapshots (http://repository.apache.org/snapshots): Failed to transfer file: http://repository.apache.org/snapshots/org/apache/jclouds/driver/jclouds-slf4j/1.7.3-SNAPSHOT/maven-metadata.xml. Return code is: 500 , ReasonPhrase:Server Error.
[WARNING] Failure to transfer org.apache.jclouds:jclouds-project:1.7.3-SNAPSHOT/maven-metadata.xml from https://repository.apache.org/content/repositories/snapshots was cached in the local repository, resolution will not be reattempted until the update interval of apache-snapshots has elapsed or updates are forced. Original error: Could not transfer metadata org.apache.jclouds:jclouds-project:1.7.3-SNAPSHOT/maven-metadata.xml from/to apache-snapshots (https://repository.apache.org/content/repositories/snapshots): Failed to transfer file: https://repository.apache.org/content/repositories/snapshots/org/apache/jclouds/jclouds-project/1.7.3-SNAPSHOT/maven-metadata.xml. Return code is: 500 , ReasonPhrase:Server Error.
Downloading: http://repository.apache.org/snapshots/org/apache/jclouds/jclouds-project/1.7.3-SNAPSHOT/maven-metadata.xml
Downloading: https://oss.sonatype.org/content/repositories/snapshots/org/apache/jclouds/jclouds-project/1.7.3-SNAPSHOT/maven-metadata.xml
[WARNING] Could not transfer metadata org.apache.jclouds:jclouds-project:1.7.3-SNAPSHOT/maven-metadata.xml from/to apache.snapshots (http://repository.apache.org/snapshots): Failed to transfer file: http://repository.apache.org/snapshots/org/apache/jclouds/jclouds-project/1.7.3-SNAPSHOT/maven-metadata.xml. Return code is: 500 , ReasonPhrase:Server Error.
Downloading: https://repository.apache.org/content/repositories/snapshots/org/apache/jclouds/jclouds-core/1.7.3-SNAPSHOT/maven-metadata.xml
Downloading: http://repository.apache.org/snapshots/org/apache/jclouds/jclouds-core/1.7.3-SNAPSHOT/maven-metadata.xml
Downloading: https://oss.sonatype.org/content/repositories/snapshots/org/apache/jclouds/jclouds-core/1.7.3-SNAPSHOT/maven-metadata.xml
Downloading: https://oss.sonatype.org/content/repositories/snapshots/org/apache/jclouds/jclouds-core/1.7.3-SNAPSHOT/maven-metadata.xml
[WARNING] Could not transfer metadata org.apache.jclouds:jclouds-core:1.7.3-SNAPSHOT/maven-metadata.xml from/to apache-snapshots (https://repository.apache.org/content/repositories/snapshots): Failed to transfer file: https://repository.apache.org/content/repositories/snapshots/org/apache/jclouds/jclouds-core/1.7.3-SNAPSHOT/maven-metadata.xml. Return code is: 500 , ReasonPhrase:Server Error.
[WARNING] Could not transfer metadata org.apache.jclouds:jclouds-core:1.7.3-SNAPSHOT/maven-metadata.xml from/to apache.snapshots (http://repository.apache.org/snapshots): Failed to transfer file: http://repository.apache.org/snapshots/org/apache/jclouds/jclouds-core/1.7.3-SNAPSHOT/maven-metadata.xml. Return code is: 500 , ReasonPhrase:Server Error.
[WARNING] Failure to transfer org.apache.jclouds:jclouds-core:1.7.3-SNAPSHOT/maven-metadata.xml from https://repository.apache.org/content/repositories/snapshots was cached in the local repository, resolution will not be reattempted until the update interval of apache-snapshots has elapsed or updates are forced. Original error: Could not transfer metadata org.apache.jclouds:jclouds-core:1.7.3-SNAPSHOT/maven-metadata.xml from/to apache-snapshots (https://repository.apache.org/content/repositories/snapshots): Failed to transfer file: https://repository.apache.org/content/repositories/snapshots/org/apache/jclouds/jclouds-core/1.7.3-SNAPSHOT/maven-metadata.xml. Return code is: 500 , ReasonPhrase:Server Error.
[WARNING] Failure to transfer org.apache.jclouds:jclouds-core:1.7.3-SNAPSHOT/maven-metadata.xml from http://repository.apache.org/snapshots was cached in the local repository, resolution will not be reattempted until the update interval of apache.snapshots has elapsed or updates are forced. Original error: Could not transfer metadata org.apache.jclouds:jclouds-core:1.7.3-SNAPSHOT/maven-metadata.xml from/to apache.snapshots (http://repository.apache.org/snapshots): Failed to transfer file: http://repository.apache.org/snapshots/org/apache/jclouds/jclouds-core/1.7.3-SNAPSHOT/maven-metadata.xml. Return code is: 500 , ReasonPhrase:Server Error.
[WARNING] Failure to transfer org.apache.jclouds:jclouds-compute:1.7.3-SNAPSHOT/maven-metadata.xml from https://repository.apache.org/content/repositories/snapshots was cached in the local repository, resolution will not be reattempted until the update interval of apache-snapshots has elapsed or updates are forced. Original error: Could not transfer metadata org.apache.jclouds:jclouds-compute:1.7.3-SNAPSHOT/maven-metadata.xml from/to apache-snapshots (https://repository.apache.org/content/repositories/snapshots): Failed to transfer file: https://repository.apache.org/content/repositories/snapshots/org/apache/jclouds/jclouds-compute/1.7.3-SNAPSHOT/maven-metadata.xml. Return code is: 500 , ReasonPhrase:Server Error.
[WARNING] Failure to transfer org.apache.jclouds:jclouds-compute:1.7.3-SNAPSHOT/maven-metadata.xml from http://repository.apache.org/snapshots was cached in the local repository, resolution will not be reattempted until the update interval of apache.snapshots has elapsed or updates are forced. Original error: Could not transfer metadata org.apache.jclouds:jclouds-compute:1.7.3-SNAPSHOT/maven-metadata.xml from/to apache.snapshots (http://repository.apache.org/snapshots): Failed to transfer file: http://repository.apache.org/snapshots/org/apache/jclouds/jclouds-compute/1.7.3-SNAPSHOT/maven-metadata.xml. Return code is: 500 , ReasonPhrase:Server Error.
Downloading: https://repository.apache.org/content/repositories/snapshots/org/apache/jclouds/jclouds-compute/1.7.3-SNAPSHOT/jclouds-compute-1.7.3-SNAPSHOT.pom
Downloading: https://oss.sonatype.org/content/repositories/snapshots/org/apache/jclouds/jclouds-compute/1.7.3-SNAPSHOT/jclouds-compute-1.7.3-SNAPSHOT.pom
Downloading: http://repository.apache.org/snapshots/org/apache/jclouds/jclouds-compute/1.7.3-SNAPSHOT/jclouds-compute-1.7.3-SNAPSHOT.pom
[WARNING] The POM for org.apache.jclouds:jclouds-compute:jar:tests:1.7.3-SNAPSHOT is missing, no dependency information available
Downloading: https://repository.apache.org/content/repositories/snapshots/org/apache/jclouds/jclouds-compute/1.7.3-SNAPSHOT/jclouds-compute-1.7.3-SNAPSHOT.jar
Downloading: https://repository.apache.org/content/repositories/snapshots/org/apache/jclouds/api/byon/1.7.3-SNAPSHOT/byon-1.7.3-SNAPSHOT.jar
Downloading: https://repository.apache.org/content/repositories/snapshots/org/apache/jclouds/driver/jclouds-sshj/1.7.3-SNAPSHOT/jclouds-sshj-1.7.3-SNAPSHOT.jar
Downloading: https://repository.apache.org/content/repositories/snapshots/org/apache/jclouds/jclouds-compute/1.7.3-SNAPSHOT/jclouds-compute-1.7.3-SNAPSHOT-tests.jar
Downloading: https://oss.sonatype.org/content/repositories/snapshots/org/apache/jclouds/jclouds-compute/1.7.3-SNAPSHOT/jclouds-compute-1.7.3-SNAPSHOT.jar
Downloading: https://oss.sonatype.org/content/repositories/snapshots/org/apache/jclouds/api/byon/1.7.3-SNAPSHOT/byon-1.7.3-SNAPSHOT.jar
Downloading: https://oss.sonatype.org/content/repositories/snapshots/org/apache/jclouds/driver/jclouds-sshj/1.7.3-SNAPSHOT/jclouds-sshj-1.7.3-SNAPSHOT.jar
Downloading: https://oss.sonatype.org/content/repositories/snapshots/org/apache/jclouds/jclouds-compute/1.7.3-SNAPSHOT/jclouds-compute-1.7.3-SNAPSHOT-tests.jar
Downloading: http://repository.apache.org/snapshots/org/apache/jclouds/jclouds-compute/1.7.3-SNAPSHOT/jclouds-compute-1.7.3-SNAPSHOT.jar
Downloading: http://repository.apache.org/snapshots/org/apache/jclouds/api/byon/1.7.3-SNAPSHOT/byon-1.7.3-SNAPSHOT.jar
Downloading: http://repository.apache.org/snapshots/org/apache/jclouds/jclouds-compute/1.7.3-SNAPSHOT/jclouds-compute-1.7.3-SNAPSHOT-tests.jar
Downloading: http://repository.apache.org/snapshots/org/apache/jclouds/driver/jclouds-sshj/1.7.3-SNAPSHOT/jclouds-sshj-1.7.3-SNAPSHOT.jar
[INFO] ------------------------------------------------------------------------
[INFO] Reactor Summary:
[INFO] 
[INFO] Apache jclouds labs ............................... SUCCESS [37.849s]
[INFO] jclouds virtualbox api ............................ FAILURE [8.939s]
[INFO] jclouds dmtf domain objects ....................... SKIPPED
[INFO] jclouds vcloud-director api ....................... SKIPPED
[INFO] jclouds cdmi api .................................. SKIPPED
[INFO] jclouds CloudSigma v2 API ......................... SKIPPED
[INFO] jclouds CloudSigma v2 Las Vegas Provider .......... SKIPPED
[INFO] jclouds CloudSigma v2 Washington DC Provider ...... SKIPPED
[INFO] jclouds CloudSigma v2 Zurich Provider ............. SKIPPED
[INFO] jclouds DigitalOcean Provider ..................... SKIPPED
[INFO] jclouds joyent-cloudapi api ....................... SKIPPED
[INFO] jclouds joyentcloud provider ...................... SKIPPED
[INFO] jclouds Fujitsu Global Cloud Platform ............. SKIPPED
[INFO] jclouds Fujitsu Global Cloud Platform AU provider . SKIPPED
[INFO] jclouds Fujitsu Global Cloud Platform DE provider . SKIPPED
[INFO] jclouds Abiquo api ................................ SKIPPED
[INFO] jclouds :: representations ........................ SKIPPED
[INFO] jclouds :: representations :: core ................ SKIPPED
[INFO] jclouds :: representations :: codec ............... SKIPPED
[INFO] jclouds :: management ............................. SKIPPED
[INFO] jclouds :: management :: core ..................... SKIPPED
[INFO] jclouds :: management :: compute .................. SKIPPED
[INFO] jclouds :: management :: blobstore ................ SKIPPED
[INFO] ------------------------------------------------------------------------
[INFO] BUILD FAILURE
[INFO] ------------------------------------------------------------------------
[INFO] Total time: 1:02.855s
[INFO] Finished at: Mon May 26 03:32:15 UTC 2014
[INFO] Final Memory: 24M/59M
[INFO] ------------------------------------------------------------------------
Waiting for Jenkins to finish collecting data
[ERROR] Failed to execute goal on project virtualbox: Could not resolve dependencies for project org.apache.jclouds.labs:virtualbox:bundle:1.7.3-SNAPSHOT: The following artifacts could not be resolved: org.apache.jclouds:jclouds-compute:jar:1.7.3-SNAPSHOT, org.apache.jclouds.api:byon:jar:1.7.3-SNAPSHOT, org.apache.jclouds.driver:jclouds-sshj:jar:1.7.3-SNAPSHOT, org.apache.jclouds:jclouds-compute:jar:tests:1.7.3-SNAPSHOT: Could not find artifact org.apache.jclouds:jclouds-compute:jar:1.7.3-SNAPSHOT in apache-snapshots (https://repository.apache.org/content/repositories/snapshots) -> [Help 1]
org.apache.maven.lifecycle.LifecycleExecutionException: Failed to execute goal on project virtualbox: Could not resolve dependencies for project org.apache.jclouds.labs:virtualbox:bundle:1.7.3-SNAPSHOT: The following artifacts could not be resolved: org.apache.jclouds:jclouds-compute:jar:1.7.3-SNAPSHOT, org.apache.jclouds.api:byon:jar:1.7.3-SNAPSHOT, org.apache.jclouds.driver:jclouds-sshj:jar:1.7.3-SNAPSHOT, org.apache.jclouds:jclouds-compute:jar:tests:1.7.3-SNAPSHOT: Could not find artifact org.apache.jclouds:jclouds-compute:jar:1.7.3-SNAPSHOT in apache-snapshots (https://repository.apache.org/content/repositories/snapshots)
	at org.apache.maven.lifecycle.internal.LifecycleDependencyResolver.getDependencies(LifecycleDependencyResolver.java:210)
	at org.apache.maven.lifecycle.internal.LifecycleDependencyResolver.resolveProjectDependencies(LifecycleDependencyResolver.java:117)
	at org.apache.maven.lifecycle.internal.MojoExecutor.ensureDependenciesAreResolved(MojoExecutor.java:258)
	at org.apache.maven.lifecycle.internal.MojoExecutor.execute(MojoExecutor.java:201)
	at org.apache.maven.lifecycle.internal.MojoExecutor.execute(MojoExecutor.java:153)
	at org.apache.maven.lifecycle.internal.MojoExecutor.execute(MojoExecutor.java:145)
	at org.apache.maven.lifecycle.internal.LifecycleModuleBuilder.buildProject(LifecycleModuleBuilder.java:84)
	at org.apache.maven.lifecycle.internal.LifecycleModuleBuilder.buildProject(LifecycleModuleBuilder.java:59)
	at org.apache.maven.lifecycle.internal.LifecycleStarter.singleThreadedBuild(LifecycleStarter.java:183)
	at org.apache.maven.lifecycle.internal.LifecycleStarter.execute(LifecycleStarter.java:161)
	at org.apache.maven.DefaultMaven.doExecute(DefaultMaven.java:320)
	at org.apache.maven.DefaultMaven.execute(DefaultMaven.java:156)
	at org.jvnet.hudson.maven3.launcher.Maven3Launcher.main(Maven3Launcher.java:117)
	at sun.reflect.NativeMethodAccessorImpl.invoke0(Native Method)
	at sun.reflect.NativeMethodAccessorImpl.invoke(NativeMethodAccessorImpl.java:57)
	at sun.reflect.DelegatingMethodAccessorImpl.invoke(DelegatingMethodAccessorImpl.java:43)
	at java.lang.reflect.Method.invoke(Method.java:606)
	at org.codehaus.plexus.classworlds.launcher.Launcher.launchStandard(Launcher.java:329)
	at org.codehaus.plexus.classworlds.launcher.Launcher.launch(Launcher.java:239)
	at org.jvnet.hudson.maven3.agent.Maven3Main.launch(Maven3Main.java:178)
	at sun.reflect.NativeMethodAccessorImpl.invoke0(Native Method)
	at sun.reflect.NativeMethodAccessorImpl.invoke(NativeMethodAccessorImpl.java:57)
	at sun.reflect.DelegatingMethodAccessorImpl.invoke(DelegatingMethodAccessorImpl.java:43)
	at java.lang.reflect.Method.invoke(Method.java:606)
	at hudson.maven.Maven3Builder.call(Maven3Builder.java:134)
	at hudson.maven.Maven3Builder.call(Maven3Builder.java:69)
	at hudson.remoting.UserRequest.perform(UserRequest.java:118)
	at hudson.remoting.UserRequest.perform(UserRequest.java:48)
	at hudson.remoting.Request$2.run(Request.java:328)
	at hudson.remoting.InterceptingExecutorService$1.call(InterceptingExecutorService.java:72)
	at java.util.concurrent.FutureTask.run(FutureTask.java:262)
	at java.util.concurrent.ThreadPoolExecutor.runWorker(ThreadPoolExecutor.java:1145)
	at java.util.concurrent.ThreadPoolExecutor$Worker.run(ThreadPoolExecutor.java:615)
	at java.lang.Thread.run(Thread.java:744)
Caused by: org.apache.maven.project.DependencyResolutionException: Could not resolve dependencies for project org.apache.jclouds.labs:virtualbox:bundle:1.7.3-SNAPSHOT: The following artifacts could not be resolved: org.apache.jclouds:jclouds-compute:jar:1.7.3-SNAPSHOT, org.apache.jclouds.api:byon:jar:1.7.3-SNAPSHOT, org.apache.jclouds.driver:jclouds-sshj:jar:1.7.3-SNAPSHOT, org.apache.jclouds:jclouds-compute:jar:tests:1.7.3-SNAPSHOT: Could not find artifact org.apache.jclouds:jclouds-compute:jar:1.7.3-SNAPSHOT in apache-snapshots (https://repository.apache.org/content/repositories/snapshots)
	at org.apache.maven.project.DefaultProjectDependenciesResolver.resolve(DefaultProjectDependenciesResolver.java:189)
	at org.apache.maven.lifecycle.internal.LifecycleDependencyResolver.getDependencies(LifecycleDependencyResolver.java:185)
	... 33 more
Caused by: org.sonatype.aether.resolution.DependencyResolutionException: The following artifacts could not be resolved: org.apache.jclouds:jclouds-compute:jar:1.7.3-SNAPSHOT, org.apache.jclouds.api:byon:jar:1.7.3-SNAPSHOT, org.apache.jclouds.driver:jclouds-sshj:jar:1.7.3-SNAPSHOT, org.apache.jclouds:jclouds-compute:jar:tests:1.7.3-SNAPSHOT: Could not find artifact org.apache.jclouds:jclouds-compute:jar:1.7.3-SNAPSHOT in apache-snapshots (https://repository.apache.org/content/repositories/snapshots)
	at org.sonatype.aether.impl.internal.DefaultRepositorySystem.resolveDependencies(DefaultRepositorySystem.java:375)
	at org.apache.maven.project.DefaultProjectDependenciesResolver.resolve(DefaultProjectDependenciesResolver.java:183)
	... 34 more
Caused by: org.sonatype.aether.resolution.ArtifactResolutionException: The following artifacts could not be resolved: org.apache.jclouds:jclouds-compute:jar:1.7.3-SNAPSHOT, org.apache.jclouds.api:byon:jar:1.7.3-SNAPSHOT, org.apache.jclouds.driver:jclouds-sshj:jar:1.7.3-SNAPSHOT, org.apache.jclouds:jclouds-compute:jar:tests:1.7.3-SNAPSHOT: Could not find artifact org.apache.jclouds:jclouds-compute:jar:1.7.3-SNAPSHOT in apache-snapshots (https://repository.apache.org/content/repositories/snapshots)
	at org.sonatype.aether.impl.internal.DefaultArtifactResolver.resolve(DefaultArtifactResolver.java:538)
	at org.sonatype.aether.impl.internal.DefaultArtifactResolver.resolveArtifacts(DefaultArtifactResolver.java:216)
	at org.sonatype.aether.impl.internal.DefaultRepositorySystem.resolveDependencies(DefaultRepositorySystem.java:358)
	... 35 more
Caused by: org.sonatype.aether.transfer.ArtifactNotFoundException: Could not find artifact org.apache.jclouds:jclouds-compute:jar:1.7.3-SNAPSHOT in apache-snapshots (https://repository.apache.org/content/repositories/snapshots)
	at org.sonatype.aether.connector.wagon.WagonRepositoryConnector$4.wrap(WagonRepositoryConnector.java:947)
	at org.sonatype.aether.connector.wagon.WagonRepositoryConnector$4.wrap(WagonRepositoryConnector.java:941)
	at org.sonatype.aether.connector.wagon.WagonRepositoryConnector$GetTask.run(WagonRepositoryConnector.java:669)
	at org.sonatype.aether.util.concurrency.RunnableErrorForwarder$1.run(RunnableErrorForwarder.java:60)
	... 3 more
[ERROR] 
[ERROR] Re-run Maven using the -X switch to enable full debug logging.
[ERROR] 
[ERROR] For more information about the errors and possible solutions, please read the following articles:
[ERROR] [Help 1] http://cwiki.apache.org/confluence/display/MAVEN/DependencyResolutionException
[ERROR] 
[ERROR] After correcting the problems, you can resume the build with the command
[ERROR]   mvn <goals> -rf :virtualbox
[JENKINS] Archiving <https://buildhive.cloudbees.com/job/jclouds/job/jclouds-labs/ws/cloudsigma2/pom.xml> to org.apache.jclouds.labs/cloudsigma2/1.7.3-SNAPSHOT/cloudsigma2-1.7.3-SNAPSHOT.pom
[JENKINS] Archiving <https://buildhive.cloudbees.com/job/jclouds/job/jclouds-labs/ws/fgcp-au/pom.xml> to org.apache.jclouds.labs/fgcp-au/1.7.3-SNAPSHOT/fgcp-au-1.7.3-SNAPSHOT.pom
[JENKINS] Archiving <https://buildhive.cloudbees.com/job/jclouds/job/jclouds-labs/ws/cloudsigma2-zrh/pom.xml> to org.apache.jclouds.labs/cloudsigma2-zrh/1.7.3-SNAPSHOT/cloudsigma2-zrh-1.7.3-SNAPSHOT.pom
[JENKINS] Archiving <https://buildhive.cloudbees.com/job/jclouds/job/jclouds-labs/ws/joyent-cloudapi/pom.xml> to org.apache.jclouds.labs/joyent-cloudapi/1.7.3-SNAPSHOT/joyent-cloudapi-1.7.3-SNAPSHOT.pom
[JENKINS] Archiving <https://buildhive.cloudbees.com/job/jclouds/job/jclouds-labs/ws/pom.xml> to org.apache.jclouds.labs/jclouds-labs/1.7.3-SNAPSHOT/jclouds-labs-1.7.3-SNAPSHOT.pom
[JENKINS] Archiving <https://buildhive.cloudbees.com/job/jclouds/job/jclouds-labs/ws/target/jclouds-labs-1.7.3-SNAPSHOT-tests.jar> to org.apache.jclouds.labs/jclouds-labs/1.7.3-SNAPSHOT/jclouds-labs-1.7.3-SNAPSHOT-tests.jar
[JENKINS] Archiving <https://buildhive.cloudbees.com/job/jclouds/job/jclouds-labs/ws/cloudsigma2-wdc/pom.xml> to org.apache.jclouds.labs/cloudsigma2-wdc/1.7.3-SNAPSHOT/cloudsigma2-wdc-1.7.3-SNAPSHOT.pom
[JENKINS] Archiving <https://buildhive.cloudbees.com/job/jclouds/job/jclouds-labs/ws/vcloud-director/pom.xml> to org.apache.jclouds.labs/vcloud-director/1.7.3-SNAPSHOT/vcloud-director-1.7.3-SNAPSHOT.pom
[JENKINS] Archiving <https://buildhive.cloudbees.com/job/jclouds/job/jclouds-labs/ws/jclouds-representations/pom.xml> to org.apache.jclouds.labs/jclouds-representations/1.7.3-SNAPSHOT/jclouds-representations-1.7.3-SNAPSHOT.pom
[JENKINS] Archiving <https://buildhive.cloudbees.com/job/jclouds/job/jclouds-labs/ws/jclouds-management/pom.xml> to org.apache.jclouds.labs/jclouds-management/1.7.3-SNAPSHOT/jclouds-management-1.7.3-SNAPSHOT.pom
[JENKINS] Archiving <https://buildhive.cloudbees.com/job/jclouds/job/jclouds-labs/ws/virtualbox/pom.xml> to org.apache.jclouds.labs/virtualbox/1.7.3-SNAPSHOT/virtualbox-1.7.3-SNAPSHOT.pom
[JENKINS] Archiving <https://buildhive.cloudbees.com/job/jclouds/job/jclouds-labs/ws/fgcp-de/pom.xml> to org.apache.jclouds.labs/fgcp-de/1.7.3-SNAPSHOT/fgcp-de-1.7.3-SNAPSHOT.pom
[JENKINS] Archiving <https://buildhive.cloudbees.com/job/jclouds/job/jclouds-labs/ws/jclouds-representations/representations-codec/pom.xml> to org.apache.jclouds.labs.representations/representations-codec/1.7.3-SNAPSHOT/representations-codec-1.7.3-SNAPSHOT.pom
[JENKINS] Archiving <https://buildhive.cloudbees.com/job/jclouds/job/jclouds-labs/ws/jclouds-management/management-compute/pom.xml> to org.apache.jclouds.labs.management/management-compute/1.7.3-SNAPSHOT/management-compute-1.7.3-SNAPSHOT.pom
[JENKINS] Archiving <https://buildhive.cloudbees.com/job/jclouds/job/jclouds-labs/ws/dmtf/pom.xml> to org.apache.jclouds.labs/dmtf/1.7.3-SNAPSHOT/dmtf-1.7.3-SNAPSHOT.pom
[JENKINS] Archiving <https://buildhive.cloudbees.com/job/jclouds/job/jclouds-labs/ws/digitalocean/pom.xml> to org.apache.jclouds.labs/digitalocean/1.7.3-SNAPSHOT/digitalocean-1.7.3-SNAPSHOT.pom
[JENKINS] Archiving <https://buildhive.cloudbees.com/job/jclouds/job/jclouds-labs/ws/joyentcloud/pom.xml> to org.apache.jclouds.labs/joyentcloud/1.7.3-SNAPSHOT/joyentcloud-1.7.3-SNAPSHOT.pom
[JENKINS] Archiving <https://buildhive.cloudbees.com/job/jclouds/job/jclouds-labs/ws/fgcp/pom.xml> to org.apache.jclouds.labs/fgcp/1.7.3-SNAPSHOT/fgcp-1.7.3-SNAPSHOT.pom
[JENKINS] Archiving <https://buildhive.cloudbees.com/job/jclouds/job/jclouds-labs/ws/cloudsigma2-lvs/pom.xml> to org.apache.jclouds.labs/cloudsigma2-lvs/1.7.3-SNAPSHOT/cloudsigma2-lvs-1.7.3-SNAPSHOT.pom
[JENKINS] Archiving <https://buildhive.cloudbees.com/job/jclouds/job/jclouds-labs/ws/jclouds-management/management-blobstore/pom.xml> to org.apache.jclouds.labs.management/management-blobstore/1.7.3-SNAPSHOT/management-blobstore-1.7.3-SNAPSHOT.pom
[JENKINS] Archiving <https://buildhive.cloudbees.com/job/jclouds/job/jclouds-labs/ws/jclouds-management/management-core/pom.xml> to org.apache.jclouds.labs.management/management-core/1.7.3-SNAPSHOT/management-core-1.7.3-SNAPSHOT.pom
[JENKINS] Archiving <https://buildhive.cloudbees.com/job/jclouds/job/jclouds-labs/ws/abiquo/pom.xml> to org.apache.jclouds.labs/abiquo/1.7.3-SNAPSHOT/abiquo-1.7.3-SNAPSHOT.pom
[JENKINS] Archiving <https://buildhive.cloudbees.com/job/jclouds/job/jclouds-labs/ws/jclouds-representations/representations-core/pom.xml> to org.apache.jclouds.labs.representations/representations-core/1.7.3-SNAPSHOT/representations-core-1.7.3-SNAPSHOT.pom
[JENKINS] Archiving <https://buildhive.cloudbees.com/job/jclouds/job/jclouds-labs/ws/cdmi/pom.xml> to org.apache.jclouds.labs/cdmi/1.7.3-SNAPSHOT/cdmi-1.7.3-SNAPSHOT.pom
channel stopped