You are viewing a plain text version of this content. The canonical link for it is here.
Posted to yarn-dev@hadoop.apache.org by Apache Jenkins Server <je...@builds.apache.org> on 2015/04/10 23:36:38 UTC
Failed: YARN-2740 PreCommit Build #7305
Jira: https://issues.apache.org/jira/browse/YARN-2740
Build: https://builds.apache.org/job/PreCommit-YARN-Build/7305/
###################################################################################
########################## LAST 60 LINES OF THE CONSOLE ###########################
[...truncated 3785 lines...]
{color:red}-1 overall{color}. Here are the results of testing the latest attachment
http://issues.apache.org/jira/secure/attachment/12724645/YARN-2740.20150411-2.patch
against trunk revision 7660da9.
{color:green}+1 @author{color}. The patch does not contain any @author tags.
{color:green}+1 tests included{color}. The patch appears to include 6 new or modified test files.
{color:green}+1 javac{color}. The applied patch does not increase the total number of javac compiler warnings.
{color:green}+1 javadoc{color}. There were no new javadoc warning messages.
{color:green}+1 eclipse:eclipse{color}. The patch built with eclipse:eclipse.
{color:green}+1 findbugs{color}. The patch does not introduce any new Findbugs (version 2.0.3) warnings.
{color:green}+1 release audit{color}. The applied patch does not increase the total number of release audit warnings.
{color:red}-1 core tests{color}. The patch failed these unit tests in hadoop-yarn-project/hadoop-yarn/hadoop-yarn-common hadoop-yarn-project/hadoop-yarn/hadoop-yarn-server/hadoop-yarn-server-resourcemanager:
org.apache.hadoop.yarn.server.resourcemanager.webapp.TestRMWebServices
Test results: https://builds.apache.org/job/PreCommit-YARN-Build/7305//testReport/
Console output: https://builds.apache.org/job/PreCommit-YARN-Build/7305//console
This message is automatically generated.
======================================================================
======================================================================
Adding comment to Jira.
======================================================================
======================================================================
Comment added.
39a5939b45a80da6e324dddd39d5be0f9db50ea5 logged out
======================================================================
======================================================================
Finished build.
======================================================================
======================================================================
Build step 'Execute shell' marked build as failure
Archiving artifacts
Sending artifact delta relative to PreCommit-YARN-Build #7302
Archived 20 artifacts
Archive block size is 32768
Received 235 blocks and 1761499 bytes
Compression is 81.4%
Took 1.4 sec
[description-setter] Could not determine description.
Recording test results
Email was triggered for: Failure
Sending email for trigger: Failure
###################################################################################
############################## FAILED TESTS (if any) ##############################
1 tests failed.
REGRESSION: org.apache.hadoop.yarn.server.resourcemanager.webapp.TestRMWebServices.testAppsRace
Error Message:
null
Stack Trace:
java.lang.NullPointerException: null
at org.apache.hadoop.yarn.server.resourcemanager.webapp.RMWebServices.<init>(RMWebServices.java:176)
at org.apache.hadoop.yarn.server.resourcemanager.webapp.RMWebServices.<init>(RMWebServices.java:194)
at org.apache.hadoop.yarn.server.resourcemanager.webapp.TestRMWebServices.testAppsRace(TestRMWebServices.java:627)
Success: YARN-3361 PreCommit Build #7306
Posted by Apache Jenkins Server <je...@builds.apache.org>.
Jira: https://issues.apache.org/jira/browse/YARN-3361
Build: https://builds.apache.org/job/PreCommit-YARN-Build/7306/
###################################################################################
########################## LAST 60 LINES OF THE CONSOLE ###########################
[...truncated 3722 lines...]
{color:green}+1 overall{color}. Here are the results of testing the latest attachment
http://issues.apache.org/jira/secure/attachment/12724656/YARN-3361.9.patch
against trunk revision 7660da9.
{color:green}+1 @author{color}. The patch does not contain any @author tags.
{color:green}+1 tests included{color}. The patch appears to include 12 new or modified test files.
{color:green}+1 javac{color}. The applied patch does not increase the total number of javac compiler warnings.
{color:green}+1 javadoc{color}. There were no new javadoc warning messages.
{color:green}+1 eclipse:eclipse{color}. The patch built with eclipse:eclipse.
{color:green}+1 findbugs{color}. The patch does not introduce any new Findbugs (version 2.0.3) warnings.
{color:green}+1 release audit{color}. The applied patch does not increase the total number of release audit warnings.
{color:green}+1 core tests{color}. The patch passed unit tests in hadoop-yarn-project/hadoop-yarn/hadoop-yarn-server/hadoop-yarn-server-common hadoop-yarn-project/hadoop-yarn/hadoop-yarn-server/hadoop-yarn-server-resourcemanager.
Test results: https://builds.apache.org/job/PreCommit-YARN-Build/7306//testReport/
Console output: https://builds.apache.org/job/PreCommit-YARN-Build/7306//console
This message is automatically generated.
======================================================================
======================================================================
Adding comment to Jira.
======================================================================
======================================================================
Comment added.
9683e7d4b88e4ec126b7835a62bac85e254a5d8a logged out
======================================================================
======================================================================
Finished build.
======================================================================
======================================================================
Archiving artifacts
Sending artifact delta relative to PreCommit-YARN-Build #7302
Archived 20 artifacts
Archive block size is 32768
Received 63 blocks and 7209202 bytes
Compression is 22.3%
Took 4.6 sec
Description set: YARN-3361
Recording test results
Email was triggered for: Success
Sending email for trigger: Success
###################################################################################
############################## FAILED TESTS (if any) ##############################
All tests passed