You are viewing a plain text version of this content. The canonical link for it is here.
Posted to commits@myfaces.apache.org by "Continuum@myfaces.zones.apache.org" <co...@myfaces.apache.org> on 2007/03/01 21:18:14 UTC

[continuum] BUILD FAILURE: API

Online report : http://myfaces.zones.apache.org:8081/continuum/buildResult.action?buildId=3897&projectId=67
Build statistics:
  State: Failed
  Previous State: Ok
  Started at: Thu, 1 Mar 2007 20:17:28 +0000
  Finished at: Thu, 1 Mar 2007 20:18:10 +0000
  Total time: 42s
  Build Trigger: Schedule
  Build Number: 37
  Exit code: 1
  Building machine hostname: myfaces.zones.apache.org
  Operating system : SunOS(unknown)
  Java version : 1.5.0_10(Sun Microsystems Inc.)

****************************************************************************
SCM Changes:
****************************************************************************
Changed: mbr @ Thu, 1 Mar 2007 19:34:37 +0000
Comment: throws JspException added
Files changed:
  /myfaces/core/branches/jsf12/api/src/main/java/javax/faces/webapp/UIComponentClassicTagBase.java ( 513460 )
  /myfaces/core/branches/jsf12/api/src/main/java/javax/faces/webapp/UIComponentELTag.java ( 513460 )

Changed: mbr @ Thu, 1 Mar 2007 19:37:22 +0000
Comment: generics are not defined in ri for public VALUES and VALUES_MAP
Files changed:
  /myfaces/core/branches/jsf12/api/src/main/java/javax/faces/application/FacesMessage.java ( 513465 )

Changed: mbr @ Thu, 1 Mar 2007 19:57:34 +0000
Comment: get/set methods for valueExpression must be implemented in UIComponent
Files changed:
  /myfaces/core/branches/jsf12/api/src/main/java/javax/faces/component/UIComponent.java ( 513469 )
  /myfaces/core/branches/jsf12/api/src/main/java/javax/faces/component/UIComponentBase.java ( 513469 )

****************************************************************************
SCM Changes since last success:
****************************************************************************
****************************************************************************
Dependencies Changes:
****************************************************************************
org.apache.myfaces.core:myfaces-build:1.2.0-SNAPSHOT

org.apache.myfaces.core:myfaces-core-project:1.2.0-SNAPSHOT

****************************************************************************
Test Summary:
****************************************************************************
Tests: 101
Failures: 2
Total time: 1958

****************************************************************************
Output:
****************************************************************************
[INFO] Scanning for projects...
[INFO] Searching repository for plugin with prefix: 'source'.
[INFO] ----------------------------------------------------------------------------
[INFO] Building API
[INFO]    task-segment: [clean, deploy, source:jar]
[INFO] ----------------------------------------------------------------------------
[INFO] [clean:clean]
[INFO] Deleting directory /local/continuum-1.1-SNAPSHOT/apps/continuum/working-directory/67/target
[INFO] Deleting directory /local/continuum-1.1-SNAPSHOT/apps/continuum/working-directory/67/target/classes
[INFO] Deleting directory /local/continuum-1.1-SNAPSHOT/apps/continuum/working-directory/67/target/test-classes
[INFO] [faces:generate-components {execution: default}]
[WARNING] Missing <component-family> for "javax.faces.component.UIColumn", generation of this Component is skipped
[WARNING] Missing <component-family> for "javax.faces.component.UIComponent", generation of this Component is skipped
[WARNING] Missing <component-family> for "javax.faces.component.UIComponentBase", generation of this Component is skipped
[WARNING] Missing <component-family> for "javax.faces.component.UIForm", generation of this Component is skipped
[INFO] Generated 45 component(s)
[INFO] [resources:resources]
[INFO] Using default encoding to copy filtered resources.
[INFO] [compiler:compile]
Compiling 160 source files to /local/continuum-1.1-SNAPSHOT/apps/continuum/working-directory/67/target/classes
[INFO] [resources:testResources]
[INFO] Using default encoding to copy filtered resources.
[INFO] [compiler:testCompile]
Compiling 20 source files to /local/continuum-1.1-SNAPSHOT/apps/continuum/working-directory/67/target/test-classes
[INFO] [surefire:test]
[INFO] Setting reports dir: /local/continuum-1.1-SNAPSHOT/apps/continuum/working-directory/67/target/surefire-reports

-------------------------------------------------------
 T E S T S
-------------------------------------------------------
[surefire] Running javax.faces.component._AttachedListStateWrapperTest
[surefire] Tests run: 2, Failures: 0, Errors: 0, Time elapsed: 0.04 sec
No Renderer found for component {Component-Path : [Class: javax.faces.component.UIViewRoot,ViewId: /viewId][Class: javax.faces.component.UIData,Id: data]} (component-family=javax.faces.Data, renderer-type=javax.faces.Table)
Mar 1, 2007 8:18:08 PM javax.faces.component.UIComponentBase getRenderer
WARNING: No Renderer found for component {Component-Path : [Class: javax.faces.component.UIViewRoot,ViewId: /viewId][Class: javax.faces.component.UIData,Id: data]} (component-family=javax.faces.Data, renderer-type=javax.faces.Table)
No Renderer found for component {Component-Path : [Class: javax.faces.component.UIViewRoot,ViewId: /viewId][Class: javax.faces.component.UIData,Id: data][Class: javax.faces.component.UIColumn,Id: null][Class: javax.faces.component.UIInput,Id: input]} (component-family=javax.faces.Input, renderer-type=javax.faces.Text)
Mar 1, 2007 8:18:08 PM javax.faces.component.UIComponentBase getRenderer
WARNING: No Renderer found for component {Component-Path : [Class: javax.faces.component.UIViewRoot,ViewId: /viewId][Class: javax.faces.component.UIData,Id: data][Class: javax.faces.component.UIColumn,Id: null][Class: javax.faces.component.UIInput,Id: input]} (component-family=javax.faces.Input, renderer-type=javax.faces.Text)
No Renderer found for component {Component-Path : [Class: javax.faces.component.UIViewRoot,ViewId: /viewId][Class: javax.faces.component.UIData,Id: data][Class: javax.faces.component.UIColumn,Id: null][Class: javax.faces.component.UIInput,Id: input]} (component-family=javax.faces.Input, renderer-type=javax.faces.Text)
Mar 1, 2007 8:18:08 PM javax.faces.component.UIComponentBase getRenderer
WARNING: No Renderer found for component {Component-Path : [Class: javax.faces.component.UIViewRoot,ViewId: /viewId][Class: javax.faces.component.UIData,Id: data][Class: javax.faces.component.UIColumn,Id: null][Class: javax.faces.component.UIInput,Id: input]} (component-family=javax.faces.Input, renderer-type=javax.faces.Text)
[surefire] Running javax.faces.component.UIComponentBaseTest
[surefire] Tests run: 45, Failures: 2, Errors: 0, Time elapsed: 0.399 sec <<<<<<<< FAILURE !! 
Component: {Component-Path : [Class: javax.faces.component.UIViewRoot,ViewId: /viewId]}
WARNING: Component j_id0 just got an automatic id, because there was no id assigned yet. If this component was created dynamically (i.e. not by a JSP tag) you should assign it an explicit static id or assign it the id you get from the createUniqueId from the current UIViewRoot component right after creation!
RC; 2
No Renderer found for component {Component-Path : [Class: javax.faces.component.UIViewRoot,ViewId: /viewId][Class: javax.faces.component.UIData,Id: table]} (component-family=javax.faces.Data, renderer-type=javax.faces.Table)
Mar 1, 2007 8:18:09 PM javax.faces.component.UIComponentBase getRenderer
WARNING: No Renderer found for component {Component-Path : [Class: javax.faces.component.UIViewRoot,ViewId: /viewId][Class: javax.faces.component.UIData,Id: table]} (component-family=javax.faces.Data, renderer-type=javax.faces.Table)
RC; 2
No Renderer found for component {Component-Path : [Class: javax.faces.component.UIViewRoot,ViewId: /viewId][Class: javax.faces.component.UIData,Id: table]} (component-family=javax.faces.Data, renderer-type=javax.faces.Table)
Mar 1, 2007 8:18:09 PM javax.faces.component.UIComponentBase getRenderer
WARNING: No Renderer found for component {Component-Path : [Class: javax.faces.component.UIViewRoot,ViewId: /viewId][Class: javax.faces.component.UIData,Id: table]} (component-family=javax.faces.Data, renderer-type=javax.faces.Table)
No Renderer found for component {Component-Path : [Class: javax.faces.component.UIViewRoot,ViewId: /viewId][Class: javax.faces.component.UIData,Id: table][Class: javax.faces.component.UIColumn,Id: col2][Class: javax.faces.component.UIOutput,Id: j_id1]} (component-family=javax.faces.Output, renderer-type=javax.faces.Text)
Mar 1, 2007 8:18:09 PM javax.faces.component.UIComponentBase getRenderer
WARNING: No Renderer found for component {Component-Path : [Class: javax.faces.component.UIViewRoot,ViewId: /viewId][Class: javax.faces.component.UIData,Id: table][Class: javax.faces.component.UIColumn,Id: col2][Class: javax.faces.component.UIOutput,Id: j_id1]} (component-family=javax.faces.Output, renderer-type=javax.faces.Text)
Component: {Component-Path : [Class: javax.faces.component.UIViewRoot,ViewId: /viewId][Class: javax.faces.component.UIData,Id: table][Class: javax.faces.component.UIColumn,Id: col2][Class: javax.faces.component.UIOutput,Id: j_id1]}
WARNING: Component table:j_id1 just got an automatic id, because there was no id assigned yet. If this component was created dynamically (i.e. not by a JSP tag) you should assign it an explicit static id or assign it the id you get from the createUniqueId from the current UIViewRoot component right after creation!
[surefire] Running javax.faces.component.InvokeOnComponentTest
[surefire] Tests run: 1, Failures: 0, Errors: 0, Time elapsed: 0.824 sec
[surefire] Running javax.faces.component._AttachedStateWrapperTest
[surefire] Tests run: 4, Failures: 0, Errors: 0, Time elapsed: 0.005 sec
resource bundle javax.faces.Messages could not be found
No message with id javax.faces.component.UIInput.REQUIRED found in any bundle
resource bundle javax.faces.Messages could not be found
No message with id javax.faces.component.UIInput.REQUIRED found in any bundle
[surefire] Running javax.faces.component.UISelectManyTest
[surefire] Tests run: 5, Failures: 0, Errors: 0, Time elapsed: 0.29 sec
[surefire] Running javax.faces.FactoryFinderTest
[surefire] Tests run: 9, Failures: 0, Errors: 0, Time elapsed: 0.007 sec
[surefire] Running javax.faces.application.FacesMessageTest
[surefire] Tests run: 12, Failures: 0, Errors: 0, Time elapsed: 0.006 sec
[surefire] Running javax.faces.application.ViewHandlerTest
[surefire] Tests run: 3, Failures: 0, Errors: 0, Time elapsed: 0.003 sec
[surefire] Running javax.faces.application.StateManagerTest
[surefire] Tests run: 5, Failures: 0, Errors: 0, Time elapsed: 0.338 sec
[surefire] Running javax.faces.application.ApplicationTest
[surefire] Tests run: 9, Failures: 0, Errors: 0, Time elapsed: 0.03 sec
resource bundle javax.faces.Messages could not be found
[surefire] Running javax.faces.convert.DateTimeConverterTest
[surefire] Tests run: 1, Failures: 0, Errors: 0, Time elapsed: 0.011 sec
[surefire] Running javax.faces.FacesExceptionTest
[surefire] Tests run: 5, Failures: 0, Errors: 0, Time elapsed: 0.003 sec

Results :
[surefire] Tests run: 101, Failures: 2, Errors: 0

[INFO] ------------------------------------------------------------------------
[ERROR] BUILD ERROR
[INFO] ------------------------------------------------------------------------
[INFO] There are some test failure.
[INFO] ------------------------------------------------------------------------
[INFO] For more information, run Maven with the -e switch
[INFO] ------------------------------------------------------------------------
[INFO] Total time: 39 seconds
[INFO] Finished at: Thu Mar 01 20:18:10 GMT+00:00 2007
[INFO] Final Memory: 9M/67M
[INFO] ------------------------------------------------------------------------

****************************************************************************