You are viewing a plain text version of this content. The canonical link for it is here.
Posted to mapreduce-dev@hadoop.apache.org by Apache Jenkins Server <je...@builds.apache.org> on 2015/11/12 01:23:30 UTC
Hadoop-Mapreduce-trunk-Java8 - Build # 659 - Still Failing
See https://builds.apache.org/job/Hadoop-Mapreduce-trunk-Java8/659/
###################################################################################
########################## LAST 60 LINES OF THE CONSOLE ###########################
[...truncated 10850 lines...]
Tests run: 3, Failures: 0, Errors: 0, Skipped: 0, Time elapsed: 4.84 sec - in org.apache.hadoop.mapreduce.lib.map.TestMultithreadedMapper
Java HotSpot(TM) 64-Bit Server VM warning: ignoring option MaxPermSize=768m; support was removed in 8.0
Running org.apache.hadoop.mapreduce.TestMapCollection
Tests run: 11, Failures: 0, Errors: 0, Skipped: 0, Time elapsed: 12.487 sec - in org.apache.hadoop.mapreduce.TestMapCollection
Java HotSpot(TM) 64-Bit Server VM warning: ignoring option MaxPermSize=768m; support was removed in 8.0
Running org.apache.hadoop.io.TestSequenceFileMergeProgress
Tests run: 3, Failures: 0, Errors: 0, Skipped: 0, Time elapsed: 1.407 sec - in org.apache.hadoop.io.TestSequenceFileMergeProgress
Results :
Tests in error:
TestMRTimelineEventHandling.testMRTimelineEventHandling:100 » IO Job didn't fi...
TestMRTimelineEventHandling.testMapreduceJobTimelineServiceEnabled:162 » IO Jo...
TestMROldApiJobs.tearDown:93 » NoClassDefFound org/apache/hadoop/service/Servi...
TestUberAM.setup:45->TestMRJobs.setup:163 » YarnRuntime java.lang.NoClassDefFo...
Tests run: 513, Failures: 0, Errors: 4, Skipped: 11
[INFO] ------------------------------------------------------------------------
[INFO] Reactor Summary:
[INFO]
[INFO] Apache Hadoop MapReduce Client .................... SUCCESS [ 2.155 s]
[INFO] Apache Hadoop MapReduce Core ...................... SUCCESS [01:23 min]
[INFO] Apache Hadoop MapReduce Common .................... SUCCESS [ 25.869 s]
[INFO] Apache Hadoop MapReduce Shuffle ................... SUCCESS [ 3.972 s]
[INFO] Apache Hadoop MapReduce App ....................... SUCCESS [10:48 min]
[INFO] Apache Hadoop MapReduce HistoryServer ............. SUCCESS [06:12 min]
[INFO] Apache Hadoop MapReduce JobClient ................. FAILURE [ 01:32 h]
[INFO] Apache Hadoop MapReduce HistoryServer Plugins ..... SKIPPED
[INFO] Apache Hadoop MapReduce NativeTask ................ SKIPPED
[INFO] Apache Hadoop MapReduce Examples .................. SKIPPED
[INFO] Apache Hadoop MapReduce ........................... SKIPPED
[INFO] ------------------------------------------------------------------------
[INFO] BUILD FAILURE
[INFO] ------------------------------------------------------------------------
[INFO] Total time: 01:51 h
[INFO] Finished at: 2015-11-12T00:23:18+00:00
[INFO] Final Memory: 34M/217M
[INFO] ------------------------------------------------------------------------
[ERROR] Failed to execute goal org.apache.maven.plugins:maven-surefire-plugin:2.17:test (default-test) on project hadoop-mapreduce-client-jobclient: There are test failures.
[ERROR]
[ERROR] Please refer to /home/jenkins/jenkins-slave/workspace/Hadoop-Mapreduce-trunk-Java8/hadoop-mapreduce-project/hadoop-mapreduce-client/hadoop-mapreduce-client-jobclient/target/surefire-reports for the individual test results.
[ERROR] -> [Help 1]
[ERROR]
[ERROR] To see the full stack trace of the errors, re-run Maven with the -e switch.
[ERROR] Re-run Maven using the -X switch to enable full debug logging.
[ERROR]
[ERROR] For more information about the errors and possible solutions, please read the following articles:
[ERROR] [Help 1] http://cwiki.apache.org/confluence/display/MAVEN/MojoFailureException
[ERROR]
[ERROR] After correcting the problems, you can resume the build with the command
[ERROR] mvn <goals> -rf :hadoop-mapreduce-client-jobclient
Build step 'Execute shell' marked build as failure
[FINDBUGS] Skipping publisher since build result is FAILURE
Archiving artifacts
Recording test results
Updating HDFS-9396
Email was triggered for: Failure - Any
Sending email for trigger: Failure - Any
###################################################################################
############################## FAILED TESTS (if any) ##############################
4 tests failed.
FAILED: org.apache.hadoop.mapreduce.v2.TestMROldApiJobs.org.apache.hadoop.mapreduce.v2.TestMROldApiJobs
Error Message:
org/apache/hadoop/service/ServiceOperations
Stack Trace:
java.lang.NoClassDefFoundError: org/apache/hadoop/service/ServiceOperations
at java.net.URLClassLoader$1.run(URLClassLoader.java:372)
at java.net.URLClassLoader$1.run(URLClassLoader.java:361)
at java.security.AccessController.doPrivileged(Native Method)
at java.net.URLClassLoader.findClass(URLClassLoader.java:360)
at java.lang.ClassLoader.loadClass(ClassLoader.java:424)
at sun.misc.Launcher$AppClassLoader.loadClass(Launcher.java:308)
at java.lang.ClassLoader.loadClass(ClassLoader.java:357)
at org.apache.hadoop.service.CompositeService.stop(CompositeService.java:157)
at org.apache.hadoop.service.CompositeService.serviceStop(CompositeService.java:131)
at org.apache.hadoop.service.AbstractService.stop(AbstractService.java:221)
at org.apache.hadoop.mapreduce.v2.TestMROldApiJobs.tearDown(TestMROldApiJobs.java:93)
FAILED: org.apache.hadoop.mapreduce.v2.TestUberAM.org.apache.hadoop.mapreduce.v2.TestUberAM
Error Message:
java.lang.NoClassDefFoundError: org/apache/hadoop/hdfs/protocol/proto/ClientNamenodeProtocolProtos$GetListingRequestProto$Builder
Stack Trace:
org.apache.hadoop.yarn.exceptions.YarnRuntimeException: java.lang.NoClassDefFoundError: org/apache/hadoop/hdfs/protocol/proto/ClientNamenodeProtocolProtos$GetListingRequestProto$Builder
at java.net.URLClassLoader$1.run(URLClassLoader.java:372)
at java.net.URLClassLoader$1.run(URLClassLoader.java:361)
at java.security.AccessController.doPrivileged(Native Method)
at java.net.URLClassLoader.findClass(URLClassLoader.java:360)
at java.lang.ClassLoader.loadClass(ClassLoader.java:424)
at sun.misc.Launcher$AppClassLoader.loadClass(Launcher.java:308)
at java.lang.ClassLoader.loadClass(ClassLoader.java:357)
at org.apache.hadoop.hdfs.protocol.proto.ClientNamenodeProtocolProtos$GetListingRequestProto.newBuilder(ClientNamenodeProtocolProtos.java:29103)
at org.apache.hadoop.hdfs.protocolPB.ClientNamenodeProtocolTranslatorPB.getListing(ClientNamenodeProtocolTranslatorPB.java:542)
at sun.reflect.NativeMethodAccessorImpl.invoke0(Native Method)
at sun.reflect.NativeMethodAccessorImpl.invoke(NativeMethodAccessorImpl.java:62)
at sun.reflect.DelegatingMethodAccessorImpl.invoke(DelegatingMethodAccessorImpl.java:43)
at java.lang.reflect.Method.invoke(Method.java:483)
at org.apache.hadoop.io.retry.RetryInvocationHandler.invokeMethod(RetryInvocationHandler.java:255)
at org.apache.hadoop.io.retry.RetryInvocationHandler.invoke(RetryInvocationHandler.java:103)
at com.sun.proxy.$Proxy23.getListing(Unknown Source)
at org.apache.hadoop.hdfs.DFSClient.listPaths(DFSClient.java:1575)
at org.apache.hadoop.fs.Hdfs$DirListingIterator.<init>(Hdfs.java:211)
at org.apache.hadoop.fs.Hdfs$DirListingIterator.<init>(Hdfs.java:198)
at org.apache.hadoop.fs.Hdfs$2.<init>(Hdfs.java:180)
at org.apache.hadoop.fs.Hdfs.listStatusIterator(Hdfs.java:180)
at org.apache.hadoop.fs.FileContext$22.next(FileContext.java:1492)
at org.apache.hadoop.fs.FileContext$22.next(FileContext.java:1487)
at org.apache.hadoop.fs.FSLinkResolver.resolve(FSLinkResolver.java:90)
at org.apache.hadoop.fs.FileContext.listStatus(FileContext.java:1494)
at org.apache.hadoop.mapreduce.v2.jobhistory.JobHistoryUtils.localGlobber(JobHistoryUtils.java:457)
at org.apache.hadoop.mapreduce.v2.jobhistory.JobHistoryUtils.localGlobber(JobHistoryUtils.java:444)
at org.apache.hadoop.mapreduce.v2.jobhistory.JobHistoryUtils.localGlobber(JobHistoryUtils.java:439)
at org.apache.hadoop.mapreduce.v2.hs.HistoryFileManager.findTimestampedDirectories(HistoryFileManager.java:778)
at org.apache.hadoop.mapreduce.v2.hs.HistoryFileManager.initExisting(HistoryFileManager.java:672)
at org.apache.hadoop.mapreduce.v2.hs.JobHistory.serviceInit(JobHistory.java:97)
at org.apache.hadoop.service.AbstractService.init(AbstractService.java:163)
at org.apache.hadoop.service.CompositeService.serviceInit(CompositeService.java:107)
at org.apache.hadoop.mapreduce.v2.hs.JobHistoryServer.serviceInit(JobHistoryServer.java:151)
at org.apache.hadoop.service.AbstractService.init(AbstractService.java:163)
at org.apache.hadoop.mapreduce.v2.MiniMRYarnCluster$JobHistoryServerWrapper.serviceStart(MiniMRYarnCluster.java:232)
at org.apache.hadoop.service.AbstractService.start(AbstractService.java:193)
at org.apache.hadoop.service.CompositeService.serviceStart(CompositeService.java:120)
at org.apache.hadoop.mapreduce.v2.MiniMRYarnCluster.serviceStart(MiniMRYarnCluster.java:191)
at org.apache.hadoop.service.AbstractService.start(AbstractService.java:193)
at org.apache.hadoop.mapreduce.v2.TestMRJobs.setup(TestMRJobs.java:163)
at org.apache.hadoop.mapreduce.v2.TestUberAM.setup(TestUberAM.java:45)
FAILED: org.apache.hadoop.mapred.TestMRTimelineEventHandling.testMRTimelineEventHandling
Error Message:
Job didn't finish in 30 seconds
Stack Trace:
java.io.IOException: Job didn't finish in 30 seconds
at org.apache.hadoop.mapred.UtilsForTests.runJobSucceed(UtilsForTests.java:622)
at org.apache.hadoop.mapred.TestMRTimelineEventHandling.testMRTimelineEventHandling(TestMRTimelineEventHandling.java:100)
FAILED: org.apache.hadoop.mapred.TestMRTimelineEventHandling.testMapreduceJobTimelineServiceEnabled
Error Message:
Job didn't finish in 30 seconds
Stack Trace:
java.io.IOException: Job didn't finish in 30 seconds
at org.apache.hadoop.mapred.UtilsForTests.runJobSucceed(UtilsForTests.java:622)
at org.apache.hadoop.mapred.TestMRTimelineEventHandling.testMapreduceJobTimelineServiceEnabled(TestMRTimelineEventHandling.java:162)