You are viewing a plain text version of this content. The canonical link for it is here.
Posted to dev@zookeeper.apache.org by Apache Jenkins Server <je...@builds.apache.org> on 2016/10/14 23:31:28 UTC

ZooKeeper-trunk - Build # 3119 - Failure

See https://builds.apache.org/job/ZooKeeper-trunk/3119/

###################################################################################
########################## LAST 60 LINES OF THE CONSOLE ###########################
[...truncated 440759 lines...]
    [junit] 	at org.jboss.netty.util.internal.DeadLockProofWorker$1.run(DeadLockProofWorker.java:42)
    [junit] 	at java.util.concurrent.ThreadPoolExecutor.runWorker(ThreadPoolExecutor.java:1145)
    [junit] 	at java.util.concurrent.ThreadPoolExecutor$Worker.run(ThreadPoolExecutor.java:615)
    [junit] 	at java.lang.Thread.run(Thread.java:745)
    [junit] 2016-10-14 23:30:52,091 [myid:] - INFO  [New I/O boss #66:ClientCnxnSocketNetty@208] - channel is told closing
    [junit] 2016-10-14 23:30:52,091 [myid:127.0.0.1:30073] - INFO  [main-SendThread(127.0.0.1:30073):ClientCnxn$SendThread@1231] - channel for sessionid 0x10055f190570000 is lost, closing socket connection and attempting reconnect
    [junit] 2016-10-14 23:30:52,325 [myid:127.0.0.1:30197] - INFO  [main-SendThread(127.0.0.1:30197):ClientCnxn$SendThread@1113] - Opening socket connection to server 127.0.0.1/127.0.0.1:30197. Will not attempt to authenticate using SASL (unknown error)
    [junit] 2016-10-14 23:30:52,326 [myid:] - INFO  [New I/O boss #9471:ClientCnxnSocketNetty$1@127] - future isn't success, cause: {}
    [junit] java.net.ConnectException: Connection refused: 127.0.0.1/127.0.0.1:30197
    [junit] 	at sun.nio.ch.SocketChannelImpl.checkConnect(Native Method)
    [junit] 	at sun.nio.ch.SocketChannelImpl.finishConnect(SocketChannelImpl.java:744)
    [junit] 	at org.jboss.netty.channel.socket.nio.NioClientBoss.connect(NioClientBoss.java:152)
    [junit] 	at org.jboss.netty.channel.socket.nio.NioClientBoss.processSelectedKeys(NioClientBoss.java:105)
    [junit] 	at org.jboss.netty.channel.socket.nio.NioClientBoss.process(NioClientBoss.java:79)
    [junit] 	at org.jboss.netty.channel.socket.nio.AbstractNioSelector.run(AbstractNioSelector.java:337)
    [junit] 	at org.jboss.netty.channel.socket.nio.NioClientBoss.run(NioClientBoss.java:42)
    [junit] 	at org.jboss.netty.util.ThreadRenamingRunnable.run(ThreadRenamingRunnable.java:108)
    [junit] 	at org.jboss.netty.util.internal.DeadLockProofWorker$1.run(DeadLockProofWorker.java:42)
    [junit] 	at java.util.concurrent.ThreadPoolExecutor.runWorker(ThreadPoolExecutor.java:1145)
    [junit] 	at java.util.concurrent.ThreadPoolExecutor$Worker.run(ThreadPoolExecutor.java:615)
    [junit] 	at java.lang.Thread.run(Thread.java:745)
    [junit] 2016-10-14 23:30:52,326 [myid:] - WARN  [New I/O boss #9471:ClientCnxnSocketNetty$ZKClientHandler@439] - Exception caught: [id: 0xeefd9acc] EXCEPTION: java.net.ConnectException: Connection refused: 127.0.0.1/127.0.0.1:30197
    [junit] java.net.ConnectException: Connection refused: 127.0.0.1/127.0.0.1:30197
    [junit] 	at sun.nio.ch.SocketChannelImpl.checkConnect(Native Method)
    [junit] 	at sun.nio.ch.SocketChannelImpl.finishConnect(SocketChannelImpl.java:744)
    [junit] 	at org.jboss.netty.channel.socket.nio.NioClientBoss.connect(NioClientBoss.java:152)
    [junit] 	at org.jboss.netty.channel.socket.nio.NioClientBoss.processSelectedKeys(NioClientBoss.java:105)
    [junit] 	at org.jboss.netty.channel.socket.nio.NioClientBoss.process(NioClientBoss.java:79)
    [junit] 	at org.jboss.netty.channel.socket.nio.AbstractNioSelector.run(AbstractNioSelector.java:337)
    [junit] 	at org.jboss.netty.channel.socket.nio.NioClientBoss.run(NioClientBoss.java:42)
    [junit] 	at org.jboss.netty.util.ThreadRenamingRunnable.run(ThreadRenamingRunnable.java:108)
    [junit] 	at org.jboss.netty.util.internal.DeadLockProofWorker$1.run(DeadLockProofWorker.java:42)
    [junit] 	at java.util.concurrent.ThreadPoolExecutor.runWorker(ThreadPoolExecutor.java:1145)
    [junit] 	at java.util.concurrent.ThreadPoolExecutor$Worker.run(ThreadPoolExecutor.java:615)
    [junit] 	at java.lang.Thread.run(Thread.java:745)
    [junit] 2016-10-14 23:30:52,326 [myid:] - INFO  [New I/O boss #9471:ClientCnxnSocketNetty@208] - channel is told closing
    [junit] 2016-10-14 23:30:52,326 [myid:127.0.0.1:30197] - INFO  [main-SendThread(127.0.0.1:30197):ClientCnxn$SendThread@1231] - channel for sessionid 0x20055f690b90000 is lost, closing socket connection and attempting reconnect

BUILD FAILED
/home/jenkins/jenkins-slave/workspace/ZooKeeper-trunk/build.xml:1322: The following error occurred while executing this line:
/home/jenkins/jenkins-slave/workspace/ZooKeeper-trunk/build.xml:1207: Tests failed!

Total time: 13 minutes 41 seconds
Build step 'Execute shell' marked build as failure
[FINDBUGS] Skipping publisher since build result is FAILURE
[WARNINGS] Skipping publisher since build result is FAILURE
Archiving artifacts
Setting JDK_1_7_LATEST__HOME=/home/jenkins/tools/java/latest1.7
Recording fingerprints
Setting JDK_1_7_LATEST__HOME=/home/jenkins/tools/java/latest1.7
Recording test results
Setting JDK_1_7_LATEST__HOME=/home/jenkins/tools/java/latest1.7
Publishing Javadoc
Setting JDK_1_7_LATEST__HOME=/home/jenkins/tools/java/latest1.7
Setting JDK_1_7_LATEST__HOME=/home/jenkins/tools/java/latest1.7
Email was triggered for: Failure - Any
Sending email for trigger: Failure - Any
Setting JDK_1_7_LATEST__HOME=/home/jenkins/tools/java/latest1.7
Setting JDK_1_7_LATEST__HOME=/home/jenkins/tools/java/latest1.7



###################################################################################
############################## FAILED TESTS (if any) ##############################
1 tests failed.
FAILED:  org.apache.zookeeper.test.LETest.testLE

Error Message:
Threads didn't join

Stack Trace:
junit.framework.AssertionFailedError: Threads didn't join
	at org.apache.zookeeper.test.LETest.testLE(LETest.java:123)
	at org.apache.zookeeper.JUnit4ZKTestRunner$LoggedInvokeMethod.evaluate(JUnit4ZKTestRunner.java:79)



ZooKeeper-trunk - Build # 3120 - Still Failing

Posted by Apache Jenkins Server <je...@builds.apache.org>.
See https://builds.apache.org/job/ZooKeeper-trunk/3120/

###################################################################################
########################## LAST 60 LINES OF THE CONSOLE ###########################
[...truncated 458801 lines...]
    [junit] 	at org.jboss.netty.util.ThreadRenamingRunnable.run(ThreadRenamingRunnable.java:108)
    [junit] 	at org.jboss.netty.util.internal.DeadLockProofWorker$1.run(DeadLockProofWorker.java:42)
    [junit] 	at java.util.concurrent.ThreadPoolExecutor.runWorker(ThreadPoolExecutor.java:1145)
    [junit] 	at java.util.concurrent.ThreadPoolExecutor$Worker.run(ThreadPoolExecutor.java:615)
    [junit] 	at java.lang.Thread.run(Thread.java:745)
    [junit] 2016-10-15 23:29:30,234 [myid:] - INFO  [SyncThread:0:MBeanRegistry@128] - Unregister MBean [org.apache.ZooKeeperService:name0=StandaloneServer_port14159,name1=Connections,name2=127.0.0.1,name3=0x1005b1f0e8c0000]
    [junit] 2016-10-15 23:29:30,334 [myid:] - INFO  [main:ZooKeeper@1315] - Session: 0x1005b1f0e8c0000 closed
    [junit] 2016-10-15 23:29:30,335 [myid:] - INFO  [main:JUnit4ZKTestRunner$LoggedInvokeMethod@82] - Memory used 145247
    [junit] 2016-10-15 23:29:30,335 [myid:] - INFO  [main:JUnit4ZKTestRunner$LoggedInvokeMethod@87] - Number of threads 1643
    [junit] 2016-10-15 23:29:30,335 [myid:] - INFO  [main:JUnit4ZKTestRunner$LoggedInvokeMethod@102] - FINISHED TEST METHOD testWatcherAutoResetWithLocal
    [junit] 2016-10-15 23:29:30,335 [myid:] - INFO  [main:ClientBase@543] - tearDown starting
    [junit] 2016-10-15 23:29:30,335 [myid:] - INFO  [main:ClientBase@513] - STOPPING server
    [junit] 2016-10-15 23:29:30,335 [myid:] - INFO  [main:NettyServerCnxnFactory@464] - shutdown called 0.0.0.0/0.0.0.0:14159
    [junit] 2016-10-15 23:29:30,334 [myid:] - INFO  [main-EventThread:ClientCnxn$EventThread@513] - EventThread shut down for session: 0x1005b1f0e8c0000
    [junit] 2016-10-15 23:29:30,342 [myid:] - INFO  [main:ZooKeeperServer@529] - shutting down
    [junit] 2016-10-15 23:29:30,342 [myid:] - ERROR [main:ZooKeeperServer@501] - ZKShutdownHandler is not registered, so ZooKeeper server won't take any action on ERROR or SHUTDOWN server state changes
    [junit] 2016-10-15 23:29:30,342 [myid:] - INFO  [main:SessionTrackerImpl@232] - Shutting down
    [junit] 2016-10-15 23:29:30,342 [myid:] - INFO  [main:PrepRequestProcessor@996] - Shutting down
    [junit] 2016-10-15 23:29:30,342 [myid:] - INFO  [main:SyncRequestProcessor@191] - Shutting down
    [junit] 2016-10-15 23:29:30,342 [myid:] - INFO  [ProcessThread(sid:0 cport:14159)::PrepRequestProcessor@156] - PrepRequestProcessor exited loop!
    [junit] 2016-10-15 23:29:30,342 [myid:] - INFO  [SyncThread:0:SyncRequestProcessor@169] - SyncRequestProcessor exited!
    [junit] 2016-10-15 23:29:30,343 [myid:] - INFO  [main:FinalRequestProcessor@481] - shutdown of request processor complete
    [junit] 2016-10-15 23:29:30,343 [myid:] - INFO  [main:MBeanRegistry@128] - Unregister MBean [org.apache.ZooKeeperService:name0=StandaloneServer_port14159,name1=InMemoryDataTree]
    [junit] 2016-10-15 23:29:30,343 [myid:] - INFO  [main:MBeanRegistry@128] - Unregister MBean [org.apache.ZooKeeperService:name0=StandaloneServer_port14159]
    [junit] 2016-10-15 23:29:30,344 [myid:] - INFO  [main:FourLetterWordMain@85] - connecting to 127.0.0.1 14159
    [junit] 2016-10-15 23:29:30,344 [myid:] - INFO  [main:JMXEnv@146] - ensureOnly:[]
    [junit] 2016-10-15 23:29:30,349 [myid:] - INFO  [main:ClientBase@568] - fdcount after test is: 4824 at start it was 4824
    [junit] 2016-10-15 23:29:30,350 [myid:] - INFO  [main:ZKTestCase$1@65] - SUCCEEDED testWatcherAutoResetWithLocal
    [junit] 2016-10-15 23:29:30,350 [myid:] - INFO  [main:ZKTestCase$1@60] - FINISHED testWatcherAutoResetWithLocal
    [junit] Tests run: 101, Failures: 0, Errors: 0, Skipped: 0, Time elapsed: 531.867 sec, Thread: 2, Class: org.apache.zookeeper.test.NioNettySuiteTest
    [junit] 2016-10-15 23:29:30,630 [myid:127.0.0.1:14036] - INFO  [main-SendThread(127.0.0.1:14036):ClientCnxn$SendThread@1113] - Opening socket connection to server 127.0.0.1/127.0.0.1:14036. Will not attempt to authenticate using SASL (unknown error)
    [junit] 2016-10-15 23:29:30,631 [myid:127.0.0.1:14036] - WARN  [main-SendThread(127.0.0.1:14036):ClientCnxn$SendThread@1235] - Session 0x1005b1be68c0000 for server 127.0.0.1/127.0.0.1:14036, unexpected error, closing socket connection and attempting reconnect
    [junit] java.net.ConnectException: Connection refused
    [junit] 	at sun.nio.ch.SocketChannelImpl.checkConnect(Native Method)
    [junit] 	at sun.nio.ch.SocketChannelImpl.finishConnect(SocketChannelImpl.java:744)
    [junit] 	at org.apache.zookeeper.ClientCnxnSocketNIO.doTransport(ClientCnxnSocketNIO.java:357)
    [junit] 	at org.apache.zookeeper.ClientCnxn$SendThread.run(ClientCnxn.java:1214)

BUILD FAILED
/home/jenkins/jenkins-slave/workspace/ZooKeeper-trunk/build.xml:1322: The following error occurred while executing this line:
/home/jenkins/jenkins-slave/workspace/ZooKeeper-trunk/build.xml:1207: Tests failed!

Total time: 12 minutes 53 seconds
Build step 'Execute shell' marked build as failure
[FINDBUGS] Skipping publisher since build result is FAILURE
[WARNINGS] Skipping publisher since build result is FAILURE
Archiving artifacts
Setting JDK_1_7_LATEST__HOME=/home/jenkins/tools/java/latest1.7
Recording fingerprints
Setting JDK_1_7_LATEST__HOME=/home/jenkins/tools/java/latest1.7
Recording test results
Setting JDK_1_7_LATEST__HOME=/home/jenkins/tools/java/latest1.7
Publishing Javadoc
Setting JDK_1_7_LATEST__HOME=/home/jenkins/tools/java/latest1.7
Setting JDK_1_7_LATEST__HOME=/home/jenkins/tools/java/latest1.7
Email was triggered for: Failure - Any
Sending email for trigger: Failure - Any
Setting JDK_1_7_LATEST__HOME=/home/jenkins/tools/java/latest1.7
Setting JDK_1_7_LATEST__HOME=/home/jenkins/tools/java/latest1.7



###################################################################################
############################## FAILED TESTS (if any) ##############################
1 tests failed.
FAILED:  org.apache.zookeeper.server.quorum.ReconfigDuringLeaderSyncTest.testDuringLeaderSync

Error Message:
zoo.cfg.dynamic.next is not deleted.

Stack Trace:
junit.framework.AssertionFailedError: zoo.cfg.dynamic.next is not deleted.
	at org.apache.zookeeper.server.quorum.ReconfigDuringLeaderSyncTest.testDuringLeaderSync(ReconfigDuringLeaderSyncTest.java:155)
	at org.apache.zookeeper.JUnit4ZKTestRunner$LoggedInvokeMethod.evaluate(JUnit4ZKTestRunner.java:79)