You are viewing a plain text version of this content. The canonical link for it is here.
Posted to dev@lucene.apache.org by Policeman Jenkins Server <je...@thetaphi.de> on 2014/03/26 23:44:04 UTC

[JENKINS] Lucene-Solr-trunk-Linux (32bit/jdk1.7.0_51) - Build # 9914 - Failure!

Build: http://jenkins.thetaphi.de/job/Lucene-Solr-trunk-Linux/9914/
Java: 32bit/jdk1.7.0_51 -client -XX:+UseParallelGC

1 tests failed.
REGRESSION:  org.apache.lucene.analysis.core.TestRandomChains.testRandomChains

Error Message:
startOffset must be non-negative, and endOffset must be >= startOffset, startOffset=8,endOffset=2

Stack Trace:
java.lang.IllegalArgumentException: startOffset must be non-negative, and endOffset must be >= startOffset, startOffset=8,endOffset=2
	at __randomizedtesting.SeedInfo.seed([403140C64E25C87C:7DD069A70937D5BC]:0)
	at org.apache.lucene.analysis.tokenattributes.OffsetAttributeImpl.setOffset(OffsetAttributeImpl.java:45)
	at org.apache.lucene.analysis.shingle.ShingleFilter.incrementToken(ShingleFilter.java:345)
	at org.apache.lucene.analysis.ValidatingTokenFilter.incrementToken(ValidatingTokenFilter.java:78)
	at org.apache.lucene.analysis.BaseTokenStreamTestCase.checkAnalysisConsistency(BaseTokenStreamTestCase.java:700)
	at org.apache.lucene.analysis.BaseTokenStreamTestCase.checkRandomData(BaseTokenStreamTestCase.java:611)
	at org.apache.lucene.analysis.BaseTokenStreamTestCase.checkRandomData(BaseTokenStreamTestCase.java:510)
	at org.apache.lucene.analysis.core.TestRandomChains.testRandomChains(TestRandomChains.java:901)
	at sun.reflect.NativeMethodAccessorImpl.invoke0(Native Method)
	at sun.reflect.NativeMethodAccessorImpl.invoke(NativeMethodAccessorImpl.java:57)
	at sun.reflect.DelegatingMethodAccessorImpl.invoke(DelegatingMethodAccessorImpl.java:43)
	at java.lang.reflect.Method.invoke(Method.java:606)
	at com.carrotsearch.randomizedtesting.RandomizedRunner.invoke(RandomizedRunner.java:1617)
	at com.carrotsearch.randomizedtesting.RandomizedRunner$6.evaluate(RandomizedRunner.java:826)
	at com.carrotsearch.randomizedtesting.RandomizedRunner$7.evaluate(RandomizedRunner.java:862)
	at com.carrotsearch.randomizedtesting.RandomizedRunner$8.evaluate(RandomizedRunner.java:876)
	at org.apache.lucene.util.TestRuleSetupTeardownChained$1.evaluate(TestRuleSetupTeardownChained.java:50)
	at org.apache.lucene.util.TestRuleFieldCacheSanity$1.evaluate(TestRuleFieldCacheSanity.java:51)
	at org.apache.lucene.util.AbstractBeforeAfterRule$1.evaluate(AbstractBeforeAfterRule.java:46)
	at com.carrotsearch.randomizedtesting.rules.SystemPropertiesInvariantRule$1.evaluate(SystemPropertiesInvariantRule.java:55)
	at org.apache.lucene.util.TestRuleThreadAndTestName$1.evaluate(TestRuleThreadAndTestName.java:49)
	at org.apache.lucene.util.TestRuleIgnoreAfterMaxFailures$1.evaluate(TestRuleIgnoreAfterMaxFailures.java:70)
	at org.apache.lucene.util.TestRuleMarkFailure$1.evaluate(TestRuleMarkFailure.java:48)
	at com.carrotsearch.randomizedtesting.rules.StatementAdapter.evaluate(StatementAdapter.java:36)
	at com.carrotsearch.randomizedtesting.ThreadLeakControl$StatementRunner.run(ThreadLeakControl.java:359)
	at com.carrotsearch.randomizedtesting.ThreadLeakControl.forkTimeoutingTask(ThreadLeakControl.java:783)
	at com.carrotsearch.randomizedtesting.ThreadLeakControl$3.evaluate(ThreadLeakControl.java:443)
	at com.carrotsearch.randomizedtesting.RandomizedRunner.runSingleTest(RandomizedRunner.java:835)
	at com.carrotsearch.randomizedtesting.RandomizedRunner$3.evaluate(RandomizedRunner.java:737)
	at com.carrotsearch.randomizedtesting.RandomizedRunner$4.evaluate(RandomizedRunner.java:771)
	at com.carrotsearch.randomizedtesting.RandomizedRunner$5.evaluate(RandomizedRunner.java:782)
	at org.apache.lucene.util.AbstractBeforeAfterRule$1.evaluate(AbstractBeforeAfterRule.java:46)
	at org.apache.lucene.util.TestRuleStoreClassName$1.evaluate(TestRuleStoreClassName.java:42)
	at com.carrotsearch.randomizedtesting.rules.SystemPropertiesInvariantRule$1.evaluate(SystemPropertiesInvariantRule.java:55)
	at com.carrotsearch.randomizedtesting.rules.NoShadowingOrOverridesOnMethodsRule$1.evaluate(NoShadowingOrOverridesOnMethodsRule.java:39)
	at com.carrotsearch.randomizedtesting.rules.NoShadowingOrOverridesOnMethodsRule$1.evaluate(NoShadowingOrOverridesOnMethodsRule.java:39)
	at com.carrotsearch.randomizedtesting.rules.StatementAdapter.evaluate(StatementAdapter.java:36)
	at org.apache.lucene.util.TestRuleAssertionsRequired$1.evaluate(TestRuleAssertionsRequired.java:43)
	at org.apache.lucene.util.TestRuleMarkFailure$1.evaluate(TestRuleMarkFailure.java:48)
	at org.apache.lucene.util.TestRuleIgnoreAfterMaxFailures$1.evaluate(TestRuleIgnoreAfterMaxFailures.java:70)
	at org.apache.lucene.util.TestRuleIgnoreTestSuites$1.evaluate(TestRuleIgnoreTestSuites.java:55)
	at com.carrotsearch.randomizedtesting.rules.StatementAdapter.evaluate(StatementAdapter.java:36)
	at com.carrotsearch.randomizedtesting.ThreadLeakControl$StatementRunner.run(ThreadLeakControl.java:359)
	at java.lang.Thread.run(Thread.java:744)




Build Log:
[...truncated 5423 lines...]
   [junit4] Suite: org.apache.lucene.analysis.core.TestRandomChains
   [junit4]   2> TEST FAIL: useCharFilter=false text='?g{0,5}|h[ zozz'
   [junit4]   2> Exception from random analyzer: 
   [junit4]   2> charfilters=
   [junit4]   2> tokenizer=
   [junit4]   2>   org.apache.lucene.analysis.MockTokenizer()
   [junit4]   2> filters=
   [junit4]   2>   org.apache.lucene.analysis.shingle.ShingleFilter(ValidatingTokenFilter@8bb9ec term=,bytes=[],startOffset=0,endOffset=0,positionIncrement=1,positionLength=1,type=word)
   [junit4]   2>   org.apache.lucene.analysis.id.IndonesianStemFilter(ValidatingTokenFilter@1466c2f term=,bytes=[],startOffset=0,endOffset=0,positionIncrement=1,positionLength=1,type=word,keyword=false)
   [junit4]   2>   org.apache.lucene.analysis.miscellaneous.WordDelimiterFilter(LUCENE_50, ValidatingTokenFilter@185fa02 term=,bytes=[],startOffset=0,endOffset=0,positionIncrement=1,positionLength=1,type=word,keyword=false, 4, [gsmj, egbs, uhvoh, yjsr, rtfikbgtio, fnirenb])
   [junit4]   2>   org.apache.lucene.analysis.shingle.ShingleFilter(ValidatingTokenFilter@36fdd9 term=,bytes=[],startOffset=0,endOffset=0,positionIncrement=1,positionLength=1,type=word,keyword=false, 9)
   [junit4]   2> offsetsAreCorrect=false
   [junit4]   2> NOTE: reproduce with: ant test  -Dtestcase=TestRandomChains -Dtests.method=testRandomChains -Dtests.seed=403140C64E25C87C -Dtests.multiplier=3 -Dtests.slow=true -Dtests.locale=en_AU -Dtests.timezone=Asia/Singapore -Dtests.file.encoding=US-ASCII
   [junit4] ERROR   8.29s J1 | TestRandomChains.testRandomChains <<<
   [junit4]    > Throwable #1: java.lang.IllegalArgumentException: startOffset must be non-negative, and endOffset must be >= startOffset, startOffset=8,endOffset=2
   [junit4]    > 	at __randomizedtesting.SeedInfo.seed([403140C64E25C87C:7DD069A70937D5BC]:0)
   [junit4]    > 	at org.apache.lucene.analysis.tokenattributes.OffsetAttributeImpl.setOffset(OffsetAttributeImpl.java:45)
   [junit4]    > 	at org.apache.lucene.analysis.shingle.ShingleFilter.incrementToken(ShingleFilter.java:345)
   [junit4]    > 	at org.apache.lucene.analysis.ValidatingTokenFilter.incrementToken(ValidatingTokenFilter.java:78)
   [junit4]    > 	at org.apache.lucene.analysis.BaseTokenStreamTestCase.checkAnalysisConsistency(BaseTokenStreamTestCase.java:700)
   [junit4]    > 	at org.apache.lucene.analysis.BaseTokenStreamTestCase.checkRandomData(BaseTokenStreamTestCase.java:611)
   [junit4]    > 	at org.apache.lucene.analysis.BaseTokenStreamTestCase.checkRandomData(BaseTokenStreamTestCase.java:510)
   [junit4]    > 	at org.apache.lucene.analysis.core.TestRandomChains.testRandomChains(TestRandomChains.java:901)
   [junit4]    > 	at java.lang.Thread.run(Thread.java:744)
   [junit4]   2> NOTE: test params are: codec=Lucene46: {dummy=PostingsFormat(name=NestedPulsing)}, docValues:{}, sim=DefaultSimilarity, locale=en_AU, timezone=Asia/Singapore
   [junit4]   2> NOTE: Linux 3.8.0-37-generic i386/Oracle Corporation 1.7.0_51 (32-bit)/cpus=8,threads=1,free=186689672,total=224133120
   [junit4]   2> NOTE: All tests run in this JVM: [TestHungarianLightStemFilter, TestScandinavianFoldingFilter, TestFrenchMinimalStemFilterFactory, TestScandinavianFoldingFilterFactory, TestSoraniStemFilter, DelimitedPayloadTokenFilterTest, DateRecognizerSinkTokenizerTest, CommonGramsFilterTest, TestRollingCharBuffer, TestArmenianAnalyzer, TestGreekStemmer, TestCJKBigramFilter, TestBulgarianStemFilterFactory, TestPortugueseAnalyzer, TestGalicianStemFilter, TestGermanStemFilterFactory, TestLatvianStemFilterFactory, TestCharArrayMap, TestFlagNum, TestGalicianStemFilterFactory, HTMLStripCharFilterTest, TestIrishLowerCaseFilter, TestFrenchAnalyzer, TestCJKWidthFilter, TestNorwegianMinimalStemFilter, TestSoraniStemFilterFactory, TestStemmerOverrideFilterFactory, TestPersianAnalyzer, TestHungarianLightStemFilterFactory, ShingleFilterTest, TestWordnetSynonymParser, TestStandardAnalyzer, TestStandardFactories, TestKeywordMarkerFilter, TestTurkishLowerCaseFilter, TestFinnishAnalyzer, TestPatternReplaceFilter, TestHindiAnalyzer, TestStemmer, TestEnglishMinimalStemFilterFactory, TestStopFilter, TestRussianAnalyzer, TestSpanishAnalyzer, TestKeepWordFilter, TestKeywordRepeatFilter, TestScandinavianNormalizationFilterFactory, TestOptionalCondition, TestBrazilianStemmer, TestTypeTokenFilter, TestClassicAnalyzer, TestRandomChains]
   [junit4] Completed on J1 in 28.24s, 2 tests, 1 error <<< FAILURES!

[...truncated 406 lines...]
BUILD FAILED
/mnt/ssd/jenkins/workspace/Lucene-Solr-trunk-Linux/build.xml:467: The following error occurred while executing this line:
/mnt/ssd/jenkins/workspace/Lucene-Solr-trunk-Linux/build.xml:447: The following error occurred while executing this line:
/mnt/ssd/jenkins/workspace/Lucene-Solr-trunk-Linux/build.xml:45: The following error occurred while executing this line:
/mnt/ssd/jenkins/workspace/Lucene-Solr-trunk-Linux/extra-targets.xml:37: The following error occurred while executing this line:
/mnt/ssd/jenkins/workspace/Lucene-Solr-trunk-Linux/lucene/build.xml:539: The following error occurred while executing this line:
/mnt/ssd/jenkins/workspace/Lucene-Solr-trunk-Linux/lucene/common-build.xml:1996: The following error occurred while executing this line:
/mnt/ssd/jenkins/workspace/Lucene-Solr-trunk-Linux/lucene/analysis/build.xml:106: The following error occurred while executing this line:
/mnt/ssd/jenkins/workspace/Lucene-Solr-trunk-Linux/lucene/analysis/build.xml:38: The following error occurred while executing this line:
/mnt/ssd/jenkins/workspace/Lucene-Solr-trunk-Linux/lucene/module-build.xml:60: The following error occurred while executing this line:
/mnt/ssd/jenkins/workspace/Lucene-Solr-trunk-Linux/lucene/common-build.xml:1275: The following error occurred while executing this line:
/mnt/ssd/jenkins/workspace/Lucene-Solr-trunk-Linux/lucene/common-build.xml:907: There were test failures: 249 suites, 1323 tests, 1 error, 1 ignored

Total time: 19 minutes 59 seconds
Build step 'Invoke Ant' marked build as failure
Description set: Java: 32bit/jdk1.7.0_51 -client -XX:+UseParallelGC
Archiving artifacts
Recording test results
Email was triggered for: Failure
Sending email for trigger: Failure