You are viewing a plain text version of this content. The canonical link for it is here.
Posted to dev@sling.apache.org by Apache Jenkins Server <je...@builds.apache.org> on 2015/04/10 17:46:35 UTC

Build failed in Jenkins: sling-trunk-1.8 #963

See <https://builds.apache.org/job/sling-trunk-1.8/963/changes>

Changes:

[rombert] SLING-4606 - Move validation from contrib to /

Add the sling parent pom to the validation reactor pom

[cziegeler] SLING-4602 : Migrate launchpad/testing-war to provisioning model

------------------------------------------
Started by an SCM change
Building remotely on H10 (Ubuntu ubuntu) in workspace <https://builds.apache.org/job/sling-trunk-1.8/ws/>
Updating http://svn.apache.org/repos/asf/sling/trunk at revision '2015-04-10T15:42:09.014 +0000'
U         bundles/extensions/validation/pom.xml
U         launchpad/testing-war/pom.xml
At revision 1672684
Parsing POMs
Modules changed, recalculating dependency graph
maven3-agent.jar already up to date
maven3-interceptor.jar already up to date
maven3-interceptor-commons.jar already up to date
[trunk] $ /home/jenkins/jenkins-slave/tools/hudson.model.JDK/jdk-1.8.0/bin/java -Xmx512M -XX:MaxPermSize=256M -enableassertions -cp /home/jenkins/jenkins-slave/maven3-agent.jar:/home/jenkins/jenkins-slave/tools/hudson.tasks.Maven_MavenInstallation/Maven_3.0.5/boot/plexus-classworlds-2.4.jar org.jvnet.hudson.maven3.agent.Maven3Main /home/jenkins/jenkins-slave/tools/hudson.tasks.Maven_MavenInstallation/Maven_3.0.5 /home/jenkins/jenkins-slave/slave.jar /home/jenkins/jenkins-slave/maven3-interceptor.jar /home/jenkins/jenkins-slave/maven3-interceptor-commons.jar 40148
Java HotSpot(TM) 64-Bit Server VM warning: ignoring option MaxPermSize=256M; support was removed in 8.0
<===[JENKINS REMOTING CAPACITY]===>   channel started
Executing Maven:  -B -f <https://builds.apache.org/job/sling-trunk-1.8/ws/trunk/pom.xml> -Dmaven.repo.local=/home/jenkins/jenkins-slave/maven-repositories/0 -DobrRepository=false clean install -DHttpTestBase.readyTimeoutSeconds=300
[INFO] Scanning for projects...
[WARNING] 
[WARNING] Some problems were encountered while building the effective model for org.apache.sling:org.apache.sling.discovery.impl:bundle:1.1.1-SNAPSHOT
[WARNING] 'dependencies.dependency.(groupId:artifactId:type:classifier)' must be unique: org.apache.sling:org.apache.sling.testing.tools:jar -> duplicate declaration of version 1.0.2 @ line 259, column 21
[WARNING] 
[WARNING] It is highly recommended to fix these problems because they threaten the stability of your build.
[WARNING] 
[WARNING] For this reason, future Maven versions might no longer support building such malformed projects.
[WARNING] 
[INFO] Searching for slingstart projects...
[ERROR] Unable to determine plugin-based dependencies: No launchpad feature found. -> [Help 1]
[ERROR] 
[ERROR] To see the full stack trace of the errors, re-run Maven with the -e switch.
[ERROR] Re-run Maven using the -X switch to enable full debug logging.
[ERROR] 
[ERROR] For more information about the errors and possible solutions, please read the following articles:
[ERROR] [Help 1] http://cwiki.apache.org/confluence/display/MAVEN/MavenExecutionException
channel stopped

Jenkins build is back to stable : sling-trunk-1.8 #966

Posted by Apache Jenkins Server <je...@builds.apache.org>.
See <https://builds.apache.org/job/sling-trunk-1.8/966/changes>


Jenkins build is still unstable: sling-trunk-1.8 #965

Posted by Apache Jenkins Server <je...@builds.apache.org>.
See <https://builds.apache.org/job/sling-trunk-1.8/changes>


Jenkins build is unstable: sling-trunk-1.8 #964

Posted by Apache Jenkins Server <je...@builds.apache.org>.
See <https://builds.apache.org/job/sling-trunk-1.8/964/changes>