You are viewing a plain text version of this content. The canonical link for it is here.
Posted to builds@beam.apache.org by Apache Jenkins Server <je...@builds.apache.org> on 2022/08/13 08:58:23 UTC
Build failed in Jenkins: beam_PostCommit_XVR_Spark3 #2005
See <https://ci-beam.apache.org/job/beam_PostCommit_XVR_Spark3/2005/display/redirect>
Changes:
------------------------------------------
[...truncated 1.02 MB...]
coders: <
key: "RBXpZekMOPTimestampedValueCoder"
value: <
spec: <
urn: "beam:coders:javasdk:0.1"
payload: "\202SNAPPY\000\000\000\000\001\000\000\000\001\000\000\001?\315\003\270\254\355\000\005sr\000Aorg.apache.beam.sdk.values.TimestampedV\001\022\000$>\021\000LCoder\364\376\202p\274iX-\002\000\001L\000\nv\001)\005\030\034t\000\"Lorg/\t]\000/\001],/sdk/coders/\005$\020;xr\000*N\202\000\t%(.Structured\005/8s\277\022\016\325\3246\021\002\000\000xr\000 j9\000\005/\034C\335\325\211\256\274~\370\001/\020psr\000,j1\000(Serializabl\t\277\034\010\364 \216\305ynl\005\327\\\004typet\000\021Ljava/lang/Class\001\300\000&jV\000\024Custom\005\215Pj\260\010\235\013;\035\013\002\000\000xq\000~\000\003vr\000;N;\000Pio.BoundedReadFromUnb\t\021`Source$Shardd\236\240U\205\000j\363\002\000\000xp"
>
>
>
coders: <
key: "RBXpZekMOPValueWithRecordIdCoder"
value: <
spec: <
urn: "beam:coders:javasdk:0.1"
payload: "\202SNAPPY\000\000\000\000\001\000\000\000\001\000\000\001\213\311\005\320\254\355\000\005sr\000Corg.apache.beam.sdk.values.ValueWithRecordId$B\022\000LCoder{\343\376bQ\014\204>\002\000\002L\000\007i\t\025\034t\000+Lorg/\t\\\000/\001\\\024/sdk/c\0012(s/ByteArray\005B\014;L\000\n\005u\005\016\010t\000\"n;\000\005$\020;xr\000*N\274\000\t`(.Structured\005/8s\277\022\016\325\3246\021\002\000\000xr\000 j9\000\005/\034C\335\325\211\256\274~\370\001/\020psr\000)j1\0006\312\000\034\351\277\005|\263\3746\333\001:\010r\000&j8\000\024Atomic\005o\034\307\354\265\314\205tPF\0015 q\000~\000\003sr\000-N;\000$io.kafka.K\001\006\000R%\227\005B<I\320\251Y\032\341{#\002\000\001L\000\007kv\005\025\010t\000$nH\001\000K\t&\000;\025s\000\"Ns\000-P\r- j\000\275\271\035\243\3126\002!\353\010\010ke)\277\001\264\000\0022\303\001\005\022\025Y\000(jY\000\030Nullabl)\372\034E\333\0336>\220\247\007\005\307]\022.O\000\001\014,\006sq\000~\000\016q\000~\000\020"
>
>
>
coders: <
key: "RBXpZekMOPVarIntCoder"
value: <
spec: <
urn: "beam:coders:javasdk:0.1"
payload: "\202SNAPPY\000\000\000\000\001\000\000\000\001\000\000\000\210\330\001\350\254\355\000\005sr\000&org.apache.beam.sdk.coders.VarIntCoder\300K2\332\251KVh\002\000\000xrr5\000\024Atomic\0055 \307\354\265\314\205tPF\002\0055\000*jj\000$Structured\0059\034s\277\022\016\325\3246\021\t9\000 j9\000\005/0C\335\325\211\256\274~\370\002\000\000xp"
>
>
>
coders: <
key: "RBXpZekMOPVoidCoder"
value: <
spec: <
urn: "beam:coders:javasdk:0.1"
payload: "\202SNAPPY\000\000\000\000\001\000\000\000\001\000\000\000\210\326\001\350\254\355\000\005sr\000$org.apache.beam.sdk.coders.VoidCoder\271\277U\233\350\r\257U\002\000\000xr\000&j3\000\024Atomic\0055 \307\354\265\314\205tPF\002\0055\000*j5\000$Structured\0059\034s\277\022\016\325\3246\021\t9\000 j9\000\005/0C\335\325\211\256\274~\370\002\000\000xp"
>
>
>
coders: <
key: "c0"
value: <
spec: <
urn: "beam:coder:bytes:v1"
>
>
>
coders: <
key: "c1"
value: <
spec: <
urn: "beam:coder:global_window:v1"
>
>
>
coders: <
key: "c2"
value: <
spec: <
urn: "beam:go:coder:custom:v1"
payload: "Cgd2YXJpbnR6EgIIAhpdCklnaXRodWIuY29tL2FwYWNoZS9iZWFtL3Nka3MvdjIvZ28vcGtnL2JlYW0vY29yZS9ydW50aW1lL2NvZGVyeC5lbmNWYXJJbnRaEhAIFiIECBlADyoGCBQSAggIImkKSWdpdGh1Yi5jb20vYXBhY2hlL2JlYW0vc2Rrcy92Mi9nby9wa2cvYmVhbS9jb3JlL3J1bnRpbWUvY29kZXJ4LmRlY1ZhckludFoSHAgWIgQIGUADIgYIFBICCAgqBAgZQA8qBAgZQAE="
>
>
>
coders: <
key: "c3"
value: <
spec: <
urn: "beam:coder:length_prefix:v1"
>
component_coder_ids: "c2"
>
>
coders: <
key: "c4"
value: <
spec: <
urn: "beam:coder:kv:v1"
>
component_coder_ids: "c0"
component_coder_ids: "c0"
>
>
environments: <
key: "RBXpZekMOPbeam:env:docker:v1"
value: <
urn: "beam:env:docker:v1"
payload: "\n apache/beam_java8_sdk:2.42.0.dev"
capabilities: "beam:coder:bytes:v1"
capabilities: "beam:coder:bool:v1"
capabilities: "beam:coder:varint:v1"
capabilities: "beam:coder:string_utf8:v1"
capabilities: "beam:coder:iterable:v1"
capabilities: "beam:coder:timer:v1"
capabilities: "beam:coder:kv:v1"
capabilities: "beam:coder:length_prefix:v1"
capabilities: "beam:coder:global_window:v1"
capabilities: "beam:coder:interval_window:v1"
capabilities: "beam:coder:custom_window:v1"
capabilities: "beam:coder:windowed_value:v1"
capabilities: "beam:coder:double:v1"
capabilities: "beam:coder:row:v1"
capabilities: "beam:coder:param_windowed_value:v1"
capabilities: "beam:coder:state_backed_iterable:v1"
capabilities: "beam:coder:sharded_key:v1"
capabilities: "beam:coder:nullable:v1"
capabilities: "beam:protocol:multi_core_bundle_processing:v1"
capabilities: "beam:protocol:progress_reporting:v1"
capabilities: "beam:protocol:harness_monitoring_infos:v1"
capabilities: "beam:protocol:control_request_elements_embedding:v1"
capabilities: "beam:protocol:state_caching:v1"
capabilities: "beam:version:sdk_base:apache/beam_java8_sdk:2.42.0.dev"
capabilities: "beam:transform:sdf_truncate_sized_restrictions:v1"
capabilities: "beam:transform:to_string:v1"
dependencies: <
type_urn: "beam:artifact:type:file:v1"
type_payload: "\nL/tmp/artifacts/icedtea-sound-CGRxIE9edPHnbxQhM-L5mp8h21H-ySB79uQtSquPV_Q.jar\022@086471204f5e74f1e76f142133e2f99a9f21db51fec9207bf6e42d4aab8f57f4"
role_urn: "beam:artifact:role:staging_to:v1"
role_payload: "\n=icedtea-sound-CGRxIE9edPHnbxQhM-L5mp8h21H-ySB79uQtSquPV_Q.jar"
>
dependencies: <
type_urn: "beam:artifact:type:file:v1"
type_payload: "\nF/tmp/artifacts/jaccess-FBI0Bb27lF3oEBieWAi7SP8X1zBR8k4BJQOVpsoK9a0.jar\022@14123405bdbb945de810189e5808bb48ff17d73051f24e01250395a6ca0af5ad"
role_urn: "beam:artifact:role:staging_to:v1"
role_payload: "\n7jaccess-FBI0Bb27lF3oEBieWAi7SP8X1zBR8k4BJQOVpsoK9a0.jar"
>
dependencies: <
type_urn: "beam:artifact:type:file:v1"
type_payload: "\nI/tmp/artifacts/localedata-kJ2mc8rBH5-IklhfR1XzNotlIQ_mnVMA-pgaXv2r8Ag.jar\022@909da673cac11f9f8892585f4755f3368b65210fe69d5300fa981a5efdabf008"
role_urn: "beam:artifact:role:staging_to:v1"
role_payload: "\n:localedata-kJ2mc8rBH5-IklhfR1XzNotlIQ_mnVMA-pgaXv2r8Ag.jar"
>
dependencies: <
type_urn: "beam:artifact:type:file:v1"
type_payload: "\nF/tmp/artifacts/nashorn-B0CAb3QpJET_6VsT3hcC_89VtvhV616H8N2bHAIaqWo.jar\022@0740806f74292444ffe95b13de1702ffcf55b6f855eb5e87f0dd9b1c021aa96a"
role_urn: "beam:artifact:role:staging_to:v1"
role_payload: "\n7nashorn-B0CAb3QpJET_6VsT3hcC_89VtvhV616H8N2bHAIaqWo.jar"
>
dependencies: <
type_urn: "beam:artifact:type:file:v1"
type_payload: "\nG/tmp/artifacts/cldrdata-gclqV9lOGqQOKesG-a6TAUTGEYlyIDqpyd4M_k7gtWo.jar\022@81c96a57d94e1aa40e29eb06f9ae930144c6118972203aa9c9de0cfe4ee0b56a"
role_urn: "beam:artifact:role:staging_to:v1"
role_payload: "\n8cldrdata-gclqV9lOGqQOKesG-a6TAUTGEYlyIDqpyd4M_k7gtWo.jar"
>
dependencies: <
type_urn: "beam:artifact:type:file:v1"
type_payload: "\nD/tmp/artifacts/dnsns-byzoQxdXengTvA5IlbH9gSIzfhNQElRYltuMJN0vjcc.jar\022@6f2ce84317577a7813bc0e4895b1fd8122337e135012545896db8c24dd2f8dc7"
role_urn: "beam:artifact:role:staging_to:v1"
role_payload: "\n5dnsns-byzoQxdXengTvA5IlbH9gSIzfhNQElRYltuMJN0vjcc.jar"
>
dependencies: <
type_urn: "beam:artifact:type:file:v1"
type_payload: "\nr/tmp/artifacts/beam-sdks-java-io-expansion-service-2.42.0-SNAPSHOT-Nc2I3ZhyT7-oyDTgQHRgxjZOKatpiGcPr_Q6tpt-fkg.jar\022@35cd88dd98724fbfa8c834e0407460c6364e29ab6988670faff43ab69b7e7e48"
role_urn: "beam:artifact:role:staging_to:v1"
role_payload: "\ncbeam-sdks-java-io-expansion-service-2.42.0-SNAPSHOT-Nc2I3ZhyT7-oyDTgQHRgxjZOKatpiGcPr_Q6tpt-fkg.jar"
>
>
>
environments: <
key: "go"
value: <
urn: "beam:env:docker:v1"
payload: "\n\026apache/beam_go_sdk:dev"
capabilities: "beam:protocol:progress_reporting:v1"
capabilities: "beam:protocol:multi_core_bundle_processing:v1"
capabilities: "beam:transform:sdf_truncate_sized_restrictions:v1"
capabilities: "beam:protocol:worker_status:v1"
capabilities: "beam:protocol:monitoring_info_short_ids:v1"
capabilities: "beam:version:sdk_base:go"
capabilities: "beam:coder:bytes:v1"
capabilities: "beam:coder:bool:v1"
capabilities: "beam:coder:varint:v1"
capabilities: "beam:coder:double:v1"
capabilities: "beam:coder:string_utf8:v1"
capabilities: "beam:coder:length_prefix:v1"
capabilities: "beam:coder:kv:v1"
capabilities: "beam:coder:iterable:v1"
capabilities: "beam:coder:state_backed_iterable:v1"
capabilities: "beam:coder:windowed_value:v1"
capabilities: "beam:coder:global_window:v1"
capabilities: "beam:coder:interval_window:v1"
capabilities: "beam:coder:row:v1"
capabilities: "beam:coder:nullable:v1"
dependencies: <
type_urn: "beam:artifact:type:file:v1"
role_urn: "beam:artifact:role:go_worker_binary:v1"
>
>
>
>
root_transform_ids: "s1"
root_transform_ids: "e4"
root_transform_ids: "e5"
root_transform_ids: "s3"
requirements: "beam:requirement:pardo:splittable_dofn:v1"
2022/08/13 08:37:04 Cross-compiling <https://ci-beam.apache.org/job/beam_PostCommit_XVR_Spark3/ws/src/sdks/go/test/integration/io/xlang/kafka/kafka_test.go> as /tmp/worker-2-1660379824745202751
2022/08/13 08:37:06 Prepared job with id: go-testkafkaio_basicreadwrite-255_d37ae5aa-ad48-421d-988e-9a5091b9a99a and staging token: go-testkafkaio_basicreadwrite-255_d37ae5aa-ad48-421d-988e-9a5091b9a99a
2022/08/13 08:37:06 Staged binary artifact with token:
2022/08/13 08:37:06 Submitted job: go0testkafkaio0basicreadwrite0255-jenkins-0813083706-358e9941_a55f4e35-ad75-42d7-862e-80015a1e970b
2022/08/13 08:37:06 Job state: STOPPED
2022/08/13 08:37:06 Job state: STARTING
2022/08/13 08:37:06 Job state: RUNNING
2022/08/13 08:37:29 Job state: DONE
2022/08/13 08:37:29 Warning: 6 errors during metrics processing: [failed to deduce Step from MonitoringInfo: urn:"beam:metric:element_count:v1" type:"beam:metrics:sum_int64:v1" payload:"\x01" labels:{key:"PCOLLECTION" value:"RBXpZekMOPExternal/KafkaIO.Read/KafkaIO.Read.ReadFromKafkaViaUnbounded/Read(KafkaUnboundedSource)/Create/Read(CreateSource)/ParDo(OutputSingleSource)/ParMultiDo(OutputSingleSource).output/SplitAndSize0"} failed to deduce Step from MonitoringInfo: urn:"beam:metric:sampled_byte_size:v1" type:"beam:metrics:distribution_int64:v1" payload:"\x01\xfd\"\xfd\"\xfd\"" labels:{key:"PCOLLECTION" value:"RBXpZekMOPExternal/KafkaIO.Read/KafkaIO.Read.ReadFromKafkaViaUnbounded/Read(KafkaUnboundedSource)/Create/Read(CreateSource)/ParDo(OutputSingleSource)/ParMultiDo(OutputSingleSource).output/SplitAndSize0"} failed to deduce Step from MonitoringInfo: urn:"beam:metric:element_count:v1" type:"beam:metrics:sum_int64:v1" payload:"\x01" labels:{key:"PCOLLECTION" value:"RBXpZekMOPExternal/KafkaIO.Read/KafkaIO.Read.ReadFromKafkaViaUnbounded/Read(KafkaUnboundedSource)/Create/Read(CreateSource)/ParDo(OutputSingleSource)/ParMultiDo(OutputSingleSource).output/SplitAndSize0"} failed to deduce Step from MonitoringInfo: urn:"beam:metric:element_count:v1" type:"beam:metrics:sum_int64:v1" payload:"\x01" labels:{key:"PCOLLECTION" value:"RBXpZekMOPExternal/KafkaIO.Read/KafkaIO.Read.ReadFromKafkaViaUnbounded/Read(KafkaUnboundedSource)/Create/Read(CreateSource)/ParDo(OutputSingleSource)/ParMultiDo(OutputSingleSource).output/PairWithRestriction0"} failed to deduce Step from MonitoringInfo: urn:"beam:metric:sampled_byte_size:v1" type:"beam:metrics:distribution_int64:v1" payload:"\x01\xf8\"\xf8\"\xf8\"" labels:{key:"PCOLLECTION" value:"RBXpZekMOPExternal/KafkaIO.Read/KafkaIO.Read.ReadFromKafkaViaUnbounded/Read(KafkaUnboundedSource)/Create/Read(CreateSource)/ParDo(OutputSingleSource)/ParMultiDo(OutputSingleSource).output/SplitAndSize0"} failed to deduce Step from MonitoringInfo: urn:"beam:metric:sampled_byte_size:v1" type:"beam:metrics:distribution_int64:v1" payload:"\x01\xf0\"\xf0\"\xf0\"" labels:{key:"PCOLLECTION" value:"RBXpZekMOPExternal/KafkaIO.Read/KafkaIO.Read.ReadFromKafkaViaUnbounded/Read(KafkaUnboundedSource)/Create/Read(CreateSource)/ParDo(OutputSingleSource)/ParMultiDo(OutputSingleSource).output/PairWithRestriction0"}]
--- PASS: TestKafkaIO_BasicReadWrite (37.61s)
PASS
ok github.com/apache/beam/sdks/v2/go/test/integration/io/xlang/kafka 43.638s
> Task :runners:spark:3:job-server:validatesCrossLanguageRunnerJavaUsingPython
org.apache.beam.runners.core.construction.ValidateRunnerXlangTest$SingleInputOutputTest > test FAILED
java.lang.RuntimeException at ValidateRunnerXlangTest.java:242
java.lang.NullPointerException at Preconditions.java:980
14 tests completed, 1 failed
> Task :runners:spark:3:job-server:validatesCrossLanguageRunnerJavaUsingPython FAILED
> Task :runners:spark:3:job-server:validatesCrossLanguageRunnerPythonUsingJava
> Task :runners:spark:3:job-server:validatesCrossLanguageRunnerPythonUsingSql
> Task :runners:spark:3:job-server:validatesCrossLanguageRunnerCleanup
> Task :runners:spark:3:job-server:sparkJobServerCleanup
FAILURE: Build failed with an exception.
* What went wrong:
Execution failed for task ':runners:spark:3:job-server:validatesCrossLanguageRunnerJavaUsingPython'.
> There were failing tests. See the report at: file://<https://ci-beam.apache.org/job/beam_PostCommit_XVR_Spark3/ws/src/runners/spark/3/job-server/build/reports/tests/validatesCrossLanguageRunnerJavaUsingPython/index.html>
* Try:
> Run with --stacktrace option to get the stack trace.
> Run with --info or --debug option to get more log output.
> Run with --scan to get full insights.
* Get more help at https://help.gradle.org
Deprecated Gradle features were used in this build, making it incompatible with Gradle 8.0.
You can use '--warning-mode all' to show the individual deprecation warnings and determine if they come from your own scripts or plugins.
See https://docs.gradle.org/7.4/userguide/command_line_interface.html#sec:command_line_warnings
Execution optimizations have been disabled for 1 invalid unit(s) of work during this build to ensure correctness.
Please consult deprecation warnings for more details.
BUILD FAILED in 32m 57s
263 actionable tasks: 173 executed, 78 from cache, 12 up-to-date
Publishing build scan...
https://gradle.com/s/efm3pmysbd462
Build step 'Invoke Gradle script' changed build result to FAILURE
Build step 'Invoke Gradle script' marked build as failure
---------------------------------------------------------------------
To unsubscribe, e-mail: builds-unsubscribe@beam.apache.org
For additional commands, e-mail: builds-help@beam.apache.org
Jenkins build is back to normal : beam_PostCommit_XVR_Spark3 #2020
Posted by Apache Jenkins Server <je...@builds.apache.org>.
See <https://ci-beam.apache.org/job/beam_PostCommit_XVR_Spark3/2020/display/redirect?page=changes>
---------------------------------------------------------------------
To unsubscribe, e-mail: builds-unsubscribe@beam.apache.org
For additional commands, e-mail: builds-help@beam.apache.org
Build failed in Jenkins: beam_PostCommit_XVR_Spark3 #2019
Posted by Apache Jenkins Server <je...@builds.apache.org>.
See <https://ci-beam.apache.org/job/beam_PostCommit_XVR_Spark3/2019/display/redirect?page=changes>
Changes:
[noreply] [BEAM-13015, #21250] Remove looking up thread local metrics container
[noreply] [fixes #22731] Publish nightly snapshot of legacy Dataflow worker jar.
------------------------------------------
[...truncated 623.20 KB...]
spec: <
urn: "beam:coder:kv:v1"
>
component_coder_ids: "jrHOcOhZljVarIntCoder"
component_coder_ids: "jrHOcOhZljTimestampedValueCoder"
>
>
coders: <
key: "jrHOcOhZljKvCoder4"
value: <
spec: <
urn: "beam:coder:kv:v1"
>
component_coder_ids: "jrHOcOhZljVarIntCoder"
component_coder_ids: "jrHOcOhZljIterableCoder"
>
>
coders: <
key: "jrHOcOhZljNullableCoder"
value: <
spec: <
urn: "beam:coder:nullable:v1"
>
component_coder_ids: "jrHOcOhZljByteArrayCoder"
>
>
coders: <
key: "jrHOcOhZljSerializableCoder"
value: <
spec: <
urn: "beam:coders:javasdk:0.1"
payload: "\202SNAPPY\000\000\000\000\001\000\000\000\001\000\000\000\312\214\002\360^\254\355\000\005sr\000,org.apache.beam.sdk.coders.SerializableCoder\010\364 \216\305ynl\002\000\001L\000\004typet\000\021Ljava/lang/Class;xr\000&ofV\000\024Custom\005P8j\260\010\235\013;\035\013\002\000\000xr\000 j\213\000\005/\034C\335\325\211\256\274~\370\001/\020pvr\000;N1\000Pio.BoundedReadFromUnb\t\021`Source$Shardd\236\240U\205\000j\363\002\000\000xp"
>
>
>
coders: <
key: "jrHOcOhZljSnappyCoder"
value: <
spec: <
urn: "beam:coders:javasdk:0.1"
payload: "\202SNAPPY\000\000\000\000\001\000\000\000\001\000\000\001.\307\003\360@\254\355\000\005sr\000&org.apache.beam.sdk.coders.SnappyCoder1\033\243\356\177\362\366,\002\000\001L\000\ninner\005\030 t\000\"Lorg/a\005B\000/\001B\020/sdk/\tB\000/\005$\020;xr\000*ng\000 tructured\005/8s\277\022\016\325\3246\021\002\000\000xr\000 j9\000\005/\034C\335\325\211\256\274~\370\001/\020psr\000,j1\000,Serializable\005= \010\364 \216\305ynl\002\001\327\\\004typet\000\021Ljava/lang/Class\001\300n'\001\024Custom\005PPj\260\010\235\013;\035\013\002\000\000xq\000~\000\003vr\000$N\221\000\\io.BoundedSource!`v\023\177\370QA\0019\010r\000\035Z3\000\t,0\020\213\372\020Y\214\347\323\002\000\000xp"
>
>
>
coders: <
key: "jrHOcOhZljTimestampedValueCoder"
value: <
spec: <
urn: "beam:coders:javasdk:0.1"
payload: "\202SNAPPY\000\000\000\000\001\000\000\000\001\000\000\001?\315\003\270\254\355\000\005sr\000Aorg.apache.beam.sdk.values.TimestampedV\001\022\000$>\021\000LCoder\364\376\202p\274iX-\002\000\001L\000\nv\001)\005\030\034t\000\"Lorg/\t]\000/\001],/sdk/coders/\005$\020;xr\000*N\202\000\t%(.Structured\005/8s\277\022\016\325\3246\021\002\000\000xr\000 j9\000\005/\034C\335\325\211\256\274~\370\001/\020psr\000,j1\000(Serializabl\t\277\034\010\364 \216\305ynl\005\327\\\004typet\000\021Ljava/lang/Class\001\300\000&jV\000\024Custom\005\215Pj\260\010\235\013;\035\013\002\000\000xq\000~\000\003vr\000;N;\000Pio.BoundedReadFromUnb\t\021`Source$Shardd\236\240U\205\000j\363\002\000\000xp"
>
>
>
coders: <
key: "jrHOcOhZljValueWithRecordIdCoder"
value: <
spec: <
urn: "beam:coders:javasdk:0.1"
payload: "\202SNAPPY\000\000\000\000\001\000\000\000\001\000\000\001\213\311\005\320\254\355\000\005sr\000Corg.apache.beam.sdk.values.ValueWithRecordId$B\022\000LCoder{\343\376bQ\014\204>\002\000\002L\000\007i\t\025\034t\000+Lorg/\t\\\000/\001\\\024/sdk/c\0012(s/ByteArray\005B\014;L\000\n\005u\005\016\010t\000\"n;\000\005$\020;xr\000*N\274\000\t`(.Structured\005/8s\277\022\016\325\3246\021\002\000\000xr\000 j9\000\005/\034C\335\325\211\256\274~\370\001/\020psr\000)j1\0006\312\000\034\351\277\005|\263\3746\333\001:\010r\000&j8\000\024Atomic\005o\034\307\354\265\314\205tPF\0015 q\000~\000\003sr\000-N;\000$io.kafka.K\001\006\000R%\227\005B<I\320\251Y\032\341{#\002\000\001L\000\007kv\005\025\010t\000$nH\001\000K\t&\000;\025s\000\"Ns\000-P\r- j\000\275\271\035\243\3126\002!\353\010\010ke)\277\001\264\000\0022\303\001\005\022\025Y\000(jY\000\030Nullabl)\372\034E\333\0336>\220\247\007\005\307]\022.O\000\001\014,\006sq\000~\000\016q\000~\000\020"
>
>
>
coders: <
key: "jrHOcOhZljVarIntCoder"
value: <
spec: <
urn: "beam:coders:javasdk:0.1"
payload: "\202SNAPPY\000\000\000\000\001\000\000\000\001\000\000\000\210\330\001\350\254\355\000\005sr\000&org.apache.beam.sdk.coders.VarIntCoder\300K2\332\251KVh\002\000\000xrr5\000\024Atomic\0055 \307\354\265\314\205tPF\002\0055\000*jj\000$Structured\0059\034s\277\022\016\325\3246\021\t9\000 j9\000\005/0C\335\325\211\256\274~\370\002\000\000xp"
>
>
>
coders: <
key: "jrHOcOhZljVoidCoder"
value: <
spec: <
urn: "beam:coders:javasdk:0.1"
payload: "\202SNAPPY\000\000\000\000\001\000\000\000\001\000\000\000\210\326\001\350\254\355\000\005sr\000$org.apache.beam.sdk.coders.VoidCoder\271\277U\233\350\r\257U\002\000\000xr\000&j3\000\024Atomic\0055 \307\354\265\314\205tPF\002\0055\000*j5\000$Structured\0059\034s\277\022\016\325\3246\021\t9\000 j9\000\005/0C\335\325\211\256\274~\370\002\000\000xp"
>
>
>
environments: <
key: "go"
value: <
urn: "beam:env:docker:v1"
payload: "\n\026apache/beam_go_sdk:dev"
capabilities: "beam:protocol:progress_reporting:v1"
capabilities: "beam:protocol:multi_core_bundle_processing:v1"
capabilities: "beam:transform:sdf_truncate_sized_restrictions:v1"
capabilities: "beam:protocol:worker_status:v1"
capabilities: "beam:protocol:monitoring_info_short_ids:v1"
capabilities: "beam:version:sdk_base:go"
capabilities: "beam:coder:bytes:v1"
capabilities: "beam:coder:bool:v1"
capabilities: "beam:coder:varint:v1"
capabilities: "beam:coder:double:v1"
capabilities: "beam:coder:string_utf8:v1"
capabilities: "beam:coder:length_prefix:v1"
capabilities: "beam:coder:kv:v1"
capabilities: "beam:coder:iterable:v1"
capabilities: "beam:coder:state_backed_iterable:v1"
capabilities: "beam:coder:windowed_value:v1"
capabilities: "beam:coder:global_window:v1"
capabilities: "beam:coder:interval_window:v1"
capabilities: "beam:coder:row:v1"
capabilities: "beam:coder:nullable:v1"
dependencies: <
type_urn: "beam:artifact:type:file:v1"
role_urn: "beam:artifact:role:go_worker_binary:v1"
>
>
>
environments: <
key: "jrHOcOhZljbeam:env:docker:v1"
value: <
urn: "beam:env:docker:v1"
payload: "\n apache/beam_java8_sdk:2.42.0.dev"
capabilities: "beam:coder:bytes:v1"
capabilities: "beam:coder:bool:v1"
capabilities: "beam:coder:varint:v1"
capabilities: "beam:coder:string_utf8:v1"
capabilities: "beam:coder:iterable:v1"
capabilities: "beam:coder:timer:v1"
capabilities: "beam:coder:kv:v1"
capabilities: "beam:coder:length_prefix:v1"
capabilities: "beam:coder:global_window:v1"
capabilities: "beam:coder:interval_window:v1"
capabilities: "beam:coder:custom_window:v1"
capabilities: "beam:coder:windowed_value:v1"
capabilities: "beam:coder:double:v1"
capabilities: "beam:coder:row:v1"
capabilities: "beam:coder:param_windowed_value:v1"
capabilities: "beam:coder:state_backed_iterable:v1"
capabilities: "beam:coder:sharded_key:v1"
capabilities: "beam:coder:nullable:v1"
capabilities: "beam:protocol:multi_core_bundle_processing:v1"
capabilities: "beam:protocol:progress_reporting:v1"
capabilities: "beam:protocol:harness_monitoring_infos:v1"
capabilities: "beam:protocol:control_request_elements_embedding:v1"
capabilities: "beam:protocol:state_caching:v1"
capabilities: "beam:version:sdk_base:apache/beam_java8_sdk:2.42.0.dev"
capabilities: "beam:transform:sdf_truncate_sized_restrictions:v1"
capabilities: "beam:transform:to_string:v1"
dependencies: <
type_urn: "beam:artifact:type:file:v1"
type_payload: "\nL/tmp/artifacts/icedtea-sound-CGRxIE9edPHnbxQhM-L5mp8h21H-ySB79uQtSquPV_Q.jar\022@086471204f5e74f1e76f142133e2f99a9f21db51fec9207bf6e42d4aab8f57f4"
role_urn: "beam:artifact:role:staging_to:v1"
role_payload: "\n=icedtea-sound-CGRxIE9edPHnbxQhM-L5mp8h21H-ySB79uQtSquPV_Q.jar"
>
dependencies: <
type_urn: "beam:artifact:type:file:v1"
type_payload: "\nF/tmp/artifacts/jaccess-FBI0Bb27lF3oEBieWAi7SP8X1zBR8k4BJQOVpsoK9a0.jar\022@14123405bdbb945de810189e5808bb48ff17d73051f24e01250395a6ca0af5ad"
role_urn: "beam:artifact:role:staging_to:v1"
role_payload: "\n7jaccess-FBI0Bb27lF3oEBieWAi7SP8X1zBR8k4BJQOVpsoK9a0.jar"
>
dependencies: <
type_urn: "beam:artifact:type:file:v1"
type_payload: "\nI/tmp/artifacts/localedata-kJ2mc8rBH5-IklhfR1XzNotlIQ_mnVMA-pgaXv2r8Ag.jar\022@909da673cac11f9f8892585f4755f3368b65210fe69d5300fa981a5efdabf008"
role_urn: "beam:artifact:role:staging_to:v1"
role_payload: "\n:localedata-kJ2mc8rBH5-IklhfR1XzNotlIQ_mnVMA-pgaXv2r8Ag.jar"
>
dependencies: <
type_urn: "beam:artifact:type:file:v1"
type_payload: "\nF/tmp/artifacts/nashorn-B0CAb3QpJET_6VsT3hcC_89VtvhV616H8N2bHAIaqWo.jar\022@0740806f74292444ffe95b13de1702ffcf55b6f855eb5e87f0dd9b1c021aa96a"
role_urn: "beam:artifact:role:staging_to:v1"
role_payload: "\n7nashorn-B0CAb3QpJET_6VsT3hcC_89VtvhV616H8N2bHAIaqWo.jar"
>
dependencies: <
type_urn: "beam:artifact:type:file:v1"
type_payload: "\nG/tmp/artifacts/cldrdata-gclqV9lOGqQOKesG-a6TAUTGEYlyIDqpyd4M_k7gtWo.jar\022@81c96a57d94e1aa40e29eb06f9ae930144c6118972203aa9c9de0cfe4ee0b56a"
role_urn: "beam:artifact:role:staging_to:v1"
role_payload: "\n8cldrdata-gclqV9lOGqQOKesG-a6TAUTGEYlyIDqpyd4M_k7gtWo.jar"
>
dependencies: <
type_urn: "beam:artifact:type:file:v1"
type_payload: "\nD/tmp/artifacts/dnsns-byzoQxdXengTvA5IlbH9gSIzfhNQElRYltuMJN0vjcc.jar\022@6f2ce84317577a7813bc0e4895b1fd8122337e135012545896db8c24dd2f8dc7"
role_urn: "beam:artifact:role:staging_to:v1"
role_payload: "\n5dnsns-byzoQxdXengTvA5IlbH9gSIzfhNQElRYltuMJN0vjcc.jar"
>
dependencies: <
type_urn: "beam:artifact:type:file:v1"
type_payload: "\nr/tmp/artifacts/beam-sdks-java-io-expansion-service-2.42.0-SNAPSHOT-vNgyeTf8GyA5TX1_pf8sb32MYrwK_WfjJhTZk9VAp2U.jar\022@bcd8327937fc1b20394d7d7fa5ff2c6f7d8c62bc0afd67e32614d993d540a765"
role_urn: "beam:artifact:role:staging_to:v1"
role_payload: "\ncbeam-sdks-java-io-expansion-service-2.42.0-SNAPSHOT-vNgyeTf8GyA5TX1_pf8sb32MYrwK_WfjJhTZk9VAp2U.jar"
>
>
>
>
root_transform_ids: "e4"
root_transform_ids: "s1"
root_transform_ids: "e5"
root_transform_ids: "s3"
requirements: "beam:requirement:pardo:splittable_dofn:v1"
2022/08/16 20:40:37 Cross-compiling <https://ci-beam.apache.org/job/beam_PostCommit_XVR_Spark3/ws/src/sdks/go/test/integration/io/xlang/kafka/kafka_test.go> as /tmp/worker-2-1660682437982911815
2022/08/16 20:40:39 Prepared job with id: go-testkafkaio_basicreadwrite-389_b13cae1b-09bf-45cc-afe4-a688c046ae9f and staging token: go-testkafkaio_basicreadwrite-389_b13cae1b-09bf-45cc-afe4-a688c046ae9f
2022/08/16 20:40:39 Staged binary artifact with token:
2022/08/16 20:40:39 Submitted job: go0testkafkaio0basicreadwrite0389-jenkins-0816204039-dbb2eb00_0f3dc60c-b29c-4048-934f-680f872cabba
2022/08/16 20:40:39 Job state: STOPPED
2022/08/16 20:40:39 Job state: STARTING
2022/08/16 20:40:39 Job state: RUNNING
2022/08/16 20:41:08 Job state: DONE
2022/08/16 20:41:08 Warning: 6 errors during metrics processing: [failed to deduce Step from MonitoringInfo: urn:"beam:metric:element_count:v1" type:"beam:metrics:sum_int64:v1" payload:"\x01" labels:{key:"PCOLLECTION" value:"jrHOcOhZljExternal/KafkaIO.Read/KafkaIO.Read.ReadFromKafkaViaUnbounded/Read(KafkaUnboundedSource)/Create/Read(CreateSource)/ParDo(OutputSingleSource)/ParMultiDo(OutputSingleSource).output/SplitAndSize0"} failed to deduce Step from MonitoringInfo: urn:"beam:metric:element_count:v1" type:"beam:metrics:sum_int64:v1" payload:"\x01" labels:{key:"PCOLLECTION" value:"jrHOcOhZljExternal/KafkaIO.Read/KafkaIO.Read.ReadFromKafkaViaUnbounded/Read(KafkaUnboundedSource)/Create/Read(CreateSource)/ParDo(OutputSingleSource)/ParMultiDo(OutputSingleSource).output/PairWithRestriction0"} failed to deduce Step from MonitoringInfo: urn:"beam:metric:sampled_byte_size:v1" type:"beam:metrics:distribution_int64:v1" payload:"\x01\xf8\"\xf8\"\xf8\"" labels:{key:"PCOLLECTION" value:"jrHOcOhZljExternal/KafkaIO.Read/KafkaIO.Read.ReadFromKafkaViaUnbounded/Read(KafkaUnboundedSource)/Create/Read(CreateSource)/ParDo(OutputSingleSource)/ParMultiDo(OutputSingleSource).output/SplitAndSize0"} failed to deduce Step from MonitoringInfo: urn:"beam:metric:sampled_byte_size:v1" type:"beam:metrics:distribution_int64:v1" payload:"\x01\xf0\"\xf0\"\xf0\"" labels:{key:"PCOLLECTION" value:"jrHOcOhZljExternal/KafkaIO.Read/KafkaIO.Read.ReadFromKafkaViaUnbounded/Read(KafkaUnboundedSource)/Create/Read(CreateSource)/ParDo(OutputSingleSource)/ParMultiDo(OutputSingleSource).output/PairWithRestriction0"} failed to deduce Step from MonitoringInfo: urn:"beam:metric:element_count:v1" type:"beam:metrics:sum_int64:v1" payload:"\x01" labels:{key:"PCOLLECTION" value:"jrHOcOhZljExternal/KafkaIO.Read/KafkaIO.Read.ReadFromKafkaViaUnbounded/Read(KafkaUnboundedSource)/Create/Read(CreateSource)/ParDo(OutputSingleSource)/ParMultiDo(OutputSingleSource).output/SplitAndSize0"} failed to deduce Step from MonitoringInfo: urn:"beam:metric:sampled_byte_size:v1" type:"beam:metrics:distribution_int64:v1" payload:"\x01\xfd\"\xfd\"\xfd\"" labels:{key:"PCOLLECTION" value:"jrHOcOhZljExternal/KafkaIO.Read/KafkaIO.Read.ReadFromKafkaViaUnbounded/Read(KafkaUnboundedSource)/Create/Read(CreateSource)/ParDo(OutputSingleSource)/ParMultiDo(OutputSingleSource).output/SplitAndSize0"}]
--- PASS: TestKafkaIO_BasicReadWrite (48.66s)
PASS
ok github.com/apache/beam/sdks/v2/go/test/integration/io/xlang/kafka 54.692s
> Task :runners:spark:3:job-server:validatesCrossLanguageRunnerJavaUsingPython
org.apache.beam.runners.core.construction.ValidateRunnerXlangTest$SingleInputOutputTest > test FAILED
java.lang.RuntimeException at ValidateRunnerXlangTest.java:242
java.lang.NullPointerException at Preconditions.java:980
14 tests completed, 1 failed
> Task :runners:spark:3:job-server:validatesCrossLanguageRunnerJavaUsingPython FAILED
> Task :runners:spark:3:job-server:validatesCrossLanguageRunnerPythonUsingJava
> Task :runners:spark:3:job-server:validatesCrossLanguageRunnerPythonUsingSql
> Task :runners:spark:3:job-server:validatesCrossLanguageRunnerCleanup
> Task :runners:spark:3:job-server:sparkJobServerCleanup
FAILURE: Build failed with an exception.
* What went wrong:
Execution failed for task ':runners:spark:3:job-server:validatesCrossLanguageRunnerJavaUsingPython'.
> There were failing tests. See the report at: file://<https://ci-beam.apache.org/job/beam_PostCommit_XVR_Spark3/ws/src/runners/spark/3/job-server/build/reports/tests/validatesCrossLanguageRunnerJavaUsingPython/index.html>
* Try:
> Run with --stacktrace option to get the stack trace.
> Run with --info or --debug option to get more log output.
> Run with --scan to get full insights.
* Get more help at https://help.gradle.org
Deprecated Gradle features were used in this build, making it incompatible with Gradle 8.0.
You can use '--warning-mode all' to show the individual deprecation warnings and determine if they come from your own scripts or plugins.
See https://docs.gradle.org/7.4/userguide/command_line_interface.html#sec:command_line_warnings
Execution optimizations have been disabled for 1 invalid unit(s) of work during this build to ensure correctness.
Please consult deprecation warnings for more details.
BUILD FAILED in 34m 29s
263 actionable tasks: 200 executed, 51 from cache, 12 up-to-date
Publishing build scan...
https://gradle.com/s/7fpog2sffnru2
Build step 'Invoke Gradle script' changed build result to FAILURE
Build step 'Invoke Gradle script' marked build as failure
---------------------------------------------------------------------
To unsubscribe, e-mail: builds-unsubscribe@beam.apache.org
For additional commands, e-mail: builds-help@beam.apache.org
Build failed in Jenkins: beam_PostCommit_XVR_Spark3 #2018
Posted by Apache Jenkins Server <je...@builds.apache.org>.
See <https://ci-beam.apache.org/job/beam_PostCommit_XVR_Spark3/2018/display/redirect?page=changes>
Changes:
[noreply] Handle single-precision float values in the standard coders tests
------------------------------------------
[...truncated 1.03 MB...]
spec: <
urn: "beam:coder:kv:v1"
>
component_coder_ids: "lHsLRKKemnVarIntCoder"
component_coder_ids: "lHsLRKKemnTimestampedValueCoder"
>
>
coders: <
key: "lHsLRKKemnKvCoder4"
value: <
spec: <
urn: "beam:coder:kv:v1"
>
component_coder_ids: "lHsLRKKemnVarIntCoder"
component_coder_ids: "lHsLRKKemnIterableCoder"
>
>
coders: <
key: "lHsLRKKemnNullableCoder"
value: <
spec: <
urn: "beam:coder:nullable:v1"
>
component_coder_ids: "lHsLRKKemnByteArrayCoder"
>
>
coders: <
key: "lHsLRKKemnSerializableCoder"
value: <
spec: <
urn: "beam:coders:javasdk:0.1"
payload: "\202SNAPPY\000\000\000\000\001\000\000\000\001\000\000\000\312\214\002\360^\254\355\000\005sr\000,org.apache.beam.sdk.coders.SerializableCoder\010\364 \216\305ynl\002\000\001L\000\004typet\000\021Ljava/lang/Class;xr\000&ofV\000\024Custom\005P8j\260\010\235\013;\035\013\002\000\000xr\000 j\213\000\005/\034C\335\325\211\256\274~\370\001/\020pvr\000;N1\000Pio.BoundedReadFromUnb\t\021`Source$Shardd\236\240U\205\000j\363\002\000\000xp"
>
>
>
coders: <
key: "lHsLRKKemnSnappyCoder"
value: <
spec: <
urn: "beam:coders:javasdk:0.1"
payload: "\202SNAPPY\000\000\000\000\001\000\000\000\001\000\000\001.\307\003\360@\254\355\000\005sr\000&org.apache.beam.sdk.coders.SnappyCoder1\033\243\356\177\362\366,\002\000\001L\000\ninner\005\030 t\000\"Lorg/a\005B\000/\001B\020/sdk/\tB\000/\005$\020;xr\000*ng\000 tructured\005/8s\277\022\016\325\3246\021\002\000\000xr\000 j9\000\005/\034C\335\325\211\256\274~\370\001/\020psr\000,j1\000,Serializable\005= \010\364 \216\305ynl\002\001\327\\\004typet\000\021Ljava/lang/Class\001\300n'\001\024Custom\005PPj\260\010\235\013;\035\013\002\000\000xq\000~\000\003vr\000$N\221\000\\io.BoundedSource!`v\023\177\370QA\0019\010r\000\035Z3\000\t,0\020\213\372\020Y\214\347\323\002\000\000xp"
>
>
>
coders: <
key: "lHsLRKKemnTimestampedValueCoder"
value: <
spec: <
urn: "beam:coders:javasdk:0.1"
payload: "\202SNAPPY\000\000\000\000\001\000\000\000\001\000\000\001?\315\003\270\254\355\000\005sr\000Aorg.apache.beam.sdk.values.TimestampedV\001\022\000$>\021\000LCoder\364\376\202p\274iX-\002\000\001L\000\nv\001)\005\030\034t\000\"Lorg/\t]\000/\001],/sdk/coders/\005$\020;xr\000*N\202\000\t%(.Structured\005/8s\277\022\016\325\3246\021\002\000\000xr\000 j9\000\005/\034C\335\325\211\256\274~\370\001/\020psr\000,j1\000(Serializabl\t\277\034\010\364 \216\305ynl\005\327\\\004typet\000\021Ljava/lang/Class\001\300\000&jV\000\024Custom\005\215Pj\260\010\235\013;\035\013\002\000\000xq\000~\000\003vr\000;N;\000Pio.BoundedReadFromUnb\t\021`Source$Shardd\236\240U\205\000j\363\002\000\000xp"
>
>
>
coders: <
key: "lHsLRKKemnValueWithRecordIdCoder"
value: <
spec: <
urn: "beam:coders:javasdk:0.1"
payload: "\202SNAPPY\000\000\000\000\001\000\000\000\001\000\000\001\213\311\005\320\254\355\000\005sr\000Corg.apache.beam.sdk.values.ValueWithRecordId$B\022\000LCoder{\343\376bQ\014\204>\002\000\002L\000\007i\t\025\034t\000+Lorg/\t\\\000/\001\\\024/sdk/c\0012(s/ByteArray\005B\014;L\000\n\005u\005\016\010t\000\"n;\000\005$\020;xr\000*N\274\000\t`(.Structured\005/8s\277\022\016\325\3246\021\002\000\000xr\000 j9\000\005/\034C\335\325\211\256\274~\370\001/\020psr\000)j1\0006\312\000\034\351\277\005|\263\3746\333\001:\010r\000&j8\000\024Atomic\005o\034\307\354\265\314\205tPF\0015 q\000~\000\003sr\000-N;\000$io.kafka.K\001\006\000R%\227\005B<I\320\251Y\032\341{#\002\000\001L\000\007kv\005\025\010t\000$nH\001\000K\t&\000;\025s\000\"Ns\000-P\r- j\000\275\271\035\243\3126\002!\353\010\010ke)\277\001\264\000\0022\303\001\005\022\025Y\000(jY\000\030Nullabl)\372\034E\333\0336>\220\247\007\005\307]\022.O\000\001\014,\006sq\000~\000\016q\000~\000\020"
>
>
>
coders: <
key: "lHsLRKKemnVarIntCoder"
value: <
spec: <
urn: "beam:coders:javasdk:0.1"
payload: "\202SNAPPY\000\000\000\000\001\000\000\000\001\000\000\000\210\330\001\350\254\355\000\005sr\000&org.apache.beam.sdk.coders.VarIntCoder\300K2\332\251KVh\002\000\000xrr5\000\024Atomic\0055 \307\354\265\314\205tPF\002\0055\000*jj\000$Structured\0059\034s\277\022\016\325\3246\021\t9\000 j9\000\005/0C\335\325\211\256\274~\370\002\000\000xp"
>
>
>
coders: <
key: "lHsLRKKemnVoidCoder"
value: <
spec: <
urn: "beam:coders:javasdk:0.1"
payload: "\202SNAPPY\000\000\000\000\001\000\000\000\001\000\000\000\210\326\001\350\254\355\000\005sr\000$org.apache.beam.sdk.coders.VoidCoder\271\277U\233\350\r\257U\002\000\000xr\000&j3\000\024Atomic\0055 \307\354\265\314\205tPF\002\0055\000*j5\000$Structured\0059\034s\277\022\016\325\3246\021\t9\000 j9\000\005/0C\335\325\211\256\274~\370\002\000\000xp"
>
>
>
environments: <
key: "go"
value: <
urn: "beam:env:docker:v1"
payload: "\n\026apache/beam_go_sdk:dev"
capabilities: "beam:protocol:progress_reporting:v1"
capabilities: "beam:protocol:multi_core_bundle_processing:v1"
capabilities: "beam:transform:sdf_truncate_sized_restrictions:v1"
capabilities: "beam:protocol:worker_status:v1"
capabilities: "beam:protocol:monitoring_info_short_ids:v1"
capabilities: "beam:version:sdk_base:go"
capabilities: "beam:coder:bytes:v1"
capabilities: "beam:coder:bool:v1"
capabilities: "beam:coder:varint:v1"
capabilities: "beam:coder:double:v1"
capabilities: "beam:coder:string_utf8:v1"
capabilities: "beam:coder:length_prefix:v1"
capabilities: "beam:coder:kv:v1"
capabilities: "beam:coder:iterable:v1"
capabilities: "beam:coder:state_backed_iterable:v1"
capabilities: "beam:coder:windowed_value:v1"
capabilities: "beam:coder:global_window:v1"
capabilities: "beam:coder:interval_window:v1"
capabilities: "beam:coder:row:v1"
capabilities: "beam:coder:nullable:v1"
dependencies: <
type_urn: "beam:artifact:type:file:v1"
role_urn: "beam:artifact:role:go_worker_binary:v1"
>
>
>
environments: <
key: "lHsLRKKemnbeam:env:docker:v1"
value: <
urn: "beam:env:docker:v1"
payload: "\n apache/beam_java8_sdk:2.42.0.dev"
capabilities: "beam:coder:bytes:v1"
capabilities: "beam:coder:bool:v1"
capabilities: "beam:coder:varint:v1"
capabilities: "beam:coder:string_utf8:v1"
capabilities: "beam:coder:iterable:v1"
capabilities: "beam:coder:timer:v1"
capabilities: "beam:coder:kv:v1"
capabilities: "beam:coder:length_prefix:v1"
capabilities: "beam:coder:global_window:v1"
capabilities: "beam:coder:interval_window:v1"
capabilities: "beam:coder:custom_window:v1"
capabilities: "beam:coder:windowed_value:v1"
capabilities: "beam:coder:double:v1"
capabilities: "beam:coder:row:v1"
capabilities: "beam:coder:param_windowed_value:v1"
capabilities: "beam:coder:state_backed_iterable:v1"
capabilities: "beam:coder:sharded_key:v1"
capabilities: "beam:coder:nullable:v1"
capabilities: "beam:protocol:multi_core_bundle_processing:v1"
capabilities: "beam:protocol:progress_reporting:v1"
capabilities: "beam:protocol:harness_monitoring_infos:v1"
capabilities: "beam:protocol:control_request_elements_embedding:v1"
capabilities: "beam:protocol:state_caching:v1"
capabilities: "beam:version:sdk_base:apache/beam_java8_sdk:2.42.0.dev"
capabilities: "beam:transform:sdf_truncate_sized_restrictions:v1"
capabilities: "beam:transform:to_string:v1"
dependencies: <
type_urn: "beam:artifact:type:file:v1"
type_payload: "\nL/tmp/artifacts/icedtea-sound-CGRxIE9edPHnbxQhM-L5mp8h21H-ySB79uQtSquPV_Q.jar\022@086471204f5e74f1e76f142133e2f99a9f21db51fec9207bf6e42d4aab8f57f4"
role_urn: "beam:artifact:role:staging_to:v1"
role_payload: "\n=icedtea-sound-CGRxIE9edPHnbxQhM-L5mp8h21H-ySB79uQtSquPV_Q.jar"
>
dependencies: <
type_urn: "beam:artifact:type:file:v1"
type_payload: "\nF/tmp/artifacts/jaccess-FBI0Bb27lF3oEBieWAi7SP8X1zBR8k4BJQOVpsoK9a0.jar\022@14123405bdbb945de810189e5808bb48ff17d73051f24e01250395a6ca0af5ad"
role_urn: "beam:artifact:role:staging_to:v1"
role_payload: "\n7jaccess-FBI0Bb27lF3oEBieWAi7SP8X1zBR8k4BJQOVpsoK9a0.jar"
>
dependencies: <
type_urn: "beam:artifact:type:file:v1"
type_payload: "\nI/tmp/artifacts/localedata-kJ2mc8rBH5-IklhfR1XzNotlIQ_mnVMA-pgaXv2r8Ag.jar\022@909da673cac11f9f8892585f4755f3368b65210fe69d5300fa981a5efdabf008"
role_urn: "beam:artifact:role:staging_to:v1"
role_payload: "\n:localedata-kJ2mc8rBH5-IklhfR1XzNotlIQ_mnVMA-pgaXv2r8Ag.jar"
>
dependencies: <
type_urn: "beam:artifact:type:file:v1"
type_payload: "\nF/tmp/artifacts/nashorn-B0CAb3QpJET_6VsT3hcC_89VtvhV616H8N2bHAIaqWo.jar\022@0740806f74292444ffe95b13de1702ffcf55b6f855eb5e87f0dd9b1c021aa96a"
role_urn: "beam:artifact:role:staging_to:v1"
role_payload: "\n7nashorn-B0CAb3QpJET_6VsT3hcC_89VtvhV616H8N2bHAIaqWo.jar"
>
dependencies: <
type_urn: "beam:artifact:type:file:v1"
type_payload: "\nG/tmp/artifacts/cldrdata-gclqV9lOGqQOKesG-a6TAUTGEYlyIDqpyd4M_k7gtWo.jar\022@81c96a57d94e1aa40e29eb06f9ae930144c6118972203aa9c9de0cfe4ee0b56a"
role_urn: "beam:artifact:role:staging_to:v1"
role_payload: "\n8cldrdata-gclqV9lOGqQOKesG-a6TAUTGEYlyIDqpyd4M_k7gtWo.jar"
>
dependencies: <
type_urn: "beam:artifact:type:file:v1"
type_payload: "\nD/tmp/artifacts/dnsns-byzoQxdXengTvA5IlbH9gSIzfhNQElRYltuMJN0vjcc.jar\022@6f2ce84317577a7813bc0e4895b1fd8122337e135012545896db8c24dd2f8dc7"
role_urn: "beam:artifact:role:staging_to:v1"
role_payload: "\n5dnsns-byzoQxdXengTvA5IlbH9gSIzfhNQElRYltuMJN0vjcc.jar"
>
dependencies: <
type_urn: "beam:artifact:type:file:v1"
type_payload: "\nr/tmp/artifacts/beam-sdks-java-io-expansion-service-2.42.0-SNAPSHOT-4BKRfXCUTMvfJ-MTQt-9pfJzB1bg9xrlUK_YOQBvqps.jar\022@e012917d70944ccbdf27e31342dfbda5f2730756e0f71ae550afd839006faa9b"
role_urn: "beam:artifact:role:staging_to:v1"
role_payload: "\ncbeam-sdks-java-io-expansion-service-2.42.0-SNAPSHOT-4BKRfXCUTMvfJ-MTQt-9pfJzB1bg9xrlUK_YOQBvqps.jar"
>
>
>
>
root_transform_ids: "e4"
root_transform_ids: "e5"
root_transform_ids: "s1"
root_transform_ids: "s3"
requirements: "beam:requirement:pardo:splittable_dofn:v1"
2022/08/16 14:37:11 Cross-compiling <https://ci-beam.apache.org/job/beam_PostCommit_XVR_Spark3/ws/src/sdks/go/test/integration/io/xlang/kafka/kafka_test.go> as /tmp/worker-2-1660660631250214157
2022/08/16 14:37:12 Prepared job with id: go-testkafkaio_basicreadwrite-911_ab823711-791f-4e6d-9936-0a43a77ab970 and staging token: go-testkafkaio_basicreadwrite-911_ab823711-791f-4e6d-9936-0a43a77ab970
2022/08/16 14:37:13 Staged binary artifact with token:
2022/08/16 14:37:13 Submitted job: go0testkafkaio0basicreadwrite0911-jenkins-0816143713-d0732a38_2bd1126e-9e6c-4c1d-a388-e1219a13a95f
2022/08/16 14:37:13 Job state: STOPPED
2022/08/16 14:37:13 Job state: STARTING
2022/08/16 14:37:13 Job state: RUNNING
2022/08/16 14:37:35 Job state: DONE
2022/08/16 14:37:35 Warning: 6 errors during metrics processing: [failed to deduce Step from MonitoringInfo: urn:"beam:metric:element_count:v1" type:"beam:metrics:sum_int64:v1" payload:"\x01" labels:{key:"PCOLLECTION" value:"lHsLRKKemnExternal/KafkaIO.Read/KafkaIO.Read.ReadFromKafkaViaUnbounded/Read(KafkaUnboundedSource)/Create/Read(CreateSource)/ParDo(OutputSingleSource)/ParMultiDo(OutputSingleSource).output/SplitAndSize0"} failed to deduce Step from MonitoringInfo: urn:"beam:metric:sampled_byte_size:v1" type:"beam:metrics:distribution_int64:v1" payload:"\x01\xfd\"\xfd\"\xfd\"" labels:{key:"PCOLLECTION" value:"lHsLRKKemnExternal/KafkaIO.Read/KafkaIO.Read.ReadFromKafkaViaUnbounded/Read(KafkaUnboundedSource)/Create/Read(CreateSource)/ParDo(OutputSingleSource)/ParMultiDo(OutputSingleSource).output/SplitAndSize0"} failed to deduce Step from MonitoringInfo: urn:"beam:metric:element_count:v1" type:"beam:metrics:sum_int64:v1" payload:"\x01" labels:{key:"PCOLLECTION" value:"lHsLRKKemnExternal/KafkaIO.Read/KafkaIO.Read.ReadFromKafkaViaUnbounded/Read(KafkaUnboundedSource)/Create/Read(CreateSource)/ParDo(OutputSingleSource)/ParMultiDo(OutputSingleSource).output/SplitAndSize0"} failed to deduce Step from MonitoringInfo: urn:"beam:metric:element_count:v1" type:"beam:metrics:sum_int64:v1" payload:"\x01" labels:{key:"PCOLLECTION" value:"lHsLRKKemnExternal/KafkaIO.Read/KafkaIO.Read.ReadFromKafkaViaUnbounded/Read(KafkaUnboundedSource)/Create/Read(CreateSource)/ParDo(OutputSingleSource)/ParMultiDo(OutputSingleSource).output/PairWithRestriction0"} failed to deduce Step from MonitoringInfo: urn:"beam:metric:sampled_byte_size:v1" type:"beam:metrics:distribution_int64:v1" payload:"\x01\xf8\"\xf8\"\xf8\"" labels:{key:"PCOLLECTION" value:"lHsLRKKemnExternal/KafkaIO.Read/KafkaIO.Read.ReadFromKafkaViaUnbounded/Read(KafkaUnboundedSource)/Create/Read(CreateSource)/ParDo(OutputSingleSource)/ParMultiDo(OutputSingleSource).output/SplitAndSize0"} failed to deduce Step from MonitoringInfo: urn:"beam:metric:sampled_byte_size:v1" type:"beam:metrics:distribution_int64:v1" payload:"\x01\xf0\"\xf0\"\xf0\"" labels:{key:"PCOLLECTION" value:"lHsLRKKemnExternal/KafkaIO.Read/KafkaIO.Read.ReadFromKafkaViaUnbounded/Read(KafkaUnboundedSource)/Create/Read(CreateSource)/ParDo(OutputSingleSource)/ParMultiDo(OutputSingleSource).output/PairWithRestriction0"}]
--- PASS: TestKafkaIO_BasicReadWrite (37.08s)
PASS
ok github.com/apache/beam/sdks/v2/go/test/integration/io/xlang/kafka 43.110s
> Task :runners:spark:3:job-server:validatesCrossLanguageRunnerJavaUsingPython
org.apache.beam.runners.core.construction.ValidateRunnerXlangTest$SingleInputOutputTest > test FAILED
java.lang.RuntimeException at ValidateRunnerXlangTest.java:242
java.lang.NullPointerException at Preconditions.java:980
14 tests completed, 1 failed
> Task :runners:spark:3:job-server:validatesCrossLanguageRunnerJavaUsingPython FAILED
> Task :runners:spark:3:job-server:validatesCrossLanguageRunnerPythonUsingJava
> Task :runners:spark:3:job-server:validatesCrossLanguageRunnerPythonUsingSql
> Task :runners:spark:3:job-server:validatesCrossLanguageRunnerCleanup
> Task :runners:spark:3:job-server:sparkJobServerCleanup
FAILURE: Build failed with an exception.
* What went wrong:
Execution failed for task ':runners:spark:3:job-server:validatesCrossLanguageRunnerJavaUsingPython'.
> There were failing tests. See the report at: file://<https://ci-beam.apache.org/job/beam_PostCommit_XVR_Spark3/ws/src/runners/spark/3/job-server/build/reports/tests/validatesCrossLanguageRunnerJavaUsingPython/index.html>
* Try:
> Run with --stacktrace option to get the stack trace.
> Run with --info or --debug option to get more log output.
> Run with --scan to get full insights.
* Get more help at https://help.gradle.org
Deprecated Gradle features were used in this build, making it incompatible with Gradle 8.0.
You can use '--warning-mode all' to show the individual deprecation warnings and determine if they come from your own scripts or plugins.
See https://docs.gradle.org/7.4/userguide/command_line_interface.html#sec:command_line_warnings
Execution optimizations have been disabled for 1 invalid unit(s) of work during this build to ensure correctness.
Please consult deprecation warnings for more details.
BUILD FAILED in 38m 48s
263 actionable tasks: 173 executed, 78 from cache, 12 up-to-date
Publishing build scan...
https://gradle.com/s/cmrrucqlrweuu
Build step 'Invoke Gradle script' changed build result to FAILURE
Build step 'Invoke Gradle script' marked build as failure
---------------------------------------------------------------------
To unsubscribe, e-mail: builds-unsubscribe@beam.apache.org
For additional commands, e-mail: builds-help@beam.apache.org
Build failed in Jenkins: beam_PostCommit_XVR_Spark3 #2017
Posted by Apache Jenkins Server <je...@builds.apache.org>.
See <https://ci-beam.apache.org/job/beam_PostCommit_XVR_Spark3/2017/display/redirect>
Changes:
------------------------------------------
[...truncated 1.02 MB...]
coders: <
key: "bNwRgkHwkvTimestampedValueCoder"
value: <
spec: <
urn: "beam:coders:javasdk:0.1"
payload: "\202SNAPPY\000\000\000\000\001\000\000\000\001\000\000\001?\315\003\270\254\355\000\005sr\000Aorg.apache.beam.sdk.values.TimestampedV\001\022\000$>\021\000LCoder\364\376\202p\274iX-\002\000\001L\000\nv\001)\005\030\034t\000\"Lorg/\t]\000/\001],/sdk/coders/\005$\020;xr\000*N\202\000\t%(.Structured\005/8s\277\022\016\325\3246\021\002\000\000xr\000 j9\000\005/\034C\335\325\211\256\274~\370\001/\020psr\000,j1\000(Serializabl\t\277\034\010\364 \216\305ynl\005\327\\\004typet\000\021Ljava/lang/Class\001\300\000&jV\000\024Custom\005\215Pj\260\010\235\013;\035\013\002\000\000xq\000~\000\003vr\000;N;\000Pio.BoundedReadFromUnb\t\021`Source$Shardd\236\240U\205\000j\363\002\000\000xp"
>
>
>
coders: <
key: "bNwRgkHwkvValueWithRecordIdCoder"
value: <
spec: <
urn: "beam:coders:javasdk:0.1"
payload: "\202SNAPPY\000\000\000\000\001\000\000\000\001\000\000\001\213\311\005\320\254\355\000\005sr\000Corg.apache.beam.sdk.values.ValueWithRecordId$B\022\000LCoder{\343\376bQ\014\204>\002\000\002L\000\007i\t\025\034t\000+Lorg/\t\\\000/\001\\\024/sdk/c\0012(s/ByteArray\005B\014;L\000\n\005u\005\016\010t\000\"n;\000\005$\020;xr\000*N\274\000\t`(.Structured\005/8s\277\022\016\325\3246\021\002\000\000xr\000 j9\000\005/\034C\335\325\211\256\274~\370\001/\020psr\000)j1\0006\312\000\034\351\277\005|\263\3746\333\001:\010r\000&j8\000\024Atomic\005o\034\307\354\265\314\205tPF\0015 q\000~\000\003sr\000-N;\000$io.kafka.K\001\006\000R%\227\005B<I\320\251Y\032\341{#\002\000\001L\000\007kv\005\025\010t\000$nH\001\000K\t&\000;\025s\000\"Ns\000-P\r- j\000\275\271\035\243\3126\002!\353\010\010ke)\277\001\264\000\0022\303\001\005\022\025Y\000(jY\000\030Nullabl)\372\034E\333\0336>\220\247\007\005\307]\022.O\000\001\014,\006sq\000~\000\016q\000~\000\020"
>
>
>
coders: <
key: "bNwRgkHwkvVarIntCoder"
value: <
spec: <
urn: "beam:coders:javasdk:0.1"
payload: "\202SNAPPY\000\000\000\000\001\000\000\000\001\000\000\000\210\330\001\350\254\355\000\005sr\000&org.apache.beam.sdk.coders.VarIntCoder\300K2\332\251KVh\002\000\000xrr5\000\024Atomic\0055 \307\354\265\314\205tPF\002\0055\000*jj\000$Structured\0059\034s\277\022\016\325\3246\021\t9\000 j9\000\005/0C\335\325\211\256\274~\370\002\000\000xp"
>
>
>
coders: <
key: "bNwRgkHwkvVoidCoder"
value: <
spec: <
urn: "beam:coders:javasdk:0.1"
payload: "\202SNAPPY\000\000\000\000\001\000\000\000\001\000\000\000\210\326\001\350\254\355\000\005sr\000$org.apache.beam.sdk.coders.VoidCoder\271\277U\233\350\r\257U\002\000\000xr\000&j3\000\024Atomic\0055 \307\354\265\314\205tPF\002\0055\000*j5\000$Structured\0059\034s\277\022\016\325\3246\021\t9\000 j9\000\005/0C\335\325\211\256\274~\370\002\000\000xp"
>
>
>
coders: <
key: "c0"
value: <
spec: <
urn: "beam:coder:bytes:v1"
>
>
>
coders: <
key: "c1"
value: <
spec: <
urn: "beam:coder:global_window:v1"
>
>
>
coders: <
key: "c2"
value: <
spec: <
urn: "beam:go:coder:custom:v1"
payload: "Cgd2YXJpbnR6EgIIAhpdCklnaXRodWIuY29tL2FwYWNoZS9iZWFtL3Nka3MvdjIvZ28vcGtnL2JlYW0vY29yZS9ydW50aW1lL2NvZGVyeC5lbmNWYXJJbnRaEhAIFiIECBlADyoGCBQSAggIImkKSWdpdGh1Yi5jb20vYXBhY2hlL2JlYW0vc2Rrcy92Mi9nby9wa2cvYmVhbS9jb3JlL3J1bnRpbWUvY29kZXJ4LmRlY1ZhckludFoSHAgWIgQIGUADIgYIFBICCAgqBAgZQA8qBAgZQAE="
>
>
>
coders: <
key: "c3"
value: <
spec: <
urn: "beam:coder:length_prefix:v1"
>
component_coder_ids: "c2"
>
>
coders: <
key: "c4"
value: <
spec: <
urn: "beam:coder:kv:v1"
>
component_coder_ids: "c0"
component_coder_ids: "c0"
>
>
environments: <
key: "bNwRgkHwkvbeam:env:docker:v1"
value: <
urn: "beam:env:docker:v1"
payload: "\n apache/beam_java8_sdk:2.42.0.dev"
capabilities: "beam:coder:bytes:v1"
capabilities: "beam:coder:bool:v1"
capabilities: "beam:coder:varint:v1"
capabilities: "beam:coder:string_utf8:v1"
capabilities: "beam:coder:iterable:v1"
capabilities: "beam:coder:timer:v1"
capabilities: "beam:coder:kv:v1"
capabilities: "beam:coder:length_prefix:v1"
capabilities: "beam:coder:global_window:v1"
capabilities: "beam:coder:interval_window:v1"
capabilities: "beam:coder:custom_window:v1"
capabilities: "beam:coder:windowed_value:v1"
capabilities: "beam:coder:double:v1"
capabilities: "beam:coder:row:v1"
capabilities: "beam:coder:param_windowed_value:v1"
capabilities: "beam:coder:state_backed_iterable:v1"
capabilities: "beam:coder:sharded_key:v1"
capabilities: "beam:coder:nullable:v1"
capabilities: "beam:protocol:multi_core_bundle_processing:v1"
capabilities: "beam:protocol:progress_reporting:v1"
capabilities: "beam:protocol:harness_monitoring_infos:v1"
capabilities: "beam:protocol:control_request_elements_embedding:v1"
capabilities: "beam:protocol:state_caching:v1"
capabilities: "beam:version:sdk_base:apache/beam_java8_sdk:2.42.0.dev"
capabilities: "beam:transform:sdf_truncate_sized_restrictions:v1"
capabilities: "beam:transform:to_string:v1"
dependencies: <
type_urn: "beam:artifact:type:file:v1"
type_payload: "\nL/tmp/artifacts/icedtea-sound-CGRxIE9edPHnbxQhM-L5mp8h21H-ySB79uQtSquPV_Q.jar\022@086471204f5e74f1e76f142133e2f99a9f21db51fec9207bf6e42d4aab8f57f4"
role_urn: "beam:artifact:role:staging_to:v1"
role_payload: "\n=icedtea-sound-CGRxIE9edPHnbxQhM-L5mp8h21H-ySB79uQtSquPV_Q.jar"
>
dependencies: <
type_urn: "beam:artifact:type:file:v1"
type_payload: "\nF/tmp/artifacts/jaccess-FBI0Bb27lF3oEBieWAi7SP8X1zBR8k4BJQOVpsoK9a0.jar\022@14123405bdbb945de810189e5808bb48ff17d73051f24e01250395a6ca0af5ad"
role_urn: "beam:artifact:role:staging_to:v1"
role_payload: "\n7jaccess-FBI0Bb27lF3oEBieWAi7SP8X1zBR8k4BJQOVpsoK9a0.jar"
>
dependencies: <
type_urn: "beam:artifact:type:file:v1"
type_payload: "\nI/tmp/artifacts/localedata-kJ2mc8rBH5-IklhfR1XzNotlIQ_mnVMA-pgaXv2r8Ag.jar\022@909da673cac11f9f8892585f4755f3368b65210fe69d5300fa981a5efdabf008"
role_urn: "beam:artifact:role:staging_to:v1"
role_payload: "\n:localedata-kJ2mc8rBH5-IklhfR1XzNotlIQ_mnVMA-pgaXv2r8Ag.jar"
>
dependencies: <
type_urn: "beam:artifact:type:file:v1"
type_payload: "\nF/tmp/artifacts/nashorn-B0CAb3QpJET_6VsT3hcC_89VtvhV616H8N2bHAIaqWo.jar\022@0740806f74292444ffe95b13de1702ffcf55b6f855eb5e87f0dd9b1c021aa96a"
role_urn: "beam:artifact:role:staging_to:v1"
role_payload: "\n7nashorn-B0CAb3QpJET_6VsT3hcC_89VtvhV616H8N2bHAIaqWo.jar"
>
dependencies: <
type_urn: "beam:artifact:type:file:v1"
type_payload: "\nG/tmp/artifacts/cldrdata-gclqV9lOGqQOKesG-a6TAUTGEYlyIDqpyd4M_k7gtWo.jar\022@81c96a57d94e1aa40e29eb06f9ae930144c6118972203aa9c9de0cfe4ee0b56a"
role_urn: "beam:artifact:role:staging_to:v1"
role_payload: "\n8cldrdata-gclqV9lOGqQOKesG-a6TAUTGEYlyIDqpyd4M_k7gtWo.jar"
>
dependencies: <
type_urn: "beam:artifact:type:file:v1"
type_payload: "\nD/tmp/artifacts/dnsns-byzoQxdXengTvA5IlbH9gSIzfhNQElRYltuMJN0vjcc.jar\022@6f2ce84317577a7813bc0e4895b1fd8122337e135012545896db8c24dd2f8dc7"
role_urn: "beam:artifact:role:staging_to:v1"
role_payload: "\n5dnsns-byzoQxdXengTvA5IlbH9gSIzfhNQElRYltuMJN0vjcc.jar"
>
dependencies: <
type_urn: "beam:artifact:type:file:v1"
type_payload: "\nr/tmp/artifacts/beam-sdks-java-io-expansion-service-2.42.0-SNAPSHOT-4BKRfXCUTMvfJ-MTQt-9pfJzB1bg9xrlUK_YOQBvqps.jar\022@e012917d70944ccbdf27e31342dfbda5f2730756e0f71ae550afd839006faa9b"
role_urn: "beam:artifact:role:staging_to:v1"
role_payload: "\ncbeam-sdks-java-io-expansion-service-2.42.0-SNAPSHOT-4BKRfXCUTMvfJ-MTQt-9pfJzB1bg9xrlUK_YOQBvqps.jar"
>
>
>
environments: <
key: "go"
value: <
urn: "beam:env:docker:v1"
payload: "\n\026apache/beam_go_sdk:dev"
capabilities: "beam:protocol:progress_reporting:v1"
capabilities: "beam:protocol:multi_core_bundle_processing:v1"
capabilities: "beam:transform:sdf_truncate_sized_restrictions:v1"
capabilities: "beam:protocol:worker_status:v1"
capabilities: "beam:protocol:monitoring_info_short_ids:v1"
capabilities: "beam:version:sdk_base:go"
capabilities: "beam:coder:bytes:v1"
capabilities: "beam:coder:bool:v1"
capabilities: "beam:coder:varint:v1"
capabilities: "beam:coder:double:v1"
capabilities: "beam:coder:string_utf8:v1"
capabilities: "beam:coder:length_prefix:v1"
capabilities: "beam:coder:kv:v1"
capabilities: "beam:coder:iterable:v1"
capabilities: "beam:coder:state_backed_iterable:v1"
capabilities: "beam:coder:windowed_value:v1"
capabilities: "beam:coder:global_window:v1"
capabilities: "beam:coder:interval_window:v1"
capabilities: "beam:coder:row:v1"
capabilities: "beam:coder:nullable:v1"
dependencies: <
type_urn: "beam:artifact:type:file:v1"
role_urn: "beam:artifact:role:go_worker_binary:v1"
>
>
>
>
root_transform_ids: "e4"
root_transform_ids: "e5"
root_transform_ids: "s1"
root_transform_ids: "s3"
requirements: "beam:requirement:pardo:splittable_dofn:v1"
2022/08/16 08:37:35 Cross-compiling <https://ci-beam.apache.org/job/beam_PostCommit_XVR_Spark3/ws/src/sdks/go/test/integration/io/xlang/kafka/kafka_test.go> as /tmp/worker-2-1660639055340750269
2022/08/16 08:37:38 Prepared job with id: go-testkafkaio_basicreadwrite-74_335bbb23-5e72-4b32-8051-98cd21882790 and staging token: go-testkafkaio_basicreadwrite-74_335bbb23-5e72-4b32-8051-98cd21882790
2022/08/16 08:37:38 Staged binary artifact with token:
2022/08/16 08:37:38 Submitted job: go0testkafkaio0basicreadwrite074-jenkins-0816083738-11a72566_f41c8e6e-3dc0-4105-99a0-9dd5209eac04
2022/08/16 08:37:38 Job state: STOPPED
2022/08/16 08:37:38 Job state: STARTING
2022/08/16 08:37:38 Job state: RUNNING
2022/08/16 08:38:02 Job state: DONE
2022/08/16 08:38:02 Warning: 6 errors during metrics processing: [failed to deduce Step from MonitoringInfo: urn:"beam:metric:element_count:v1" type:"beam:metrics:sum_int64:v1" payload:"\x01" labels:{key:"PCOLLECTION" value:"bNwRgkHwkvExternal/KafkaIO.Read/KafkaIO.Read.ReadFromKafkaViaUnbounded/Read(KafkaUnboundedSource)/Create/Read(CreateSource)/ParDo(OutputSingleSource)/ParMultiDo(OutputSingleSource).output/PairWithRestriction0"} failed to deduce Step from MonitoringInfo: urn:"beam:metric:element_count:v1" type:"beam:metrics:sum_int64:v1" payload:"\x01" labels:{key:"PCOLLECTION" value:"bNwRgkHwkvExternal/KafkaIO.Read/KafkaIO.Read.ReadFromKafkaViaUnbounded/Read(KafkaUnboundedSource)/Create/Read(CreateSource)/ParDo(OutputSingleSource)/ParMultiDo(OutputSingleSource).output/SplitAndSize0"} failed to deduce Step from MonitoringInfo: urn:"beam:metric:sampled_byte_size:v1" type:"beam:metrics:distribution_int64:v1" payload:"\x01\xf0\"\xf0\"\xf0\"" labels:{key:"PCOLLECTION" value:"bNwRgkHwkvExternal/KafkaIO.Read/KafkaIO.Read.ReadFromKafkaViaUnbounded/Read(KafkaUnboundedSource)/Create/Read(CreateSource)/ParDo(OutputSingleSource)/ParMultiDo(OutputSingleSource).output/PairWithRestriction0"} failed to deduce Step from MonitoringInfo: urn:"beam:metric:sampled_byte_size:v1" type:"beam:metrics:distribution_int64:v1" payload:"\x01\xf8\"\xf8\"\xf8\"" labels:{key:"PCOLLECTION" value:"bNwRgkHwkvExternal/KafkaIO.Read/KafkaIO.Read.ReadFromKafkaViaUnbounded/Read(KafkaUnboundedSource)/Create/Read(CreateSource)/ParDo(OutputSingleSource)/ParMultiDo(OutputSingleSource).output/SplitAndSize0"} failed to deduce Step from MonitoringInfo: urn:"beam:metric:element_count:v1" type:"beam:metrics:sum_int64:v1" payload:"\x01" labels:{key:"PCOLLECTION" value:"bNwRgkHwkvExternal/KafkaIO.Read/KafkaIO.Read.ReadFromKafkaViaUnbounded/Read(KafkaUnboundedSource)/Create/Read(CreateSource)/ParDo(OutputSingleSource)/ParMultiDo(OutputSingleSource).output/SplitAndSize0"} failed to deduce Step from MonitoringInfo: urn:"beam:metric:sampled_byte_size:v1" type:"beam:metrics:distribution_int64:v1" payload:"\x01\xfd\"\xfd\"\xfd\"" labels:{key:"PCOLLECTION" value:"bNwRgkHwkvExternal/KafkaIO.Read/KafkaIO.Read.ReadFromKafkaViaUnbounded/Read(KafkaUnboundedSource)/Create/Read(CreateSource)/ParDo(OutputSingleSource)/ParMultiDo(OutputSingleSource).output/SplitAndSize0"}]
--- PASS: TestKafkaIO_BasicReadWrite (40.95s)
PASS
ok github.com/apache/beam/sdks/v2/go/test/integration/io/xlang/kafka 46.980s
> Task :runners:spark:3:job-server:validatesCrossLanguageRunnerJavaUsingPython
org.apache.beam.runners.core.construction.ValidateRunnerXlangTest$SingleInputOutputTest > test FAILED
java.lang.RuntimeException at ValidateRunnerXlangTest.java:242
java.lang.NullPointerException at Preconditions.java:980
14 tests completed, 1 failed
> Task :runners:spark:3:job-server:validatesCrossLanguageRunnerJavaUsingPython FAILED
> Task :runners:spark:3:job-server:validatesCrossLanguageRunnerPythonUsingJava
> Task :runners:spark:3:job-server:validatesCrossLanguageRunnerPythonUsingSql
> Task :runners:spark:3:job-server:validatesCrossLanguageRunnerCleanup
> Task :runners:spark:3:job-server:sparkJobServerCleanup
FAILURE: Build failed with an exception.
* What went wrong:
Execution failed for task ':runners:spark:3:job-server:validatesCrossLanguageRunnerJavaUsingPython'.
> There were failing tests. See the report at: file://<https://ci-beam.apache.org/job/beam_PostCommit_XVR_Spark3/ws/src/runners/spark/3/job-server/build/reports/tests/validatesCrossLanguageRunnerJavaUsingPython/index.html>
* Try:
> Run with --stacktrace option to get the stack trace.
> Run with --info or --debug option to get more log output.
> Run with --scan to get full insights.
* Get more help at https://help.gradle.org
Deprecated Gradle features were used in this build, making it incompatible with Gradle 8.0.
You can use '--warning-mode all' to show the individual deprecation warnings and determine if they come from your own scripts or plugins.
See https://docs.gradle.org/7.4/userguide/command_line_interface.html#sec:command_line_warnings
Execution optimizations have been disabled for 1 invalid unit(s) of work during this build to ensure correctness.
Please consult deprecation warnings for more details.
BUILD FAILED in 32m 52s
263 actionable tasks: 173 executed, 78 from cache, 12 up-to-date
Publishing build scan...
https://gradle.com/s/c2ver573rfb32
Build step 'Invoke Gradle script' changed build result to FAILURE
Build step 'Invoke Gradle script' marked build as failure
---------------------------------------------------------------------
To unsubscribe, e-mail: builds-unsubscribe@beam.apache.org
For additional commands, e-mail: builds-help@beam.apache.org
Build failed in Jenkins: beam_PostCommit_XVR_Spark3 #2016
Posted by Apache Jenkins Server <je...@builds.apache.org>.
See <https://ci-beam.apache.org/job/beam_PostCommit_XVR_Spark3/2016/display/redirect?page=changes>
Changes:
[noreply] Implement KafkaSchemaTransformReadConfiguration (#22403)
------------------------------------------
[...truncated 1.02 MB...]
spec: <
urn: "beam:coder:kv:v1"
>
component_coder_ids: "ztXODOlhVUVarIntCoder"
component_coder_ids: "ztXODOlhVUTimestampedValueCoder"
>
>
coders: <
key: "ztXODOlhVUKvCoder4"
value: <
spec: <
urn: "beam:coder:kv:v1"
>
component_coder_ids: "ztXODOlhVUVarIntCoder"
component_coder_ids: "ztXODOlhVUIterableCoder"
>
>
coders: <
key: "ztXODOlhVUNullableCoder"
value: <
spec: <
urn: "beam:coder:nullable:v1"
>
component_coder_ids: "ztXODOlhVUByteArrayCoder"
>
>
coders: <
key: "ztXODOlhVUSerializableCoder"
value: <
spec: <
urn: "beam:coders:javasdk:0.1"
payload: "\202SNAPPY\000\000\000\000\001\000\000\000\001\000\000\000\312\214\002\360^\254\355\000\005sr\000,org.apache.beam.sdk.coders.SerializableCoder\010\364 \216\305ynl\002\000\001L\000\004typet\000\021Ljava/lang/Class;xr\000&ofV\000\024Custom\005P8j\260\010\235\013;\035\013\002\000\000xr\000 j\213\000\005/\034C\335\325\211\256\274~\370\001/\020pvr\000;N1\000Pio.BoundedReadFromUnb\t\021`Source$Shardd\236\240U\205\000j\363\002\000\000xp"
>
>
>
coders: <
key: "ztXODOlhVUSnappyCoder"
value: <
spec: <
urn: "beam:coders:javasdk:0.1"
payload: "\202SNAPPY\000\000\000\000\001\000\000\000\001\000\000\001.\307\003\360@\254\355\000\005sr\000&org.apache.beam.sdk.coders.SnappyCoder1\033\243\356\177\362\366,\002\000\001L\000\ninner\005\030 t\000\"Lorg/a\005B\000/\001B\020/sdk/\tB\000/\005$\020;xr\000*ng\000 tructured\005/8s\277\022\016\325\3246\021\002\000\000xr\000 j9\000\005/\034C\335\325\211\256\274~\370\001/\020psr\000,j1\000,Serializable\005= \010\364 \216\305ynl\002\001\327\\\004typet\000\021Ljava/lang/Class\001\300n'\001\024Custom\005PPj\260\010\235\013;\035\013\002\000\000xq\000~\000\003vr\000$N\221\000\\io.BoundedSource!`v\023\177\370QA\0019\010r\000\035Z3\000\t,0\020\213\372\020Y\214\347\323\002\000\000xp"
>
>
>
coders: <
key: "ztXODOlhVUTimestampedValueCoder"
value: <
spec: <
urn: "beam:coders:javasdk:0.1"
payload: "\202SNAPPY\000\000\000\000\001\000\000\000\001\000\000\001?\315\003\270\254\355\000\005sr\000Aorg.apache.beam.sdk.values.TimestampedV\001\022\000$>\021\000LCoder\364\376\202p\274iX-\002\000\001L\000\nv\001)\005\030\034t\000\"Lorg/\t]\000/\001],/sdk/coders/\005$\020;xr\000*N\202\000\t%(.Structured\005/8s\277\022\016\325\3246\021\002\000\000xr\000 j9\000\005/\034C\335\325\211\256\274~\370\001/\020psr\000,j1\000(Serializabl\t\277\034\010\364 \216\305ynl\005\327\\\004typet\000\021Ljava/lang/Class\001\300\000&jV\000\024Custom\005\215Pj\260\010\235\013;\035\013\002\000\000xq\000~\000\003vr\000;N;\000Pio.BoundedReadFromUnb\t\021`Source$Shardd\236\240U\205\000j\363\002\000\000xp"
>
>
>
coders: <
key: "ztXODOlhVUValueWithRecordIdCoder"
value: <
spec: <
urn: "beam:coders:javasdk:0.1"
payload: "\202SNAPPY\000\000\000\000\001\000\000\000\001\000\000\001\213\311\005\320\254\355\000\005sr\000Corg.apache.beam.sdk.values.ValueWithRecordId$B\022\000LCoder{\343\376bQ\014\204>\002\000\002L\000\007i\t\025\034t\000+Lorg/\t\\\000/\001\\\024/sdk/c\0012(s/ByteArray\005B\014;L\000\n\005u\005\016\010t\000\"n;\000\005$\020;xr\000*N\274\000\t`(.Structured\005/8s\277\022\016\325\3246\021\002\000\000xr\000 j9\000\005/\034C\335\325\211\256\274~\370\001/\020psr\000)j1\0006\312\000\034\351\277\005|\263\3746\333\001:\010r\000&j8\000\024Atomic\005o\034\307\354\265\314\205tPF\0015 q\000~\000\003sr\000-N;\000$io.kafka.K\001\006\000R%\227\005B<I\320\251Y\032\341{#\002\000\001L\000\007kv\005\025\010t\000$nH\001\000K\t&\000;\025s\000\"Ns\000-P\r- j\000\275\271\035\243\3126\002!\353\010\010ke)\277\001\264\000\0022\303\001\005\022\025Y\000(jY\000\030Nullabl)\372\034E\333\0336>\220\247\007\005\307]\022.O\000\001\014,\006sq\000~\000\016q\000~\000\020"
>
>
>
coders: <
key: "ztXODOlhVUVarIntCoder"
value: <
spec: <
urn: "beam:coders:javasdk:0.1"
payload: "\202SNAPPY\000\000\000\000\001\000\000\000\001\000\000\000\210\330\001\350\254\355\000\005sr\000&org.apache.beam.sdk.coders.VarIntCoder\300K2\332\251KVh\002\000\000xrr5\000\024Atomic\0055 \307\354\265\314\205tPF\002\0055\000*jj\000$Structured\0059\034s\277\022\016\325\3246\021\t9\000 j9\000\005/0C\335\325\211\256\274~\370\002\000\000xp"
>
>
>
coders: <
key: "ztXODOlhVUVoidCoder"
value: <
spec: <
urn: "beam:coders:javasdk:0.1"
payload: "\202SNAPPY\000\000\000\000\001\000\000\000\001\000\000\000\210\326\001\350\254\355\000\005sr\000$org.apache.beam.sdk.coders.VoidCoder\271\277U\233\350\r\257U\002\000\000xr\000&j3\000\024Atomic\0055 \307\354\265\314\205tPF\002\0055\000*j5\000$Structured\0059\034s\277\022\016\325\3246\021\t9\000 j9\000\005/0C\335\325\211\256\274~\370\002\000\000xp"
>
>
>
environments: <
key: "go"
value: <
urn: "beam:env:docker:v1"
payload: "\n\026apache/beam_go_sdk:dev"
capabilities: "beam:protocol:progress_reporting:v1"
capabilities: "beam:protocol:multi_core_bundle_processing:v1"
capabilities: "beam:transform:sdf_truncate_sized_restrictions:v1"
capabilities: "beam:protocol:worker_status:v1"
capabilities: "beam:protocol:monitoring_info_short_ids:v1"
capabilities: "beam:version:sdk_base:go"
capabilities: "beam:coder:bytes:v1"
capabilities: "beam:coder:bool:v1"
capabilities: "beam:coder:varint:v1"
capabilities: "beam:coder:double:v1"
capabilities: "beam:coder:string_utf8:v1"
capabilities: "beam:coder:length_prefix:v1"
capabilities: "beam:coder:kv:v1"
capabilities: "beam:coder:iterable:v1"
capabilities: "beam:coder:state_backed_iterable:v1"
capabilities: "beam:coder:windowed_value:v1"
capabilities: "beam:coder:global_window:v1"
capabilities: "beam:coder:interval_window:v1"
capabilities: "beam:coder:row:v1"
capabilities: "beam:coder:nullable:v1"
dependencies: <
type_urn: "beam:artifact:type:file:v1"
role_urn: "beam:artifact:role:go_worker_binary:v1"
>
>
>
environments: <
key: "ztXODOlhVUbeam:env:docker:v1"
value: <
urn: "beam:env:docker:v1"
payload: "\n apache/beam_java8_sdk:2.42.0.dev"
capabilities: "beam:coder:bytes:v1"
capabilities: "beam:coder:bool:v1"
capabilities: "beam:coder:varint:v1"
capabilities: "beam:coder:string_utf8:v1"
capabilities: "beam:coder:iterable:v1"
capabilities: "beam:coder:timer:v1"
capabilities: "beam:coder:kv:v1"
capabilities: "beam:coder:length_prefix:v1"
capabilities: "beam:coder:global_window:v1"
capabilities: "beam:coder:interval_window:v1"
capabilities: "beam:coder:custom_window:v1"
capabilities: "beam:coder:windowed_value:v1"
capabilities: "beam:coder:double:v1"
capabilities: "beam:coder:row:v1"
capabilities: "beam:coder:param_windowed_value:v1"
capabilities: "beam:coder:state_backed_iterable:v1"
capabilities: "beam:coder:sharded_key:v1"
capabilities: "beam:coder:nullable:v1"
capabilities: "beam:protocol:multi_core_bundle_processing:v1"
capabilities: "beam:protocol:progress_reporting:v1"
capabilities: "beam:protocol:harness_monitoring_infos:v1"
capabilities: "beam:protocol:control_request_elements_embedding:v1"
capabilities: "beam:protocol:state_caching:v1"
capabilities: "beam:version:sdk_base:apache/beam_java8_sdk:2.42.0.dev"
capabilities: "beam:transform:sdf_truncate_sized_restrictions:v1"
capabilities: "beam:transform:to_string:v1"
dependencies: <
type_urn: "beam:artifact:type:file:v1"
type_payload: "\nL/tmp/artifacts/icedtea-sound-CGRxIE9edPHnbxQhM-L5mp8h21H-ySB79uQtSquPV_Q.jar\022@086471204f5e74f1e76f142133e2f99a9f21db51fec9207bf6e42d4aab8f57f4"
role_urn: "beam:artifact:role:staging_to:v1"
role_payload: "\n=icedtea-sound-CGRxIE9edPHnbxQhM-L5mp8h21H-ySB79uQtSquPV_Q.jar"
>
dependencies: <
type_urn: "beam:artifact:type:file:v1"
type_payload: "\nF/tmp/artifacts/jaccess-FBI0Bb27lF3oEBieWAi7SP8X1zBR8k4BJQOVpsoK9a0.jar\022@14123405bdbb945de810189e5808bb48ff17d73051f24e01250395a6ca0af5ad"
role_urn: "beam:artifact:role:staging_to:v1"
role_payload: "\n7jaccess-FBI0Bb27lF3oEBieWAi7SP8X1zBR8k4BJQOVpsoK9a0.jar"
>
dependencies: <
type_urn: "beam:artifact:type:file:v1"
type_payload: "\nI/tmp/artifacts/localedata-kJ2mc8rBH5-IklhfR1XzNotlIQ_mnVMA-pgaXv2r8Ag.jar\022@909da673cac11f9f8892585f4755f3368b65210fe69d5300fa981a5efdabf008"
role_urn: "beam:artifact:role:staging_to:v1"
role_payload: "\n:localedata-kJ2mc8rBH5-IklhfR1XzNotlIQ_mnVMA-pgaXv2r8Ag.jar"
>
dependencies: <
type_urn: "beam:artifact:type:file:v1"
type_payload: "\nF/tmp/artifacts/nashorn-B0CAb3QpJET_6VsT3hcC_89VtvhV616H8N2bHAIaqWo.jar\022@0740806f74292444ffe95b13de1702ffcf55b6f855eb5e87f0dd9b1c021aa96a"
role_urn: "beam:artifact:role:staging_to:v1"
role_payload: "\n7nashorn-B0CAb3QpJET_6VsT3hcC_89VtvhV616H8N2bHAIaqWo.jar"
>
dependencies: <
type_urn: "beam:artifact:type:file:v1"
type_payload: "\nG/tmp/artifacts/cldrdata-gclqV9lOGqQOKesG-a6TAUTGEYlyIDqpyd4M_k7gtWo.jar\022@81c96a57d94e1aa40e29eb06f9ae930144c6118972203aa9c9de0cfe4ee0b56a"
role_urn: "beam:artifact:role:staging_to:v1"
role_payload: "\n8cldrdata-gclqV9lOGqQOKesG-a6TAUTGEYlyIDqpyd4M_k7gtWo.jar"
>
dependencies: <
type_urn: "beam:artifact:type:file:v1"
type_payload: "\nD/tmp/artifacts/dnsns-byzoQxdXengTvA5IlbH9gSIzfhNQElRYltuMJN0vjcc.jar\022@6f2ce84317577a7813bc0e4895b1fd8122337e135012545896db8c24dd2f8dc7"
role_urn: "beam:artifact:role:staging_to:v1"
role_payload: "\n5dnsns-byzoQxdXengTvA5IlbH9gSIzfhNQElRYltuMJN0vjcc.jar"
>
dependencies: <
type_urn: "beam:artifact:type:file:v1"
type_payload: "\nr/tmp/artifacts/beam-sdks-java-io-expansion-service-2.42.0-SNAPSHOT-4BKRfXCUTMvfJ-MTQt-9pfJzB1bg9xrlUK_YOQBvqps.jar\022@e012917d70944ccbdf27e31342dfbda5f2730756e0f71ae550afd839006faa9b"
role_urn: "beam:artifact:role:staging_to:v1"
role_payload: "\ncbeam-sdks-java-io-expansion-service-2.42.0-SNAPSHOT-4BKRfXCUTMvfJ-MTQt-9pfJzB1bg9xrlUK_YOQBvqps.jar"
>
>
>
>
root_transform_ids: "e4"
root_transform_ids: "e5"
root_transform_ids: "s1"
root_transform_ids: "s3"
requirements: "beam:requirement:pardo:splittable_dofn:v1"
2022/08/16 02:38:55 Cross-compiling <https://ci-beam.apache.org/job/beam_PostCommit_XVR_Spark3/ws/src/sdks/go/test/integration/io/xlang/kafka/kafka_test.go> as /tmp/worker-2-1660617535309797714
2022/08/16 02:38:57 Prepared job with id: go-testkafkaio_basicreadwrite-815_e6c30b69-7edf-4fd1-98ba-b2e5aa294e08 and staging token: go-testkafkaio_basicreadwrite-815_e6c30b69-7edf-4fd1-98ba-b2e5aa294e08
2022/08/16 02:38:57 Staged binary artifact with token:
2022/08/16 02:38:57 Submitted job: go0testkafkaio0basicreadwrite0815-jenkins-0816023857-3d2a8b86_51a75dbf-4d4a-4b00-9c14-18435461909d
2022/08/16 02:38:57 Job state: STOPPED
2022/08/16 02:38:57 Job state: STARTING
2022/08/16 02:38:57 Job state: RUNNING
2022/08/16 02:39:21 Job state: DONE
2022/08/16 02:39:21 Warning: 6 errors during metrics processing: [failed to deduce Step from MonitoringInfo: urn:"beam:metric:element_count:v1" type:"beam:metrics:sum_int64:v1" payload:"\x01" labels:{key:"PCOLLECTION" value:"ztXODOlhVUExternal/KafkaIO.Read/KafkaIO.Read.ReadFromKafkaViaUnbounded/Read(KafkaUnboundedSource)/Create/Read(CreateSource)/ParDo(OutputSingleSource)/ParMultiDo(OutputSingleSource).output/SplitAndSize0"} failed to deduce Step from MonitoringInfo: urn:"beam:metric:sampled_byte_size:v1" type:"beam:metrics:distribution_int64:v1" payload:"\x01\xfd\"\xfd\"\xfd\"" labels:{key:"PCOLLECTION" value:"ztXODOlhVUExternal/KafkaIO.Read/KafkaIO.Read.ReadFromKafkaViaUnbounded/Read(KafkaUnboundedSource)/Create/Read(CreateSource)/ParDo(OutputSingleSource)/ParMultiDo(OutputSingleSource).output/SplitAndSize0"} failed to deduce Step from MonitoringInfo: urn:"beam:metric:element_count:v1" type:"beam:metrics:sum_int64:v1" payload:"\x01" labels:{key:"PCOLLECTION" value:"ztXODOlhVUExternal/KafkaIO.Read/KafkaIO.Read.ReadFromKafkaViaUnbounded/Read(KafkaUnboundedSource)/Create/Read(CreateSource)/ParDo(OutputSingleSource)/ParMultiDo(OutputSingleSource).output/SplitAndSize0"} failed to deduce Step from MonitoringInfo: urn:"beam:metric:element_count:v1" type:"beam:metrics:sum_int64:v1" payload:"\x01" labels:{key:"PCOLLECTION" value:"ztXODOlhVUExternal/KafkaIO.Read/KafkaIO.Read.ReadFromKafkaViaUnbounded/Read(KafkaUnboundedSource)/Create/Read(CreateSource)/ParDo(OutputSingleSource)/ParMultiDo(OutputSingleSource).output/PairWithRestriction0"} failed to deduce Step from MonitoringInfo: urn:"beam:metric:sampled_byte_size:v1" type:"beam:metrics:distribution_int64:v1" payload:"\x01\xf8\"\xf8\"\xf8\"" labels:{key:"PCOLLECTION" value:"ztXODOlhVUExternal/KafkaIO.Read/KafkaIO.Read.ReadFromKafkaViaUnbounded/Read(KafkaUnboundedSource)/Create/Read(CreateSource)/ParDo(OutputSingleSource)/ParMultiDo(OutputSingleSource).output/SplitAndSize0"} failed to deduce Step from MonitoringInfo: urn:"beam:metric:sampled_byte_size:v1" type:"beam:metrics:distribution_int64:v1" payload:"\x01\xf0\"\xf0\"\xf0\"" labels:{key:"PCOLLECTION" value:"ztXODOlhVUExternal/KafkaIO.Read/KafkaIO.Read.ReadFromKafkaViaUnbounded/Read(KafkaUnboundedSource)/Create/Read(CreateSource)/ParDo(OutputSingleSource)/ParMultiDo(OutputSingleSource).output/PairWithRestriction0"}]
--- PASS: TestKafkaIO_BasicReadWrite (40.73s)
PASS
ok github.com/apache/beam/sdks/v2/go/test/integration/io/xlang/kafka 46.765s
> Task :runners:spark:3:job-server:validatesCrossLanguageRunnerJavaUsingPython
org.apache.beam.runners.core.construction.ValidateRunnerXlangTest$SingleInputOutputTest > test FAILED
java.lang.RuntimeException at ValidateRunnerXlangTest.java:242
java.lang.NullPointerException at Preconditions.java:980
14 tests completed, 1 failed
> Task :runners:spark:3:job-server:validatesCrossLanguageRunnerJavaUsingPython FAILED
> Task :runners:spark:3:job-server:validatesCrossLanguageRunnerPythonUsingJava
> Task :runners:spark:3:job-server:validatesCrossLanguageRunnerPythonUsingSql
> Task :runners:spark:3:job-server:validatesCrossLanguageRunnerCleanup
> Task :runners:spark:3:job-server:sparkJobServerCleanup
FAILURE: Build failed with an exception.
* What went wrong:
Execution failed for task ':runners:spark:3:job-server:validatesCrossLanguageRunnerJavaUsingPython'.
> There were failing tests. See the report at: file://<https://ci-beam.apache.org/job/beam_PostCommit_XVR_Spark3/ws/src/runners/spark/3/job-server/build/reports/tests/validatesCrossLanguageRunnerJavaUsingPython/index.html>
* Try:
> Run with --stacktrace option to get the stack trace.
> Run with --info or --debug option to get more log output.
> Run with --scan to get full insights.
* Get more help at https://help.gradle.org
Deprecated Gradle features were used in this build, making it incompatible with Gradle 8.0.
You can use '--warning-mode all' to show the individual deprecation warnings and determine if they come from your own scripts or plugins.
See https://docs.gradle.org/7.4/userguide/command_line_interface.html#sec:command_line_warnings
Execution optimizations have been disabled for 1 invalid unit(s) of work during this build to ensure correctness.
Please consult deprecation warnings for more details.
BUILD FAILED in 35m 50s
263 actionable tasks: 174 executed, 77 from cache, 12 up-to-date
Publishing build scan...
https://gradle.com/s/h733fclp6nppw
Build step 'Invoke Gradle script' changed build result to FAILURE
Build step 'Invoke Gradle script' marked build as failure
---------------------------------------------------------------------
To unsubscribe, e-mail: builds-unsubscribe@beam.apache.org
For additional commands, e-mail: builds-help@beam.apache.org
Build failed in Jenkins: beam_PostCommit_XVR_Spark3 #2015
Posted by Apache Jenkins Server <je...@builds.apache.org>.
See <https://ci-beam.apache.org/job/beam_PostCommit_XVR_Spark3/2015/display/redirect?page=changes>
Changes:
[Steve Niemitz] Fix UpdateSchemaDestination when source format is set to AVRO
[noreply] Add a dataflow override for runnerv1 to still use SDF on runnerv2.
[noreply] [Playground] Result filter bug (#22215)
[noreply] [Website] update case-studies layout (#22342)
------------------------------------------
[...truncated 1.02 MB...]
spec: <
urn: "beam:coder:kv:v1"
>
component_coder_ids: "hqCdygKiyCVarIntCoder"
component_coder_ids: "hqCdygKiyCTimestampedValueCoder"
>
>
coders: <
key: "hqCdygKiyCKvCoder4"
value: <
spec: <
urn: "beam:coder:kv:v1"
>
component_coder_ids: "hqCdygKiyCVarIntCoder"
component_coder_ids: "hqCdygKiyCIterableCoder"
>
>
coders: <
key: "hqCdygKiyCNullableCoder"
value: <
spec: <
urn: "beam:coder:nullable:v1"
>
component_coder_ids: "hqCdygKiyCByteArrayCoder"
>
>
coders: <
key: "hqCdygKiyCSerializableCoder"
value: <
spec: <
urn: "beam:coders:javasdk:0.1"
payload: "\202SNAPPY\000\000\000\000\001\000\000\000\001\000\000\000\312\214\002\360^\254\355\000\005sr\000,org.apache.beam.sdk.coders.SerializableCoder\010\364 \216\305ynl\002\000\001L\000\004typet\000\021Ljava/lang/Class;xr\000&ofV\000\024Custom\005P8j\260\010\235\013;\035\013\002\000\000xr\000 j\213\000\005/\034C\335\325\211\256\274~\370\001/\020pvr\000;N1\000Pio.BoundedReadFromUnb\t\021`Source$Shardd\236\240U\205\000j\363\002\000\000xp"
>
>
>
coders: <
key: "hqCdygKiyCSnappyCoder"
value: <
spec: <
urn: "beam:coders:javasdk:0.1"
payload: "\202SNAPPY\000\000\000\000\001\000\000\000\001\000\000\001.\307\003\360@\254\355\000\005sr\000&org.apache.beam.sdk.coders.SnappyCoder1\033\243\356\177\362\366,\002\000\001L\000\ninner\005\030 t\000\"Lorg/a\005B\000/\001B\020/sdk/\tB\000/\005$\020;xr\000*ng\000 tructured\005/8s\277\022\016\325\3246\021\002\000\000xr\000 j9\000\005/\034C\335\325\211\256\274~\370\001/\020psr\000,j1\000,Serializable\005= \010\364 \216\305ynl\002\001\327\\\004typet\000\021Ljava/lang/Class\001\300n'\001\024Custom\005PPj\260\010\235\013;\035\013\002\000\000xq\000~\000\003vr\000$N\221\000\\io.BoundedSource!`v\023\177\370QA\0019\010r\000\035Z3\000\t,0\020\213\372\020Y\214\347\323\002\000\000xp"
>
>
>
coders: <
key: "hqCdygKiyCTimestampedValueCoder"
value: <
spec: <
urn: "beam:coders:javasdk:0.1"
payload: "\202SNAPPY\000\000\000\000\001\000\000\000\001\000\000\001?\315\003\270\254\355\000\005sr\000Aorg.apache.beam.sdk.values.TimestampedV\001\022\000$>\021\000LCoder\364\376\202p\274iX-\002\000\001L\000\nv\001)\005\030\034t\000\"Lorg/\t]\000/\001],/sdk/coders/\005$\020;xr\000*N\202\000\t%(.Structured\005/8s\277\022\016\325\3246\021\002\000\000xr\000 j9\000\005/\034C\335\325\211\256\274~\370\001/\020psr\000,j1\000(Serializabl\t\277\034\010\364 \216\305ynl\005\327\\\004typet\000\021Ljava/lang/Class\001\300\000&jV\000\024Custom\005\215Pj\260\010\235\013;\035\013\002\000\000xq\000~\000\003vr\000;N;\000Pio.BoundedReadFromUnb\t\021`Source$Shardd\236\240U\205\000j\363\002\000\000xp"
>
>
>
coders: <
key: "hqCdygKiyCValueWithRecordIdCoder"
value: <
spec: <
urn: "beam:coders:javasdk:0.1"
payload: "\202SNAPPY\000\000\000\000\001\000\000\000\001\000\000\001\213\311\005\320\254\355\000\005sr\000Corg.apache.beam.sdk.values.ValueWithRecordId$B\022\000LCoder{\343\376bQ\014\204>\002\000\002L\000\007i\t\025\034t\000+Lorg/\t\\\000/\001\\\024/sdk/c\0012(s/ByteArray\005B\014;L\000\n\005u\005\016\010t\000\"n;\000\005$\020;xr\000*N\274\000\t`(.Structured\005/8s\277\022\016\325\3246\021\002\000\000xr\000 j9\000\005/\034C\335\325\211\256\274~\370\001/\020psr\000)j1\0006\312\000\034\351\277\005|\263\3746\333\001:\010r\000&j8\000\024Atomic\005o\034\307\354\265\314\205tPF\0015 q\000~\000\003sr\000-N;\000$io.kafka.K\001\006\000R%\227\005B<I\320\251Y\032\341{#\002\000\001L\000\007kv\005\025\010t\000$nH\001\000K\t&\000;\025s\000\"Ns\000-P\r- j\000\275\271\035\243\3126\002!\353\010\010ke)\277\001\264\000\0022\303\001\005\022\025Y\000(jY\000\030Nullabl)\372\034E\333\0336>\220\247\007\005\307]\022.O\000\001\014,\006sq\000~\000\016q\000~\000\020"
>
>
>
coders: <
key: "hqCdygKiyCVarIntCoder"
value: <
spec: <
urn: "beam:coders:javasdk:0.1"
payload: "\202SNAPPY\000\000\000\000\001\000\000\000\001\000\000\000\210\330\001\350\254\355\000\005sr\000&org.apache.beam.sdk.coders.VarIntCoder\300K2\332\251KVh\002\000\000xrr5\000\024Atomic\0055 \307\354\265\314\205tPF\002\0055\000*jj\000$Structured\0059\034s\277\022\016\325\3246\021\t9\000 j9\000\005/0C\335\325\211\256\274~\370\002\000\000xp"
>
>
>
coders: <
key: "hqCdygKiyCVoidCoder"
value: <
spec: <
urn: "beam:coders:javasdk:0.1"
payload: "\202SNAPPY\000\000\000\000\001\000\000\000\001\000\000\000\210\326\001\350\254\355\000\005sr\000$org.apache.beam.sdk.coders.VoidCoder\271\277U\233\350\r\257U\002\000\000xr\000&j3\000\024Atomic\0055 \307\354\265\314\205tPF\002\0055\000*j5\000$Structured\0059\034s\277\022\016\325\3246\021\t9\000 j9\000\005/0C\335\325\211\256\274~\370\002\000\000xp"
>
>
>
environments: <
key: "go"
value: <
urn: "beam:env:docker:v1"
payload: "\n\026apache/beam_go_sdk:dev"
capabilities: "beam:protocol:progress_reporting:v1"
capabilities: "beam:protocol:multi_core_bundle_processing:v1"
capabilities: "beam:transform:sdf_truncate_sized_restrictions:v1"
capabilities: "beam:protocol:worker_status:v1"
capabilities: "beam:protocol:monitoring_info_short_ids:v1"
capabilities: "beam:version:sdk_base:go"
capabilities: "beam:coder:bytes:v1"
capabilities: "beam:coder:bool:v1"
capabilities: "beam:coder:varint:v1"
capabilities: "beam:coder:double:v1"
capabilities: "beam:coder:string_utf8:v1"
capabilities: "beam:coder:length_prefix:v1"
capabilities: "beam:coder:kv:v1"
capabilities: "beam:coder:iterable:v1"
capabilities: "beam:coder:state_backed_iterable:v1"
capabilities: "beam:coder:windowed_value:v1"
capabilities: "beam:coder:global_window:v1"
capabilities: "beam:coder:interval_window:v1"
capabilities: "beam:coder:row:v1"
capabilities: "beam:coder:nullable:v1"
dependencies: <
type_urn: "beam:artifact:type:file:v1"
role_urn: "beam:artifact:role:go_worker_binary:v1"
>
>
>
environments: <
key: "hqCdygKiyCbeam:env:docker:v1"
value: <
urn: "beam:env:docker:v1"
payload: "\n apache/beam_java8_sdk:2.42.0.dev"
capabilities: "beam:coder:bytes:v1"
capabilities: "beam:coder:bool:v1"
capabilities: "beam:coder:varint:v1"
capabilities: "beam:coder:string_utf8:v1"
capabilities: "beam:coder:iterable:v1"
capabilities: "beam:coder:timer:v1"
capabilities: "beam:coder:kv:v1"
capabilities: "beam:coder:length_prefix:v1"
capabilities: "beam:coder:global_window:v1"
capabilities: "beam:coder:interval_window:v1"
capabilities: "beam:coder:custom_window:v1"
capabilities: "beam:coder:windowed_value:v1"
capabilities: "beam:coder:double:v1"
capabilities: "beam:coder:row:v1"
capabilities: "beam:coder:param_windowed_value:v1"
capabilities: "beam:coder:state_backed_iterable:v1"
capabilities: "beam:coder:sharded_key:v1"
capabilities: "beam:coder:nullable:v1"
capabilities: "beam:protocol:multi_core_bundle_processing:v1"
capabilities: "beam:protocol:progress_reporting:v1"
capabilities: "beam:protocol:harness_monitoring_infos:v1"
capabilities: "beam:protocol:control_request_elements_embedding:v1"
capabilities: "beam:protocol:state_caching:v1"
capabilities: "beam:version:sdk_base:apache/beam_java8_sdk:2.42.0.dev"
capabilities: "beam:transform:sdf_truncate_sized_restrictions:v1"
capabilities: "beam:transform:to_string:v1"
dependencies: <
type_urn: "beam:artifact:type:file:v1"
type_payload: "\nL/tmp/artifacts/icedtea-sound-CGRxIE9edPHnbxQhM-L5mp8h21H-ySB79uQtSquPV_Q.jar\022@086471204f5e74f1e76f142133e2f99a9f21db51fec9207bf6e42d4aab8f57f4"
role_urn: "beam:artifact:role:staging_to:v1"
role_payload: "\n=icedtea-sound-CGRxIE9edPHnbxQhM-L5mp8h21H-ySB79uQtSquPV_Q.jar"
>
dependencies: <
type_urn: "beam:artifact:type:file:v1"
type_payload: "\nF/tmp/artifacts/jaccess-FBI0Bb27lF3oEBieWAi7SP8X1zBR8k4BJQOVpsoK9a0.jar\022@14123405bdbb945de810189e5808bb48ff17d73051f24e01250395a6ca0af5ad"
role_urn: "beam:artifact:role:staging_to:v1"
role_payload: "\n7jaccess-FBI0Bb27lF3oEBieWAi7SP8X1zBR8k4BJQOVpsoK9a0.jar"
>
dependencies: <
type_urn: "beam:artifact:type:file:v1"
type_payload: "\nI/tmp/artifacts/localedata-kJ2mc8rBH5-IklhfR1XzNotlIQ_mnVMA-pgaXv2r8Ag.jar\022@909da673cac11f9f8892585f4755f3368b65210fe69d5300fa981a5efdabf008"
role_urn: "beam:artifact:role:staging_to:v1"
role_payload: "\n:localedata-kJ2mc8rBH5-IklhfR1XzNotlIQ_mnVMA-pgaXv2r8Ag.jar"
>
dependencies: <
type_urn: "beam:artifact:type:file:v1"
type_payload: "\nF/tmp/artifacts/nashorn-B0CAb3QpJET_6VsT3hcC_89VtvhV616H8N2bHAIaqWo.jar\022@0740806f74292444ffe95b13de1702ffcf55b6f855eb5e87f0dd9b1c021aa96a"
role_urn: "beam:artifact:role:staging_to:v1"
role_payload: "\n7nashorn-B0CAb3QpJET_6VsT3hcC_89VtvhV616H8N2bHAIaqWo.jar"
>
dependencies: <
type_urn: "beam:artifact:type:file:v1"
type_payload: "\nG/tmp/artifacts/cldrdata-gclqV9lOGqQOKesG-a6TAUTGEYlyIDqpyd4M_k7gtWo.jar\022@81c96a57d94e1aa40e29eb06f9ae930144c6118972203aa9c9de0cfe4ee0b56a"
role_urn: "beam:artifact:role:staging_to:v1"
role_payload: "\n8cldrdata-gclqV9lOGqQOKesG-a6TAUTGEYlyIDqpyd4M_k7gtWo.jar"
>
dependencies: <
type_urn: "beam:artifact:type:file:v1"
type_payload: "\nD/tmp/artifacts/dnsns-byzoQxdXengTvA5IlbH9gSIzfhNQElRYltuMJN0vjcc.jar\022@6f2ce84317577a7813bc0e4895b1fd8122337e135012545896db8c24dd2f8dc7"
role_urn: "beam:artifact:role:staging_to:v1"
role_payload: "\n5dnsns-byzoQxdXengTvA5IlbH9gSIzfhNQElRYltuMJN0vjcc.jar"
>
dependencies: <
type_urn: "beam:artifact:type:file:v1"
type_payload: "\nr/tmp/artifacts/beam-sdks-java-io-expansion-service-2.42.0-SNAPSHOT-Nc2I3ZhyT7-oyDTgQHRgxjZOKatpiGcPr_Q6tpt-fkg.jar\022@35cd88dd98724fbfa8c834e0407460c6364e29ab6988670faff43ab69b7e7e48"
role_urn: "beam:artifact:role:staging_to:v1"
role_payload: "\ncbeam-sdks-java-io-expansion-service-2.42.0-SNAPSHOT-Nc2I3ZhyT7-oyDTgQHRgxjZOKatpiGcPr_Q6tpt-fkg.jar"
>
>
>
>
root_transform_ids: "s1"
root_transform_ids: "e4"
root_transform_ids: "e5"
root_transform_ids: "s3"
requirements: "beam:requirement:pardo:splittable_dofn:v1"
2022/08/15 20:39:46 Cross-compiling <https://ci-beam.apache.org/job/beam_PostCommit_XVR_Spark3/ws/src/sdks/go/test/integration/io/xlang/kafka/kafka_test.go> as /tmp/worker-2-1660595986563458999
2022/08/15 20:39:48 Prepared job with id: go-testkafkaio_basicreadwrite-499_e295cc73-049c-4e7b-828c-a77787f64fcf and staging token: go-testkafkaio_basicreadwrite-499_e295cc73-049c-4e7b-828c-a77787f64fcf
2022/08/15 20:39:48 Staged binary artifact with token:
2022/08/15 20:39:48 Submitted job: go0testkafkaio0basicreadwrite0499-jenkins-0815203948-12889ff1_c8393d12-3a54-4c4a-b534-6aeef7d96deb
2022/08/15 20:39:48 Job state: STOPPED
2022/08/15 20:39:48 Job state: STARTING
2022/08/15 20:39:48 Job state: RUNNING
2022/08/15 20:40:11 Job state: DONE
2022/08/15 20:40:11 Warning: 6 errors during metrics processing: [failed to deduce Step from MonitoringInfo: urn:"beam:metric:element_count:v1" type:"beam:metrics:sum_int64:v1" payload:"\x01" labels:{key:"PCOLLECTION" value:"hqCdygKiyCExternal/KafkaIO.Read/KafkaIO.Read.ReadFromKafkaViaUnbounded/Read(KafkaUnboundedSource)/Create/Read(CreateSource)/ParDo(OutputSingleSource)/ParMultiDo(OutputSingleSource).output/SplitAndSize0"} failed to deduce Step from MonitoringInfo: urn:"beam:metric:element_count:v1" type:"beam:metrics:sum_int64:v1" payload:"\x01" labels:{key:"PCOLLECTION" value:"hqCdygKiyCExternal/KafkaIO.Read/KafkaIO.Read.ReadFromKafkaViaUnbounded/Read(KafkaUnboundedSource)/Create/Read(CreateSource)/ParDo(OutputSingleSource)/ParMultiDo(OutputSingleSource).output/PairWithRestriction0"} failed to deduce Step from MonitoringInfo: urn:"beam:metric:sampled_byte_size:v1" type:"beam:metrics:distribution_int64:v1" payload:"\x01\xf0\"\xf0\"\xf0\"" labels:{key:"PCOLLECTION" value:"hqCdygKiyCExternal/KafkaIO.Read/KafkaIO.Read.ReadFromKafkaViaUnbounded/Read(KafkaUnboundedSource)/Create/Read(CreateSource)/ParDo(OutputSingleSource)/ParMultiDo(OutputSingleSource).output/PairWithRestriction0"} failed to deduce Step from MonitoringInfo: urn:"beam:metric:sampled_byte_size:v1" type:"beam:metrics:distribution_int64:v1" payload:"\x01\xf8\"\xf8\"\xf8\"" labels:{key:"PCOLLECTION" value:"hqCdygKiyCExternal/KafkaIO.Read/KafkaIO.Read.ReadFromKafkaViaUnbounded/Read(KafkaUnboundedSource)/Create/Read(CreateSource)/ParDo(OutputSingleSource)/ParMultiDo(OutputSingleSource).output/SplitAndSize0"} failed to deduce Step from MonitoringInfo: urn:"beam:metric:element_count:v1" type:"beam:metrics:sum_int64:v1" payload:"\x01" labels:{key:"PCOLLECTION" value:"hqCdygKiyCExternal/KafkaIO.Read/KafkaIO.Read.ReadFromKafkaViaUnbounded/Read(KafkaUnboundedSource)/Create/Read(CreateSource)/ParDo(OutputSingleSource)/ParMultiDo(OutputSingleSource).output/SplitAndSize0"} failed to deduce Step from MonitoringInfo: urn:"beam:metric:sampled_byte_size:v1" type:"beam:metrics:distribution_int64:v1" payload:"\x01\xfd\"\xfd\"\xfd\"" labels:{key:"PCOLLECTION" value:"hqCdygKiyCExternal/KafkaIO.Read/KafkaIO.Read.ReadFromKafkaViaUnbounded/Read(KafkaUnboundedSource)/Create/Read(CreateSource)/ParDo(OutputSingleSource)/ParMultiDo(OutputSingleSource).output/SplitAndSize0"}]
--- PASS: TestKafkaIO_BasicReadWrite (39.01s)
PASS
ok github.com/apache/beam/sdks/v2/go/test/integration/io/xlang/kafka 45.041s
> Task :runners:spark:3:job-server:validatesCrossLanguageRunnerJavaUsingPython
org.apache.beam.runners.core.construction.ValidateRunnerXlangTest$SingleInputOutputTest > test FAILED
java.lang.RuntimeException at ValidateRunnerXlangTest.java:242
java.lang.NullPointerException at Preconditions.java:980
14 tests completed, 1 failed
> Task :runners:spark:3:job-server:validatesCrossLanguageRunnerJavaUsingPython FAILED
> Task :runners:spark:3:job-server:validatesCrossLanguageRunnerPythonUsingJava
> Task :runners:spark:3:job-server:validatesCrossLanguageRunnerPythonUsingSql
> Task :runners:spark:3:job-server:validatesCrossLanguageRunnerCleanup
> Task :runners:spark:3:job-server:sparkJobServerCleanup
FAILURE: Build failed with an exception.
* What went wrong:
Execution failed for task ':runners:spark:3:job-server:validatesCrossLanguageRunnerJavaUsingPython'.
> There were failing tests. See the report at: file://<https://ci-beam.apache.org/job/beam_PostCommit_XVR_Spark3/ws/src/runners/spark/3/job-server/build/reports/tests/validatesCrossLanguageRunnerJavaUsingPython/index.html>
* Try:
> Run with --stacktrace option to get the stack trace.
> Run with --info or --debug option to get more log output.
> Run with --scan to get full insights.
* Get more help at https://help.gradle.org
Deprecated Gradle features were used in this build, making it incompatible with Gradle 8.0.
You can use '--warning-mode all' to show the individual deprecation warnings and determine if they come from your own scripts or plugins.
See https://docs.gradle.org/7.4/userguide/command_line_interface.html#sec:command_line_warnings
Execution optimizations have been disabled for 1 invalid unit(s) of work during this build to ensure correctness.
Please consult deprecation warnings for more details.
BUILD FAILED in 34m 30s
263 actionable tasks: 174 executed, 77 from cache, 12 up-to-date
Publishing build scan...
https://gradle.com/s/74w5es5fucxh6
Build step 'Invoke Gradle script' changed build result to FAILURE
Build step 'Invoke Gradle script' marked build as failure
---------------------------------------------------------------------
To unsubscribe, e-mail: builds-unsubscribe@beam.apache.org
For additional commands, e-mail: builds-help@beam.apache.org
Build failed in Jenkins: beam_PostCommit_XVR_Spark3 #2014
Posted by Apache Jenkins Server <je...@builds.apache.org>.
See <https://ci-beam.apache.org/job/beam_PostCommit_XVR_Spark3/2014/display/redirect?page=changes>
Changes:
[noreply] Attempt to fix SpannerIO test flakes (#22688)
------------------------------------------
[...truncated 1.02 MB...]
coders: <
key: "UVKKACkTQETimestampedValueCoder"
value: <
spec: <
urn: "beam:coders:javasdk:0.1"
payload: "\202SNAPPY\000\000\000\000\001\000\000\000\001\000\000\001?\315\003\270\254\355\000\005sr\000Aorg.apache.beam.sdk.values.TimestampedV\001\022\000$>\021\000LCoder\364\376\202p\274iX-\002\000\001L\000\nv\001)\005\030\034t\000\"Lorg/\t]\000/\001],/sdk/coders/\005$\020;xr\000*N\202\000\t%(.Structured\005/8s\277\022\016\325\3246\021\002\000\000xr\000 j9\000\005/\034C\335\325\211\256\274~\370\001/\020psr\000,j1\000(Serializabl\t\277\034\010\364 \216\305ynl\005\327\\\004typet\000\021Ljava/lang/Class\001\300\000&jV\000\024Custom\005\215Pj\260\010\235\013;\035\013\002\000\000xq\000~\000\003vr\000;N;\000Pio.BoundedReadFromUnb\t\021`Source$Shardd\236\240U\205\000j\363\002\000\000xp"
>
>
>
coders: <
key: "UVKKACkTQEValueWithRecordIdCoder"
value: <
spec: <
urn: "beam:coders:javasdk:0.1"
payload: "\202SNAPPY\000\000\000\000\001\000\000\000\001\000\000\001\213\311\005\320\254\355\000\005sr\000Corg.apache.beam.sdk.values.ValueWithRecordId$B\022\000LCoder{\343\376bQ\014\204>\002\000\002L\000\007i\t\025\034t\000+Lorg/\t\\\000/\001\\\024/sdk/c\0012(s/ByteArray\005B\014;L\000\n\005u\005\016\010t\000\"n;\000\005$\020;xr\000*N\274\000\t`(.Structured\005/8s\277\022\016\325\3246\021\002\000\000xr\000 j9\000\005/\034C\335\325\211\256\274~\370\001/\020psr\000)j1\0006\312\000\034\351\277\005|\263\3746\333\001:\010r\000&j8\000\024Atomic\005o\034\307\354\265\314\205tPF\0015 q\000~\000\003sr\000-N;\000$io.kafka.K\001\006\000R%\227\005B<I\320\251Y\032\341{#\002\000\001L\000\007kv\005\025\010t\000$nH\001\000K\t&\000;\025s\000\"Ns\000-P\r- j\000\275\271\035\243\3126\002!\353\010\010ke)\277\001\264\000\0022\303\001\005\022\025Y\000(jY\000\030Nullabl)\372\034E\333\0336>\220\247\007\005\307]\022.O\000\001\014,\006sq\000~\000\016q\000~\000\020"
>
>
>
coders: <
key: "UVKKACkTQEVarIntCoder"
value: <
spec: <
urn: "beam:coders:javasdk:0.1"
payload: "\202SNAPPY\000\000\000\000\001\000\000\000\001\000\000\000\210\330\001\350\254\355\000\005sr\000&org.apache.beam.sdk.coders.VarIntCoder\300K2\332\251KVh\002\000\000xrr5\000\024Atomic\0055 \307\354\265\314\205tPF\002\0055\000*jj\000$Structured\0059\034s\277\022\016\325\3246\021\t9\000 j9\000\005/0C\335\325\211\256\274~\370\002\000\000xp"
>
>
>
coders: <
key: "UVKKACkTQEVoidCoder"
value: <
spec: <
urn: "beam:coders:javasdk:0.1"
payload: "\202SNAPPY\000\000\000\000\001\000\000\000\001\000\000\000\210\326\001\350\254\355\000\005sr\000$org.apache.beam.sdk.coders.VoidCoder\271\277U\233\350\r\257U\002\000\000xr\000&j3\000\024Atomic\0055 \307\354\265\314\205tPF\002\0055\000*j5\000$Structured\0059\034s\277\022\016\325\3246\021\t9\000 j9\000\005/0C\335\325\211\256\274~\370\002\000\000xp"
>
>
>
coders: <
key: "c0"
value: <
spec: <
urn: "beam:coder:bytes:v1"
>
>
>
coders: <
key: "c1"
value: <
spec: <
urn: "beam:coder:global_window:v1"
>
>
>
coders: <
key: "c2"
value: <
spec: <
urn: "beam:go:coder:custom:v1"
payload: "Cgd2YXJpbnR6EgIIAhpdCklnaXRodWIuY29tL2FwYWNoZS9iZWFtL3Nka3MvdjIvZ28vcGtnL2JlYW0vY29yZS9ydW50aW1lL2NvZGVyeC5lbmNWYXJJbnRaEhAIFiIECBlADyoGCBQSAggIImkKSWdpdGh1Yi5jb20vYXBhY2hlL2JlYW0vc2Rrcy92Mi9nby9wa2cvYmVhbS9jb3JlL3J1bnRpbWUvY29kZXJ4LmRlY1ZhckludFoSHAgWIgQIGUADIgYIFBICCAgqBAgZQA8qBAgZQAE="
>
>
>
coders: <
key: "c3"
value: <
spec: <
urn: "beam:coder:length_prefix:v1"
>
component_coder_ids: "c2"
>
>
coders: <
key: "c4"
value: <
spec: <
urn: "beam:coder:kv:v1"
>
component_coder_ids: "c0"
component_coder_ids: "c0"
>
>
environments: <
key: "UVKKACkTQEbeam:env:docker:v1"
value: <
urn: "beam:env:docker:v1"
payload: "\n apache/beam_java8_sdk:2.42.0.dev"
capabilities: "beam:coder:bytes:v1"
capabilities: "beam:coder:bool:v1"
capabilities: "beam:coder:varint:v1"
capabilities: "beam:coder:string_utf8:v1"
capabilities: "beam:coder:iterable:v1"
capabilities: "beam:coder:timer:v1"
capabilities: "beam:coder:kv:v1"
capabilities: "beam:coder:length_prefix:v1"
capabilities: "beam:coder:global_window:v1"
capabilities: "beam:coder:interval_window:v1"
capabilities: "beam:coder:custom_window:v1"
capabilities: "beam:coder:windowed_value:v1"
capabilities: "beam:coder:double:v1"
capabilities: "beam:coder:row:v1"
capabilities: "beam:coder:param_windowed_value:v1"
capabilities: "beam:coder:state_backed_iterable:v1"
capabilities: "beam:coder:sharded_key:v1"
capabilities: "beam:coder:nullable:v1"
capabilities: "beam:protocol:multi_core_bundle_processing:v1"
capabilities: "beam:protocol:progress_reporting:v1"
capabilities: "beam:protocol:harness_monitoring_infos:v1"
capabilities: "beam:protocol:control_request_elements_embedding:v1"
capabilities: "beam:protocol:state_caching:v1"
capabilities: "beam:version:sdk_base:apache/beam_java8_sdk:2.42.0.dev"
capabilities: "beam:transform:sdf_truncate_sized_restrictions:v1"
capabilities: "beam:transform:to_string:v1"
dependencies: <
type_urn: "beam:artifact:type:file:v1"
type_payload: "\nL/tmp/artifacts/icedtea-sound-CGRxIE9edPHnbxQhM-L5mp8h21H-ySB79uQtSquPV_Q.jar\022@086471204f5e74f1e76f142133e2f99a9f21db51fec9207bf6e42d4aab8f57f4"
role_urn: "beam:artifact:role:staging_to:v1"
role_payload: "\n=icedtea-sound-CGRxIE9edPHnbxQhM-L5mp8h21H-ySB79uQtSquPV_Q.jar"
>
dependencies: <
type_urn: "beam:artifact:type:file:v1"
type_payload: "\nF/tmp/artifacts/jaccess-FBI0Bb27lF3oEBieWAi7SP8X1zBR8k4BJQOVpsoK9a0.jar\022@14123405bdbb945de810189e5808bb48ff17d73051f24e01250395a6ca0af5ad"
role_urn: "beam:artifact:role:staging_to:v1"
role_payload: "\n7jaccess-FBI0Bb27lF3oEBieWAi7SP8X1zBR8k4BJQOVpsoK9a0.jar"
>
dependencies: <
type_urn: "beam:artifact:type:file:v1"
type_payload: "\nI/tmp/artifacts/localedata-kJ2mc8rBH5-IklhfR1XzNotlIQ_mnVMA-pgaXv2r8Ag.jar\022@909da673cac11f9f8892585f4755f3368b65210fe69d5300fa981a5efdabf008"
role_urn: "beam:artifact:role:staging_to:v1"
role_payload: "\n:localedata-kJ2mc8rBH5-IklhfR1XzNotlIQ_mnVMA-pgaXv2r8Ag.jar"
>
dependencies: <
type_urn: "beam:artifact:type:file:v1"
type_payload: "\nF/tmp/artifacts/nashorn-B0CAb3QpJET_6VsT3hcC_89VtvhV616H8N2bHAIaqWo.jar\022@0740806f74292444ffe95b13de1702ffcf55b6f855eb5e87f0dd9b1c021aa96a"
role_urn: "beam:artifact:role:staging_to:v1"
role_payload: "\n7nashorn-B0CAb3QpJET_6VsT3hcC_89VtvhV616H8N2bHAIaqWo.jar"
>
dependencies: <
type_urn: "beam:artifact:type:file:v1"
type_payload: "\nG/tmp/artifacts/cldrdata-gclqV9lOGqQOKesG-a6TAUTGEYlyIDqpyd4M_k7gtWo.jar\022@81c96a57d94e1aa40e29eb06f9ae930144c6118972203aa9c9de0cfe4ee0b56a"
role_urn: "beam:artifact:role:staging_to:v1"
role_payload: "\n8cldrdata-gclqV9lOGqQOKesG-a6TAUTGEYlyIDqpyd4M_k7gtWo.jar"
>
dependencies: <
type_urn: "beam:artifact:type:file:v1"
type_payload: "\nD/tmp/artifacts/dnsns-byzoQxdXengTvA5IlbH9gSIzfhNQElRYltuMJN0vjcc.jar\022@6f2ce84317577a7813bc0e4895b1fd8122337e135012545896db8c24dd2f8dc7"
role_urn: "beam:artifact:role:staging_to:v1"
role_payload: "\n5dnsns-byzoQxdXengTvA5IlbH9gSIzfhNQElRYltuMJN0vjcc.jar"
>
dependencies: <
type_urn: "beam:artifact:type:file:v1"
type_payload: "\nr/tmp/artifacts/beam-sdks-java-io-expansion-service-2.42.0-SNAPSHOT-Nc2I3ZhyT7-oyDTgQHRgxjZOKatpiGcPr_Q6tpt-fkg.jar\022@35cd88dd98724fbfa8c834e0407460c6364e29ab6988670faff43ab69b7e7e48"
role_urn: "beam:artifact:role:staging_to:v1"
role_payload: "\ncbeam-sdks-java-io-expansion-service-2.42.0-SNAPSHOT-Nc2I3ZhyT7-oyDTgQHRgxjZOKatpiGcPr_Q6tpt-fkg.jar"
>
>
>
environments: <
key: "go"
value: <
urn: "beam:env:docker:v1"
payload: "\n\026apache/beam_go_sdk:dev"
capabilities: "beam:protocol:progress_reporting:v1"
capabilities: "beam:protocol:multi_core_bundle_processing:v1"
capabilities: "beam:transform:sdf_truncate_sized_restrictions:v1"
capabilities: "beam:protocol:worker_status:v1"
capabilities: "beam:protocol:monitoring_info_short_ids:v1"
capabilities: "beam:version:sdk_base:go"
capabilities: "beam:coder:bytes:v1"
capabilities: "beam:coder:bool:v1"
capabilities: "beam:coder:varint:v1"
capabilities: "beam:coder:double:v1"
capabilities: "beam:coder:string_utf8:v1"
capabilities: "beam:coder:length_prefix:v1"
capabilities: "beam:coder:kv:v1"
capabilities: "beam:coder:iterable:v1"
capabilities: "beam:coder:state_backed_iterable:v1"
capabilities: "beam:coder:windowed_value:v1"
capabilities: "beam:coder:global_window:v1"
capabilities: "beam:coder:interval_window:v1"
capabilities: "beam:coder:row:v1"
capabilities: "beam:coder:nullable:v1"
dependencies: <
type_urn: "beam:artifact:type:file:v1"
role_urn: "beam:artifact:role:go_worker_binary:v1"
>
>
>
>
root_transform_ids: "e4"
root_transform_ids: "e5"
root_transform_ids: "s1"
root_transform_ids: "s3"
requirements: "beam:requirement:pardo:splittable_dofn:v1"
2022/08/15 14:37:15 Cross-compiling <https://ci-beam.apache.org/job/beam_PostCommit_XVR_Spark3/ws/src/sdks/go/test/integration/io/xlang/kafka/kafka_test.go> as /tmp/worker-2-1660574235003784663
2022/08/15 14:37:16 Prepared job with id: go-testkafkaio_basicreadwrite-621_818354fe-a4bc-4ba4-8166-fd552be65d53 and staging token: go-testkafkaio_basicreadwrite-621_818354fe-a4bc-4ba4-8166-fd552be65d53
2022/08/15 14:37:16 Staged binary artifact with token:
2022/08/15 14:37:16 Submitted job: go0testkafkaio0basicreadwrite0621-jenkins-0815143716-3428c73b_92ec0b08-a3ba-4be1-8722-15a7a1b47e9a
2022/08/15 14:37:16 Job state: STOPPED
2022/08/15 14:37:16 Job state: STARTING
2022/08/15 14:37:16 Job state: RUNNING
2022/08/15 14:37:40 Job state: DONE
2022/08/15 14:37:40 Warning: 6 errors during metrics processing: [failed to deduce Step from MonitoringInfo: urn:"beam:metric:element_count:v1" type:"beam:metrics:sum_int64:v1" payload:"\x01" labels:{key:"PCOLLECTION" value:"UVKKACkTQEExternal/KafkaIO.Read/KafkaIO.Read.ReadFromKafkaViaUnbounded/Read(KafkaUnboundedSource)/Create/Read(CreateSource)/ParDo(OutputSingleSource)/ParMultiDo(OutputSingleSource).output/SplitAndSize0"} failed to deduce Step from MonitoringInfo: urn:"beam:metric:sampled_byte_size:v1" type:"beam:metrics:distribution_int64:v1" payload:"\x01\xfd\"\xfd\"\xfd\"" labels:{key:"PCOLLECTION" value:"UVKKACkTQEExternal/KafkaIO.Read/KafkaIO.Read.ReadFromKafkaViaUnbounded/Read(KafkaUnboundedSource)/Create/Read(CreateSource)/ParDo(OutputSingleSource)/ParMultiDo(OutputSingleSource).output/SplitAndSize0"} failed to deduce Step from MonitoringInfo: urn:"beam:metric:element_count:v1" type:"beam:metrics:sum_int64:v1" payload:"\x01" labels:{key:"PCOLLECTION" value:"UVKKACkTQEExternal/KafkaIO.Read/KafkaIO.Read.ReadFromKafkaViaUnbounded/Read(KafkaUnboundedSource)/Create/Read(CreateSource)/ParDo(OutputSingleSource)/ParMultiDo(OutputSingleSource).output/PairWithRestriction0"} failed to deduce Step from MonitoringInfo: urn:"beam:metric:element_count:v1" type:"beam:metrics:sum_int64:v1" payload:"\x01" labels:{key:"PCOLLECTION" value:"UVKKACkTQEExternal/KafkaIO.Read/KafkaIO.Read.ReadFromKafkaViaUnbounded/Read(KafkaUnboundedSource)/Create/Read(CreateSource)/ParDo(OutputSingleSource)/ParMultiDo(OutputSingleSource).output/SplitAndSize0"} failed to deduce Step from MonitoringInfo: urn:"beam:metric:sampled_byte_size:v1" type:"beam:metrics:distribution_int64:v1" payload:"\x01\xf8\"\xf8\"\xf8\"" labels:{key:"PCOLLECTION" value:"UVKKACkTQEExternal/KafkaIO.Read/KafkaIO.Read.ReadFromKafkaViaUnbounded/Read(KafkaUnboundedSource)/Create/Read(CreateSource)/ParDo(OutputSingleSource)/ParMultiDo(OutputSingleSource).output/SplitAndSize0"} failed to deduce Step from MonitoringInfo: urn:"beam:metric:sampled_byte_size:v1" type:"beam:metrics:distribution_int64:v1" payload:"\x01\xf0\"\xf0\"\xf0\"" labels:{key:"PCOLLECTION" value:"UVKKACkTQEExternal/KafkaIO.Read/KafkaIO.Read.ReadFromKafkaViaUnbounded/Read(KafkaUnboundedSource)/Create/Read(CreateSource)/ParDo(OutputSingleSource)/ParMultiDo(OutputSingleSource).output/PairWithRestriction0"}]
--- PASS: TestKafkaIO_BasicReadWrite (38.37s)
PASS
ok github.com/apache/beam/sdks/v2/go/test/integration/io/xlang/kafka 44.399s
> Task :runners:spark:3:job-server:validatesCrossLanguageRunnerJavaUsingPython
org.apache.beam.runners.core.construction.ValidateRunnerXlangTest$SingleInputOutputTest > test FAILED
java.lang.RuntimeException at ValidateRunnerXlangTest.java:242
java.lang.NullPointerException at Preconditions.java:980
14 tests completed, 1 failed
> Task :runners:spark:3:job-server:validatesCrossLanguageRunnerJavaUsingPython FAILED
> Task :runners:spark:3:job-server:validatesCrossLanguageRunnerPythonUsingJava
> Task :runners:spark:3:job-server:validatesCrossLanguageRunnerPythonUsingSql
> Task :runners:spark:3:job-server:validatesCrossLanguageRunnerCleanup
> Task :runners:spark:3:job-server:sparkJobServerCleanup
FAILURE: Build failed with an exception.
* What went wrong:
Execution failed for task ':runners:spark:3:job-server:validatesCrossLanguageRunnerJavaUsingPython'.
> There were failing tests. See the report at: file://<https://ci-beam.apache.org/job/beam_PostCommit_XVR_Spark3/ws/src/runners/spark/3/job-server/build/reports/tests/validatesCrossLanguageRunnerJavaUsingPython/index.html>
* Try:
> Run with --stacktrace option to get the stack trace.
> Run with --info or --debug option to get more log output.
> Run with --scan to get full insights.
* Get more help at https://help.gradle.org
Deprecated Gradle features were used in this build, making it incompatible with Gradle 8.0.
You can use '--warning-mode all' to show the individual deprecation warnings and determine if they come from your own scripts or plugins.
See https://docs.gradle.org/7.4/userguide/command_line_interface.html#sec:command_line_warnings
Execution optimizations have been disabled for 1 invalid unit(s) of work during this build to ensure correctness.
Please consult deprecation warnings for more details.
BUILD FAILED in 33m 25s
263 actionable tasks: 173 executed, 78 from cache, 12 up-to-date
Publishing build scan...
https://gradle.com/s/3hfpwbsgll7wc
Build step 'Invoke Gradle script' changed build result to FAILURE
Build step 'Invoke Gradle script' marked build as failure
---------------------------------------------------------------------
To unsubscribe, e-mail: builds-unsubscribe@beam.apache.org
For additional commands, e-mail: builds-help@beam.apache.org
Build failed in Jenkins: beam_PostCommit_XVR_Spark3 #2013
Posted by Apache Jenkins Server <je...@builds.apache.org>.
See <https://ci-beam.apache.org/job/beam_PostCommit_XVR_Spark3/2013/display/redirect>
Changes:
------------------------------------------
[...truncated 1.02 MB...]
coders: <
key: "AvdSDagGiTTimestampedValueCoder"
value: <
spec: <
urn: "beam:coders:javasdk:0.1"
payload: "\202SNAPPY\000\000\000\000\001\000\000\000\001\000\000\001?\315\003\270\254\355\000\005sr\000Aorg.apache.beam.sdk.values.TimestampedV\001\022\000$>\021\000LCoder\364\376\202p\274iX-\002\000\001L\000\nv\001)\005\030\034t\000\"Lorg/\t]\000/\001],/sdk/coders/\005$\020;xr\000*N\202\000\t%(.Structured\005/8s\277\022\016\325\3246\021\002\000\000xr\000 j9\000\005/\034C\335\325\211\256\274~\370\001/\020psr\000,j1\000(Serializabl\t\277\034\010\364 \216\305ynl\005\327\\\004typet\000\021Ljava/lang/Class\001\300\000&jV\000\024Custom\005\215Pj\260\010\235\013;\035\013\002\000\000xq\000~\000\003vr\000;N;\000Pio.BoundedReadFromUnb\t\021`Source$Shardd\236\240U\205\000j\363\002\000\000xp"
>
>
>
coders: <
key: "AvdSDagGiTValueWithRecordIdCoder"
value: <
spec: <
urn: "beam:coders:javasdk:0.1"
payload: "\202SNAPPY\000\000\000\000\001\000\000\000\001\000\000\001\213\311\005\320\254\355\000\005sr\000Corg.apache.beam.sdk.values.ValueWithRecordId$B\022\000LCoder{\343\376bQ\014\204>\002\000\002L\000\007i\t\025\034t\000+Lorg/\t\\\000/\001\\\024/sdk/c\0012(s/ByteArray\005B\014;L\000\n\005u\005\016\010t\000\"n;\000\005$\020;xr\000*N\274\000\t`(.Structured\005/8s\277\022\016\325\3246\021\002\000\000xr\000 j9\000\005/\034C\335\325\211\256\274~\370\001/\020psr\000)j1\0006\312\000\034\351\277\005|\263\3746\333\001:\010r\000&j8\000\024Atomic\005o\034\307\354\265\314\205tPF\0015 q\000~\000\003sr\000-N;\000$io.kafka.K\001\006\000R%\227\005B<I\320\251Y\032\341{#\002\000\001L\000\007kv\005\025\010t\000$nH\001\000K\t&\000;\025s\000\"Ns\000-P\r- j\000\275\271\035\243\3126\002!\353\010\010ke)\277\001\264\000\0022\303\001\005\022\025Y\000(jY\000\030Nullabl)\372\034E\333\0336>\220\247\007\005\307]\022.O\000\001\014,\006sq\000~\000\016q\000~\000\020"
>
>
>
coders: <
key: "AvdSDagGiTVarIntCoder"
value: <
spec: <
urn: "beam:coders:javasdk:0.1"
payload: "\202SNAPPY\000\000\000\000\001\000\000\000\001\000\000\000\210\330\001\350\254\355\000\005sr\000&org.apache.beam.sdk.coders.VarIntCoder\300K2\332\251KVh\002\000\000xrr5\000\024Atomic\0055 \307\354\265\314\205tPF\002\0055\000*jj\000$Structured\0059\034s\277\022\016\325\3246\021\t9\000 j9\000\005/0C\335\325\211\256\274~\370\002\000\000xp"
>
>
>
coders: <
key: "AvdSDagGiTVoidCoder"
value: <
spec: <
urn: "beam:coders:javasdk:0.1"
payload: "\202SNAPPY\000\000\000\000\001\000\000\000\001\000\000\000\210\326\001\350\254\355\000\005sr\000$org.apache.beam.sdk.coders.VoidCoder\271\277U\233\350\r\257U\002\000\000xr\000&j3\000\024Atomic\0055 \307\354\265\314\205tPF\002\0055\000*j5\000$Structured\0059\034s\277\022\016\325\3246\021\t9\000 j9\000\005/0C\335\325\211\256\274~\370\002\000\000xp"
>
>
>
coders: <
key: "c0"
value: <
spec: <
urn: "beam:coder:bytes:v1"
>
>
>
coders: <
key: "c1"
value: <
spec: <
urn: "beam:coder:global_window:v1"
>
>
>
coders: <
key: "c2"
value: <
spec: <
urn: "beam:go:coder:custom:v1"
payload: "Cgd2YXJpbnR6EgIIAhpdCklnaXRodWIuY29tL2FwYWNoZS9iZWFtL3Nka3MvdjIvZ28vcGtnL2JlYW0vY29yZS9ydW50aW1lL2NvZGVyeC5lbmNWYXJJbnRaEhAIFiIECBlADyoGCBQSAggIImkKSWdpdGh1Yi5jb20vYXBhY2hlL2JlYW0vc2Rrcy92Mi9nby9wa2cvYmVhbS9jb3JlL3J1bnRpbWUvY29kZXJ4LmRlY1ZhckludFoSHAgWIgQIGUADIgYIFBICCAgqBAgZQA8qBAgZQAE="
>
>
>
coders: <
key: "c3"
value: <
spec: <
urn: "beam:coder:length_prefix:v1"
>
component_coder_ids: "c2"
>
>
coders: <
key: "c4"
value: <
spec: <
urn: "beam:coder:kv:v1"
>
component_coder_ids: "c0"
component_coder_ids: "c0"
>
>
environments: <
key: "AvdSDagGiTbeam:env:docker:v1"
value: <
urn: "beam:env:docker:v1"
payload: "\n apache/beam_java8_sdk:2.42.0.dev"
capabilities: "beam:coder:bytes:v1"
capabilities: "beam:coder:bool:v1"
capabilities: "beam:coder:varint:v1"
capabilities: "beam:coder:string_utf8:v1"
capabilities: "beam:coder:iterable:v1"
capabilities: "beam:coder:timer:v1"
capabilities: "beam:coder:kv:v1"
capabilities: "beam:coder:length_prefix:v1"
capabilities: "beam:coder:global_window:v1"
capabilities: "beam:coder:interval_window:v1"
capabilities: "beam:coder:custom_window:v1"
capabilities: "beam:coder:windowed_value:v1"
capabilities: "beam:coder:double:v1"
capabilities: "beam:coder:row:v1"
capabilities: "beam:coder:param_windowed_value:v1"
capabilities: "beam:coder:state_backed_iterable:v1"
capabilities: "beam:coder:sharded_key:v1"
capabilities: "beam:coder:nullable:v1"
capabilities: "beam:protocol:multi_core_bundle_processing:v1"
capabilities: "beam:protocol:progress_reporting:v1"
capabilities: "beam:protocol:harness_monitoring_infos:v1"
capabilities: "beam:protocol:control_request_elements_embedding:v1"
capabilities: "beam:protocol:state_caching:v1"
capabilities: "beam:version:sdk_base:apache/beam_java8_sdk:2.42.0.dev"
capabilities: "beam:transform:sdf_truncate_sized_restrictions:v1"
capabilities: "beam:transform:to_string:v1"
dependencies: <
type_urn: "beam:artifact:type:file:v1"
type_payload: "\nL/tmp/artifacts/icedtea-sound-CGRxIE9edPHnbxQhM-L5mp8h21H-ySB79uQtSquPV_Q.jar\022@086471204f5e74f1e76f142133e2f99a9f21db51fec9207bf6e42d4aab8f57f4"
role_urn: "beam:artifact:role:staging_to:v1"
role_payload: "\n=icedtea-sound-CGRxIE9edPHnbxQhM-L5mp8h21H-ySB79uQtSquPV_Q.jar"
>
dependencies: <
type_urn: "beam:artifact:type:file:v1"
type_payload: "\nF/tmp/artifacts/jaccess-FBI0Bb27lF3oEBieWAi7SP8X1zBR8k4BJQOVpsoK9a0.jar\022@14123405bdbb945de810189e5808bb48ff17d73051f24e01250395a6ca0af5ad"
role_urn: "beam:artifact:role:staging_to:v1"
role_payload: "\n7jaccess-FBI0Bb27lF3oEBieWAi7SP8X1zBR8k4BJQOVpsoK9a0.jar"
>
dependencies: <
type_urn: "beam:artifact:type:file:v1"
type_payload: "\nI/tmp/artifacts/localedata-kJ2mc8rBH5-IklhfR1XzNotlIQ_mnVMA-pgaXv2r8Ag.jar\022@909da673cac11f9f8892585f4755f3368b65210fe69d5300fa981a5efdabf008"
role_urn: "beam:artifact:role:staging_to:v1"
role_payload: "\n:localedata-kJ2mc8rBH5-IklhfR1XzNotlIQ_mnVMA-pgaXv2r8Ag.jar"
>
dependencies: <
type_urn: "beam:artifact:type:file:v1"
type_payload: "\nF/tmp/artifacts/nashorn-B0CAb3QpJET_6VsT3hcC_89VtvhV616H8N2bHAIaqWo.jar\022@0740806f74292444ffe95b13de1702ffcf55b6f855eb5e87f0dd9b1c021aa96a"
role_urn: "beam:artifact:role:staging_to:v1"
role_payload: "\n7nashorn-B0CAb3QpJET_6VsT3hcC_89VtvhV616H8N2bHAIaqWo.jar"
>
dependencies: <
type_urn: "beam:artifact:type:file:v1"
type_payload: "\nG/tmp/artifacts/cldrdata-gclqV9lOGqQOKesG-a6TAUTGEYlyIDqpyd4M_k7gtWo.jar\022@81c96a57d94e1aa40e29eb06f9ae930144c6118972203aa9c9de0cfe4ee0b56a"
role_urn: "beam:artifact:role:staging_to:v1"
role_payload: "\n8cldrdata-gclqV9lOGqQOKesG-a6TAUTGEYlyIDqpyd4M_k7gtWo.jar"
>
dependencies: <
type_urn: "beam:artifact:type:file:v1"
type_payload: "\nD/tmp/artifacts/dnsns-byzoQxdXengTvA5IlbH9gSIzfhNQElRYltuMJN0vjcc.jar\022@6f2ce84317577a7813bc0e4895b1fd8122337e135012545896db8c24dd2f8dc7"
role_urn: "beam:artifact:role:staging_to:v1"
role_payload: "\n5dnsns-byzoQxdXengTvA5IlbH9gSIzfhNQElRYltuMJN0vjcc.jar"
>
dependencies: <
type_urn: "beam:artifact:type:file:v1"
type_payload: "\nr/tmp/artifacts/beam-sdks-java-io-expansion-service-2.42.0-SNAPSHOT-Nc2I3ZhyT7-oyDTgQHRgxjZOKatpiGcPr_Q6tpt-fkg.jar\022@35cd88dd98724fbfa8c834e0407460c6364e29ab6988670faff43ab69b7e7e48"
role_urn: "beam:artifact:role:staging_to:v1"
role_payload: "\ncbeam-sdks-java-io-expansion-service-2.42.0-SNAPSHOT-Nc2I3ZhyT7-oyDTgQHRgxjZOKatpiGcPr_Q6tpt-fkg.jar"
>
>
>
environments: <
key: "go"
value: <
urn: "beam:env:docker:v1"
payload: "\n\026apache/beam_go_sdk:dev"
capabilities: "beam:protocol:progress_reporting:v1"
capabilities: "beam:protocol:multi_core_bundle_processing:v1"
capabilities: "beam:transform:sdf_truncate_sized_restrictions:v1"
capabilities: "beam:protocol:worker_status:v1"
capabilities: "beam:protocol:monitoring_info_short_ids:v1"
capabilities: "beam:version:sdk_base:go"
capabilities: "beam:coder:bytes:v1"
capabilities: "beam:coder:bool:v1"
capabilities: "beam:coder:varint:v1"
capabilities: "beam:coder:double:v1"
capabilities: "beam:coder:string_utf8:v1"
capabilities: "beam:coder:length_prefix:v1"
capabilities: "beam:coder:kv:v1"
capabilities: "beam:coder:iterable:v1"
capabilities: "beam:coder:state_backed_iterable:v1"
capabilities: "beam:coder:windowed_value:v1"
capabilities: "beam:coder:global_window:v1"
capabilities: "beam:coder:interval_window:v1"
capabilities: "beam:coder:row:v1"
capabilities: "beam:coder:nullable:v1"
dependencies: <
type_urn: "beam:artifact:type:file:v1"
role_urn: "beam:artifact:role:go_worker_binary:v1"
>
>
>
>
root_transform_ids: "s1"
root_transform_ids: "e4"
root_transform_ids: "e5"
root_transform_ids: "s3"
requirements: "beam:requirement:pardo:splittable_dofn:v1"
2022/08/15 08:36:55 Cross-compiling <https://ci-beam.apache.org/job/beam_PostCommit_XVR_Spark3/ws/src/sdks/go/test/integration/io/xlang/kafka/kafka_test.go> as /tmp/worker-2-1660552615424896158
2022/08/15 08:36:57 Prepared job with id: go-testkafkaio_basicreadwrite-777_cdc38eff-ea21-44ab-ba8c-96b666d03d87 and staging token: go-testkafkaio_basicreadwrite-777_cdc38eff-ea21-44ab-ba8c-96b666d03d87
2022/08/15 08:36:57 Staged binary artifact with token:
2022/08/15 08:36:57 Submitted job: go0testkafkaio0basicreadwrite0777-jenkins-0815083657-e1bb5032_7e7ea7dd-04c0-4dbe-acb5-50d8d63468f5
2022/08/15 08:36:57 Job state: STOPPED
2022/08/15 08:36:57 Job state: STARTING
2022/08/15 08:36:57 Job state: RUNNING
2022/08/15 08:37:19 Job state: DONE
2022/08/15 08:37:19 Warning: 6 errors during metrics processing: [failed to deduce Step from MonitoringInfo: urn:"beam:metric:element_count:v1" type:"beam:metrics:sum_int64:v1" payload:"\x01" labels:{key:"PCOLLECTION" value:"AvdSDagGiTExternal/KafkaIO.Read/KafkaIO.Read.ReadFromKafkaViaUnbounded/Read(KafkaUnboundedSource)/Create/Read(CreateSource)/ParDo(OutputSingleSource)/ParMultiDo(OutputSingleSource).output/PairWithRestriction0"} failed to deduce Step from MonitoringInfo: urn:"beam:metric:element_count:v1" type:"beam:metrics:sum_int64:v1" payload:"\x01" labels:{key:"PCOLLECTION" value:"AvdSDagGiTExternal/KafkaIO.Read/KafkaIO.Read.ReadFromKafkaViaUnbounded/Read(KafkaUnboundedSource)/Create/Read(CreateSource)/ParDo(OutputSingleSource)/ParMultiDo(OutputSingleSource).output/SplitAndSize0"} failed to deduce Step from MonitoringInfo: urn:"beam:metric:sampled_byte_size:v1" type:"beam:metrics:distribution_int64:v1" payload:"\x01\xf0\"\xf0\"\xf0\"" labels:{key:"PCOLLECTION" value:"AvdSDagGiTExternal/KafkaIO.Read/KafkaIO.Read.ReadFromKafkaViaUnbounded/Read(KafkaUnboundedSource)/Create/Read(CreateSource)/ParDo(OutputSingleSource)/ParMultiDo(OutputSingleSource).output/PairWithRestriction0"} failed to deduce Step from MonitoringInfo: urn:"beam:metric:sampled_byte_size:v1" type:"beam:metrics:distribution_int64:v1" payload:"\x01\xf8\"\xf8\"\xf8\"" labels:{key:"PCOLLECTION" value:"AvdSDagGiTExternal/KafkaIO.Read/KafkaIO.Read.ReadFromKafkaViaUnbounded/Read(KafkaUnboundedSource)/Create/Read(CreateSource)/ParDo(OutputSingleSource)/ParMultiDo(OutputSingleSource).output/SplitAndSize0"} failed to deduce Step from MonitoringInfo: urn:"beam:metric:element_count:v1" type:"beam:metrics:sum_int64:v1" payload:"\x01" labels:{key:"PCOLLECTION" value:"AvdSDagGiTExternal/KafkaIO.Read/KafkaIO.Read.ReadFromKafkaViaUnbounded/Read(KafkaUnboundedSource)/Create/Read(CreateSource)/ParDo(OutputSingleSource)/ParMultiDo(OutputSingleSource).output/SplitAndSize0"} failed to deduce Step from MonitoringInfo: urn:"beam:metric:sampled_byte_size:v1" type:"beam:metrics:distribution_int64:v1" payload:"\x01\xfd\"\xfd\"\xfd\"" labels:{key:"PCOLLECTION" value:"AvdSDagGiTExternal/KafkaIO.Read/KafkaIO.Read.ReadFromKafkaViaUnbounded/Read(KafkaUnboundedSource)/Create/Read(CreateSource)/ParDo(OutputSingleSource)/ParMultiDo(OutputSingleSource).output/SplitAndSize0"}]
--- PASS: TestKafkaIO_BasicReadWrite (38.20s)
PASS
ok github.com/apache/beam/sdks/v2/go/test/integration/io/xlang/kafka 44.224s
> Task :runners:spark:3:job-server:validatesCrossLanguageRunnerJavaUsingPython
org.apache.beam.runners.core.construction.ValidateRunnerXlangTest$SingleInputOutputTest > test FAILED
java.lang.RuntimeException at ValidateRunnerXlangTest.java:242
java.lang.NullPointerException at Preconditions.java:980
14 tests completed, 1 failed
> Task :runners:spark:3:job-server:validatesCrossLanguageRunnerJavaUsingPython FAILED
> Task :runners:spark:3:job-server:validatesCrossLanguageRunnerPythonUsingJava
> Task :runners:spark:3:job-server:validatesCrossLanguageRunnerPythonUsingSql
> Task :runners:spark:3:job-server:validatesCrossLanguageRunnerCleanup
> Task :runners:spark:3:job-server:sparkJobServerCleanup
FAILURE: Build failed with an exception.
* What went wrong:
Execution failed for task ':runners:spark:3:job-server:validatesCrossLanguageRunnerJavaUsingPython'.
> There were failing tests. See the report at: file://<https://ci-beam.apache.org/job/beam_PostCommit_XVR_Spark3/ws/src/runners/spark/3/job-server/build/reports/tests/validatesCrossLanguageRunnerJavaUsingPython/index.html>
* Try:
> Run with --stacktrace option to get the stack trace.
> Run with --info or --debug option to get more log output.
> Run with --scan to get full insights.
* Get more help at https://help.gradle.org
Deprecated Gradle features were used in this build, making it incompatible with Gradle 8.0.
You can use '--warning-mode all' to show the individual deprecation warnings and determine if they come from your own scripts or plugins.
See https://docs.gradle.org/7.4/userguide/command_line_interface.html#sec:command_line_warnings
Execution optimizations have been disabled for 1 invalid unit(s) of work during this build to ensure correctness.
Please consult deprecation warnings for more details.
BUILD FAILED in 32m 36s
263 actionable tasks: 173 executed, 78 from cache, 12 up-to-date
Publishing build scan...
https://gradle.com/s/fudzqfrwiigum
Build step 'Invoke Gradle script' changed build result to FAILURE
Build step 'Invoke Gradle script' marked build as failure
---------------------------------------------------------------------
To unsubscribe, e-mail: builds-unsubscribe@beam.apache.org
For additional commands, e-mail: builds-help@beam.apache.org
Build failed in Jenkins: beam_PostCommit_XVR_Spark3 #2012
Posted by Apache Jenkins Server <je...@builds.apache.org>.
See <https://ci-beam.apache.org/job/beam_PostCommit_XVR_Spark3/2012/display/redirect>
Changes:
------------------------------------------
[...truncated 617.82 KB...]
spec: <
urn: "beam:coder:kv:v1"
>
component_coder_ids: "essQvpcQpRVarIntCoder"
component_coder_ids: "essQvpcQpRTimestampedValueCoder"
>
>
coders: <
key: "essQvpcQpRKvCoder4"
value: <
spec: <
urn: "beam:coder:kv:v1"
>
component_coder_ids: "essQvpcQpRVarIntCoder"
component_coder_ids: "essQvpcQpRIterableCoder"
>
>
coders: <
key: "essQvpcQpRNullableCoder"
value: <
spec: <
urn: "beam:coder:nullable:v1"
>
component_coder_ids: "essQvpcQpRByteArrayCoder"
>
>
coders: <
key: "essQvpcQpRSerializableCoder"
value: <
spec: <
urn: "beam:coders:javasdk:0.1"
payload: "\202SNAPPY\000\000\000\000\001\000\000\000\001\000\000\000\312\214\002\360^\254\355\000\005sr\000,org.apache.beam.sdk.coders.SerializableCoder\010\364 \216\305ynl\002\000\001L\000\004typet\000\021Ljava/lang/Class;xr\000&ofV\000\024Custom\005P8j\260\010\235\013;\035\013\002\000\000xr\000 j\213\000\005/\034C\335\325\211\256\274~\370\001/\020pvr\000;N1\000Pio.BoundedReadFromUnb\t\021`Source$Shardd\236\240U\205\000j\363\002\000\000xp"
>
>
>
coders: <
key: "essQvpcQpRSnappyCoder"
value: <
spec: <
urn: "beam:coders:javasdk:0.1"
payload: "\202SNAPPY\000\000\000\000\001\000\000\000\001\000\000\001.\307\003\360@\254\355\000\005sr\000&org.apache.beam.sdk.coders.SnappyCoder1\033\243\356\177\362\366,\002\000\001L\000\ninner\005\030 t\000\"Lorg/a\005B\000/\001B\020/sdk/\tB\000/\005$\020;xr\000*ng\000 tructured\005/8s\277\022\016\325\3246\021\002\000\000xr\000 j9\000\005/\034C\335\325\211\256\274~\370\001/\020psr\000,j1\000,Serializable\005= \010\364 \216\305ynl\002\001\327\\\004typet\000\021Ljava/lang/Class\001\300n'\001\024Custom\005PPj\260\010\235\013;\035\013\002\000\000xq\000~\000\003vr\000$N\221\000\\io.BoundedSource!`v\023\177\370QA\0019\010r\000\035Z3\000\t,0\020\213\372\020Y\214\347\323\002\000\000xp"
>
>
>
coders: <
key: "essQvpcQpRTimestampedValueCoder"
value: <
spec: <
urn: "beam:coders:javasdk:0.1"
payload: "\202SNAPPY\000\000\000\000\001\000\000\000\001\000\000\001?\315\003\270\254\355\000\005sr\000Aorg.apache.beam.sdk.values.TimestampedV\001\022\000$>\021\000LCoder\364\376\202p\274iX-\002\000\001L\000\nv\001)\005\030\034t\000\"Lorg/\t]\000/\001],/sdk/coders/\005$\020;xr\000*N\202\000\t%(.Structured\005/8s\277\022\016\325\3246\021\002\000\000xr\000 j9\000\005/\034C\335\325\211\256\274~\370\001/\020psr\000,j1\000(Serializabl\t\277\034\010\364 \216\305ynl\005\327\\\004typet\000\021Ljava/lang/Class\001\300\000&jV\000\024Custom\005\215Pj\260\010\235\013;\035\013\002\000\000xq\000~\000\003vr\000;N;\000Pio.BoundedReadFromUnb\t\021`Source$Shardd\236\240U\205\000j\363\002\000\000xp"
>
>
>
coders: <
key: "essQvpcQpRValueWithRecordIdCoder"
value: <
spec: <
urn: "beam:coders:javasdk:0.1"
payload: "\202SNAPPY\000\000\000\000\001\000\000\000\001\000\000\001\213\311\005\320\254\355\000\005sr\000Corg.apache.beam.sdk.values.ValueWithRecordId$B\022\000LCoder{\343\376bQ\014\204>\002\000\002L\000\007i\t\025\034t\000+Lorg/\t\\\000/\001\\\024/sdk/c\0012(s/ByteArray\005B\014;L\000\n\005u\005\016\010t\000\"n;\000\005$\020;xr\000*N\274\000\t`(.Structured\005/8s\277\022\016\325\3246\021\002\000\000xr\000 j9\000\005/\034C\335\325\211\256\274~\370\001/\020psr\000)j1\0006\312\000\034\351\277\005|\263\3746\333\001:\010r\000&j8\000\024Atomic\005o\034\307\354\265\314\205tPF\0015 q\000~\000\003sr\000-N;\000$io.kafka.K\001\006\000R%\227\005B<I\320\251Y\032\341{#\002\000\001L\000\007kv\005\025\010t\000$nH\001\000K\t&\000;\025s\000\"Ns\000-P\r- j\000\275\271\035\243\3126\002!\353\010\010ke)\277\001\264\000\0022\303\001\005\022\025Y\000(jY\000\030Nullabl)\372\034E\333\0336>\220\247\007\005\307]\022.O\000\001\014,\006sq\000~\000\016q\000~\000\020"
>
>
>
coders: <
key: "essQvpcQpRVarIntCoder"
value: <
spec: <
urn: "beam:coders:javasdk:0.1"
payload: "\202SNAPPY\000\000\000\000\001\000\000\000\001\000\000\000\210\330\001\350\254\355\000\005sr\000&org.apache.beam.sdk.coders.VarIntCoder\300K2\332\251KVh\002\000\000xrr5\000\024Atomic\0055 \307\354\265\314\205tPF\002\0055\000*jj\000$Structured\0059\034s\277\022\016\325\3246\021\t9\000 j9\000\005/0C\335\325\211\256\274~\370\002\000\000xp"
>
>
>
coders: <
key: "essQvpcQpRVoidCoder"
value: <
spec: <
urn: "beam:coders:javasdk:0.1"
payload: "\202SNAPPY\000\000\000\000\001\000\000\000\001\000\000\000\210\326\001\350\254\355\000\005sr\000$org.apache.beam.sdk.coders.VoidCoder\271\277U\233\350\r\257U\002\000\000xr\000&j3\000\024Atomic\0055 \307\354\265\314\205tPF\002\0055\000*j5\000$Structured\0059\034s\277\022\016\325\3246\021\t9\000 j9\000\005/0C\335\325\211\256\274~\370\002\000\000xp"
>
>
>
environments: <
key: "essQvpcQpRbeam:env:docker:v1"
value: <
urn: "beam:env:docker:v1"
payload: "\n apache/beam_java8_sdk:2.42.0.dev"
capabilities: "beam:coder:bytes:v1"
capabilities: "beam:coder:bool:v1"
capabilities: "beam:coder:varint:v1"
capabilities: "beam:coder:string_utf8:v1"
capabilities: "beam:coder:iterable:v1"
capabilities: "beam:coder:timer:v1"
capabilities: "beam:coder:kv:v1"
capabilities: "beam:coder:length_prefix:v1"
capabilities: "beam:coder:global_window:v1"
capabilities: "beam:coder:interval_window:v1"
capabilities: "beam:coder:custom_window:v1"
capabilities: "beam:coder:windowed_value:v1"
capabilities: "beam:coder:double:v1"
capabilities: "beam:coder:row:v1"
capabilities: "beam:coder:param_windowed_value:v1"
capabilities: "beam:coder:state_backed_iterable:v1"
capabilities: "beam:coder:sharded_key:v1"
capabilities: "beam:coder:nullable:v1"
capabilities: "beam:protocol:multi_core_bundle_processing:v1"
capabilities: "beam:protocol:progress_reporting:v1"
capabilities: "beam:protocol:harness_monitoring_infos:v1"
capabilities: "beam:protocol:control_request_elements_embedding:v1"
capabilities: "beam:protocol:state_caching:v1"
capabilities: "beam:version:sdk_base:apache/beam_java8_sdk:2.42.0.dev"
capabilities: "beam:transform:sdf_truncate_sized_restrictions:v1"
capabilities: "beam:transform:to_string:v1"
dependencies: <
type_urn: "beam:artifact:type:file:v1"
type_payload: "\nL/tmp/artifacts/icedtea-sound-CGRxIE9edPHnbxQhM-L5mp8h21H-ySB79uQtSquPV_Q.jar\022@086471204f5e74f1e76f142133e2f99a9f21db51fec9207bf6e42d4aab8f57f4"
role_urn: "beam:artifact:role:staging_to:v1"
role_payload: "\n=icedtea-sound-CGRxIE9edPHnbxQhM-L5mp8h21H-ySB79uQtSquPV_Q.jar"
>
dependencies: <
type_urn: "beam:artifact:type:file:v1"
type_payload: "\nF/tmp/artifacts/jaccess-FBI0Bb27lF3oEBieWAi7SP8X1zBR8k4BJQOVpsoK9a0.jar\022@14123405bdbb945de810189e5808bb48ff17d73051f24e01250395a6ca0af5ad"
role_urn: "beam:artifact:role:staging_to:v1"
role_payload: "\n7jaccess-FBI0Bb27lF3oEBieWAi7SP8X1zBR8k4BJQOVpsoK9a0.jar"
>
dependencies: <
type_urn: "beam:artifact:type:file:v1"
type_payload: "\nI/tmp/artifacts/localedata-kJ2mc8rBH5-IklhfR1XzNotlIQ_mnVMA-pgaXv2r8Ag.jar\022@909da673cac11f9f8892585f4755f3368b65210fe69d5300fa981a5efdabf008"
role_urn: "beam:artifact:role:staging_to:v1"
role_payload: "\n:localedata-kJ2mc8rBH5-IklhfR1XzNotlIQ_mnVMA-pgaXv2r8Ag.jar"
>
dependencies: <
type_urn: "beam:artifact:type:file:v1"
type_payload: "\nF/tmp/artifacts/nashorn-B0CAb3QpJET_6VsT3hcC_89VtvhV616H8N2bHAIaqWo.jar\022@0740806f74292444ffe95b13de1702ffcf55b6f855eb5e87f0dd9b1c021aa96a"
role_urn: "beam:artifact:role:staging_to:v1"
role_payload: "\n7nashorn-B0CAb3QpJET_6VsT3hcC_89VtvhV616H8N2bHAIaqWo.jar"
>
dependencies: <
type_urn: "beam:artifact:type:file:v1"
type_payload: "\nG/tmp/artifacts/cldrdata-gclqV9lOGqQOKesG-a6TAUTGEYlyIDqpyd4M_k7gtWo.jar\022@81c96a57d94e1aa40e29eb06f9ae930144c6118972203aa9c9de0cfe4ee0b56a"
role_urn: "beam:artifact:role:staging_to:v1"
role_payload: "\n8cldrdata-gclqV9lOGqQOKesG-a6TAUTGEYlyIDqpyd4M_k7gtWo.jar"
>
dependencies: <
type_urn: "beam:artifact:type:file:v1"
type_payload: "\nD/tmp/artifacts/dnsns-byzoQxdXengTvA5IlbH9gSIzfhNQElRYltuMJN0vjcc.jar\022@6f2ce84317577a7813bc0e4895b1fd8122337e135012545896db8c24dd2f8dc7"
role_urn: "beam:artifact:role:staging_to:v1"
role_payload: "\n5dnsns-byzoQxdXengTvA5IlbH9gSIzfhNQElRYltuMJN0vjcc.jar"
>
dependencies: <
type_urn: "beam:artifact:type:file:v1"
type_payload: "\nr/tmp/artifacts/beam-sdks-java-io-expansion-service-2.42.0-SNAPSHOT-Nc2I3ZhyT7-oyDTgQHRgxjZOKatpiGcPr_Q6tpt-fkg.jar\022@35cd88dd98724fbfa8c834e0407460c6364e29ab6988670faff43ab69b7e7e48"
role_urn: "beam:artifact:role:staging_to:v1"
role_payload: "\ncbeam-sdks-java-io-expansion-service-2.42.0-SNAPSHOT-Nc2I3ZhyT7-oyDTgQHRgxjZOKatpiGcPr_Q6tpt-fkg.jar"
>
>
>
environments: <
key: "go"
value: <
urn: "beam:env:docker:v1"
payload: "\n\026apache/beam_go_sdk:dev"
capabilities: "beam:protocol:progress_reporting:v1"
capabilities: "beam:protocol:multi_core_bundle_processing:v1"
capabilities: "beam:transform:sdf_truncate_sized_restrictions:v1"
capabilities: "beam:protocol:worker_status:v1"
capabilities: "beam:protocol:monitoring_info_short_ids:v1"
capabilities: "beam:version:sdk_base:go"
capabilities: "beam:coder:bytes:v1"
capabilities: "beam:coder:bool:v1"
capabilities: "beam:coder:varint:v1"
capabilities: "beam:coder:double:v1"
capabilities: "beam:coder:string_utf8:v1"
capabilities: "beam:coder:length_prefix:v1"
capabilities: "beam:coder:kv:v1"
capabilities: "beam:coder:iterable:v1"
capabilities: "beam:coder:state_backed_iterable:v1"
capabilities: "beam:coder:windowed_value:v1"
capabilities: "beam:coder:global_window:v1"
capabilities: "beam:coder:interval_window:v1"
capabilities: "beam:coder:row:v1"
capabilities: "beam:coder:nullable:v1"
dependencies: <
type_urn: "beam:artifact:type:file:v1"
role_urn: "beam:artifact:role:go_worker_binary:v1"
>
>
>
>
root_transform_ids: "e4"
root_transform_ids: "e5"
root_transform_ids: "s1"
root_transform_ids: "s3"
requirements: "beam:requirement:pardo:splittable_dofn:v1"
2022/08/15 02:37:26 Cross-compiling <https://ci-beam.apache.org/job/beam_PostCommit_XVR_Spark3/ws/src/sdks/go/test/integration/io/xlang/kafka/kafka_test.go> as /tmp/worker-2-1660531046674589495
2022/08/15 02:37:28 Prepared job with id: go-testkafkaio_basicreadwrite-745_95b0a91b-da3e-446c-ae6e-6c805accb049 and staging token: go-testkafkaio_basicreadwrite-745_95b0a91b-da3e-446c-ae6e-6c805accb049
2022/08/15 02:37:28 Staged binary artifact with token:
2022/08/15 02:37:28 Submitted job: go0testkafkaio0basicreadwrite0745-jenkins-0815023728-42834600_742dcd39-605e-4920-9854-25b46ecd270b
2022/08/15 02:37:28 Job state: STOPPED
2022/08/15 02:37:28 Job state: STARTING
2022/08/15 02:37:28 Job state: RUNNING
2022/08/15 02:37:50 Job state: DONE
2022/08/15 02:37:50 Warning: 6 errors during metrics processing: [failed to deduce Step from MonitoringInfo: urn:"beam:metric:element_count:v1" type:"beam:metrics:sum_int64:v1" payload:"\x01" labels:{key:"PCOLLECTION" value:"essQvpcQpRExternal/KafkaIO.Read/KafkaIO.Read.ReadFromKafkaViaUnbounded/Read(KafkaUnboundedSource)/Create/Read(CreateSource)/ParDo(OutputSingleSource)/ParMultiDo(OutputSingleSource).output/SplitAndSize0"} failed to deduce Step from MonitoringInfo: urn:"beam:metric:element_count:v1" type:"beam:metrics:sum_int64:v1" payload:"\x01" labels:{key:"PCOLLECTION" value:"essQvpcQpRExternal/KafkaIO.Read/KafkaIO.Read.ReadFromKafkaViaUnbounded/Read(KafkaUnboundedSource)/Create/Read(CreateSource)/ParDo(OutputSingleSource)/ParMultiDo(OutputSingleSource).output/PairWithRestriction0"} failed to deduce Step from MonitoringInfo: urn:"beam:metric:sampled_byte_size:v1" type:"beam:metrics:distribution_int64:v1" payload:"\x01\xf8\"\xf8\"\xf8\"" labels:{key:"PCOLLECTION" value:"essQvpcQpRExternal/KafkaIO.Read/KafkaIO.Read.ReadFromKafkaViaUnbounded/Read(KafkaUnboundedSource)/Create/Read(CreateSource)/ParDo(OutputSingleSource)/ParMultiDo(OutputSingleSource).output/SplitAndSize0"} failed to deduce Step from MonitoringInfo: urn:"beam:metric:sampled_byte_size:v1" type:"beam:metrics:distribution_int64:v1" payload:"\x01\xf0\"\xf0\"\xf0\"" labels:{key:"PCOLLECTION" value:"essQvpcQpRExternal/KafkaIO.Read/KafkaIO.Read.ReadFromKafkaViaUnbounded/Read(KafkaUnboundedSource)/Create/Read(CreateSource)/ParDo(OutputSingleSource)/ParMultiDo(OutputSingleSource).output/PairWithRestriction0"} failed to deduce Step from MonitoringInfo: urn:"beam:metric:element_count:v1" type:"beam:metrics:sum_int64:v1" payload:"\x01" labels:{key:"PCOLLECTION" value:"essQvpcQpRExternal/KafkaIO.Read/KafkaIO.Read.ReadFromKafkaViaUnbounded/Read(KafkaUnboundedSource)/Create/Read(CreateSource)/ParDo(OutputSingleSource)/ParMultiDo(OutputSingleSource).output/SplitAndSize0"} failed to deduce Step from MonitoringInfo: urn:"beam:metric:sampled_byte_size:v1" type:"beam:metrics:distribution_int64:v1" payload:"\x01\xfd\"\xfd\"\xfd\"" labels:{key:"PCOLLECTION" value:"essQvpcQpRExternal/KafkaIO.Read/KafkaIO.Read.ReadFromKafkaViaUnbounded/Read(KafkaUnboundedSource)/Create/Read(CreateSource)/ParDo(OutputSingleSource)/ParMultiDo(OutputSingleSource).output/SplitAndSize0"}]
--- PASS: TestKafkaIO_BasicReadWrite (36.96s)
PASS
ok github.com/apache/beam/sdks/v2/go/test/integration/io/xlang/kafka 42.986s
> Task :runners:spark:3:job-server:validatesCrossLanguageRunnerJavaUsingPython
org.apache.beam.runners.core.construction.ValidateRunnerXlangTest$SingleInputOutputTest > test FAILED
java.lang.RuntimeException at ValidateRunnerXlangTest.java:242
java.lang.NullPointerException at Preconditions.java:980
14 tests completed, 1 failed
> Task :runners:spark:3:job-server:validatesCrossLanguageRunnerJavaUsingPython FAILED
> Task :runners:spark:3:job-server:validatesCrossLanguageRunnerPythonUsingJava
> Task :runners:spark:3:job-server:validatesCrossLanguageRunnerPythonUsingSql
> Task :runners:spark:3:job-server:validatesCrossLanguageRunnerCleanup
> Task :runners:spark:3:job-server:sparkJobServerCleanup
FAILURE: Build failed with an exception.
* What went wrong:
Execution failed for task ':runners:spark:3:job-server:validatesCrossLanguageRunnerJavaUsingPython'.
> There were failing tests. See the report at: file://<https://ci-beam.apache.org/job/beam_PostCommit_XVR_Spark3/ws/src/runners/spark/3/job-server/build/reports/tests/validatesCrossLanguageRunnerJavaUsingPython/index.html>
* Try:
> Run with --stacktrace option to get the stack trace.
> Run with --info or --debug option to get more log output.
> Run with --scan to get full insights.
* Get more help at https://help.gradle.org
Deprecated Gradle features were used in this build, making it incompatible with Gradle 8.0.
You can use '--warning-mode all' to show the individual deprecation warnings and determine if they come from your own scripts or plugins.
See https://docs.gradle.org/7.4/userguide/command_line_interface.html#sec:command_line_warnings
Execution optimizations have been disabled for 1 invalid unit(s) of work during this build to ensure correctness.
Please consult deprecation warnings for more details.
BUILD FAILED in 33m 1s
263 actionable tasks: 173 executed, 78 from cache, 12 up-to-date
Publishing build scan...
https://gradle.com/s/wg3u3fzlobqxk
Build step 'Invoke Gradle script' changed build result to FAILURE
Build step 'Invoke Gradle script' marked build as failure
---------------------------------------------------------------------
To unsubscribe, e-mail: builds-unsubscribe@beam.apache.org
For additional commands, e-mail: builds-help@beam.apache.org
Build failed in Jenkins: beam_PostCommit_XVR_Spark3 #2011
Posted by Apache Jenkins Server <je...@builds.apache.org>.
See <https://ci-beam.apache.org/job/beam_PostCommit_XVR_Spark3/2011/display/redirect?page=changes>
Changes:
[noreply] fix minor unreachable code caused by log.Fatal (#22618)
------------------------------------------
[...truncated 1.02 MB...]
coders: <
key: "FcIgHQMFRTTimestampedValueCoder"
value: <
spec: <
urn: "beam:coders:javasdk:0.1"
payload: "\202SNAPPY\000\000\000\000\001\000\000\000\001\000\000\001?\315\003\270\254\355\000\005sr\000Aorg.apache.beam.sdk.values.TimestampedV\001\022\000$>\021\000LCoder\364\376\202p\274iX-\002\000\001L\000\nv\001)\005\030\034t\000\"Lorg/\t]\000/\001],/sdk/coders/\005$\020;xr\000*N\202\000\t%(.Structured\005/8s\277\022\016\325\3246\021\002\000\000xr\000 j9\000\005/\034C\335\325\211\256\274~\370\001/\020psr\000,j1\000(Serializabl\t\277\034\010\364 \216\305ynl\005\327\\\004typet\000\021Ljava/lang/Class\001\300\000&jV\000\024Custom\005\215Pj\260\010\235\013;\035\013\002\000\000xq\000~\000\003vr\000;N;\000Pio.BoundedReadFromUnb\t\021`Source$Shardd\236\240U\205\000j\363\002\000\000xp"
>
>
>
coders: <
key: "FcIgHQMFRTValueWithRecordIdCoder"
value: <
spec: <
urn: "beam:coders:javasdk:0.1"
payload: "\202SNAPPY\000\000\000\000\001\000\000\000\001\000\000\001\213\311\005\320\254\355\000\005sr\000Corg.apache.beam.sdk.values.ValueWithRecordId$B\022\000LCoder{\343\376bQ\014\204>\002\000\002L\000\007i\t\025\034t\000+Lorg/\t\\\000/\001\\\024/sdk/c\0012(s/ByteArray\005B\014;L\000\n\005u\005\016\010t\000\"n;\000\005$\020;xr\000*N\274\000\t`(.Structured\005/8s\277\022\016\325\3246\021\002\000\000xr\000 j9\000\005/\034C\335\325\211\256\274~\370\001/\020psr\000)j1\0006\312\000\034\351\277\005|\263\3746\333\001:\010r\000&j8\000\024Atomic\005o\034\307\354\265\314\205tPF\0015 q\000~\000\003sr\000-N;\000$io.kafka.K\001\006\000R%\227\005B<I\320\251Y\032\341{#\002\000\001L\000\007kv\005\025\010t\000$nH\001\000K\t&\000;\025s\000\"Ns\000-P\r- j\000\275\271\035\243\3126\002!\353\010\010ke)\277\001\264\000\0022\303\001\005\022\025Y\000(jY\000\030Nullabl)\372\034E\333\0336>\220\247\007\005\307]\022.O\000\001\014,\006sq\000~\000\016q\000~\000\020"
>
>
>
coders: <
key: "FcIgHQMFRTVarIntCoder"
value: <
spec: <
urn: "beam:coders:javasdk:0.1"
payload: "\202SNAPPY\000\000\000\000\001\000\000\000\001\000\000\000\210\330\001\350\254\355\000\005sr\000&org.apache.beam.sdk.coders.VarIntCoder\300K2\332\251KVh\002\000\000xrr5\000\024Atomic\0055 \307\354\265\314\205tPF\002\0055\000*jj\000$Structured\0059\034s\277\022\016\325\3246\021\t9\000 j9\000\005/0C\335\325\211\256\274~\370\002\000\000xp"
>
>
>
coders: <
key: "FcIgHQMFRTVoidCoder"
value: <
spec: <
urn: "beam:coders:javasdk:0.1"
payload: "\202SNAPPY\000\000\000\000\001\000\000\000\001\000\000\000\210\326\001\350\254\355\000\005sr\000$org.apache.beam.sdk.coders.VoidCoder\271\277U\233\350\r\257U\002\000\000xr\000&j3\000\024Atomic\0055 \307\354\265\314\205tPF\002\0055\000*j5\000$Structured\0059\034s\277\022\016\325\3246\021\t9\000 j9\000\005/0C\335\325\211\256\274~\370\002\000\000xp"
>
>
>
coders: <
key: "c0"
value: <
spec: <
urn: "beam:coder:bytes:v1"
>
>
>
coders: <
key: "c1"
value: <
spec: <
urn: "beam:coder:global_window:v1"
>
>
>
coders: <
key: "c2"
value: <
spec: <
urn: "beam:go:coder:custom:v1"
payload: "Cgd2YXJpbnR6EgIIAhpdCklnaXRodWIuY29tL2FwYWNoZS9iZWFtL3Nka3MvdjIvZ28vcGtnL2JlYW0vY29yZS9ydW50aW1lL2NvZGVyeC5lbmNWYXJJbnRaEhAIFiIECBlADyoGCBQSAggIImkKSWdpdGh1Yi5jb20vYXBhY2hlL2JlYW0vc2Rrcy92Mi9nby9wa2cvYmVhbS9jb3JlL3J1bnRpbWUvY29kZXJ4LmRlY1ZhckludFoSHAgWIgQIGUADIgYIFBICCAgqBAgZQA8qBAgZQAE="
>
>
>
coders: <
key: "c3"
value: <
spec: <
urn: "beam:coder:length_prefix:v1"
>
component_coder_ids: "c2"
>
>
coders: <
key: "c4"
value: <
spec: <
urn: "beam:coder:kv:v1"
>
component_coder_ids: "c0"
component_coder_ids: "c0"
>
>
environments: <
key: "FcIgHQMFRTbeam:env:docker:v1"
value: <
urn: "beam:env:docker:v1"
payload: "\n apache/beam_java8_sdk:2.42.0.dev"
capabilities: "beam:coder:bytes:v1"
capabilities: "beam:coder:bool:v1"
capabilities: "beam:coder:varint:v1"
capabilities: "beam:coder:string_utf8:v1"
capabilities: "beam:coder:iterable:v1"
capabilities: "beam:coder:timer:v1"
capabilities: "beam:coder:kv:v1"
capabilities: "beam:coder:length_prefix:v1"
capabilities: "beam:coder:global_window:v1"
capabilities: "beam:coder:interval_window:v1"
capabilities: "beam:coder:custom_window:v1"
capabilities: "beam:coder:windowed_value:v1"
capabilities: "beam:coder:double:v1"
capabilities: "beam:coder:row:v1"
capabilities: "beam:coder:param_windowed_value:v1"
capabilities: "beam:coder:state_backed_iterable:v1"
capabilities: "beam:coder:sharded_key:v1"
capabilities: "beam:coder:nullable:v1"
capabilities: "beam:protocol:multi_core_bundle_processing:v1"
capabilities: "beam:protocol:progress_reporting:v1"
capabilities: "beam:protocol:harness_monitoring_infos:v1"
capabilities: "beam:protocol:control_request_elements_embedding:v1"
capabilities: "beam:protocol:state_caching:v1"
capabilities: "beam:version:sdk_base:apache/beam_java8_sdk:2.42.0.dev"
capabilities: "beam:transform:sdf_truncate_sized_restrictions:v1"
capabilities: "beam:transform:to_string:v1"
dependencies: <
type_urn: "beam:artifact:type:file:v1"
type_payload: "\nL/tmp/artifacts/icedtea-sound-CGRxIE9edPHnbxQhM-L5mp8h21H-ySB79uQtSquPV_Q.jar\022@086471204f5e74f1e76f142133e2f99a9f21db51fec9207bf6e42d4aab8f57f4"
role_urn: "beam:artifact:role:staging_to:v1"
role_payload: "\n=icedtea-sound-CGRxIE9edPHnbxQhM-L5mp8h21H-ySB79uQtSquPV_Q.jar"
>
dependencies: <
type_urn: "beam:artifact:type:file:v1"
type_payload: "\nF/tmp/artifacts/jaccess-FBI0Bb27lF3oEBieWAi7SP8X1zBR8k4BJQOVpsoK9a0.jar\022@14123405bdbb945de810189e5808bb48ff17d73051f24e01250395a6ca0af5ad"
role_urn: "beam:artifact:role:staging_to:v1"
role_payload: "\n7jaccess-FBI0Bb27lF3oEBieWAi7SP8X1zBR8k4BJQOVpsoK9a0.jar"
>
dependencies: <
type_urn: "beam:artifact:type:file:v1"
type_payload: "\nI/tmp/artifacts/localedata-kJ2mc8rBH5-IklhfR1XzNotlIQ_mnVMA-pgaXv2r8Ag.jar\022@909da673cac11f9f8892585f4755f3368b65210fe69d5300fa981a5efdabf008"
role_urn: "beam:artifact:role:staging_to:v1"
role_payload: "\n:localedata-kJ2mc8rBH5-IklhfR1XzNotlIQ_mnVMA-pgaXv2r8Ag.jar"
>
dependencies: <
type_urn: "beam:artifact:type:file:v1"
type_payload: "\nF/tmp/artifacts/nashorn-B0CAb3QpJET_6VsT3hcC_89VtvhV616H8N2bHAIaqWo.jar\022@0740806f74292444ffe95b13de1702ffcf55b6f855eb5e87f0dd9b1c021aa96a"
role_urn: "beam:artifact:role:staging_to:v1"
role_payload: "\n7nashorn-B0CAb3QpJET_6VsT3hcC_89VtvhV616H8N2bHAIaqWo.jar"
>
dependencies: <
type_urn: "beam:artifact:type:file:v1"
type_payload: "\nG/tmp/artifacts/cldrdata-gclqV9lOGqQOKesG-a6TAUTGEYlyIDqpyd4M_k7gtWo.jar\022@81c96a57d94e1aa40e29eb06f9ae930144c6118972203aa9c9de0cfe4ee0b56a"
role_urn: "beam:artifact:role:staging_to:v1"
role_payload: "\n8cldrdata-gclqV9lOGqQOKesG-a6TAUTGEYlyIDqpyd4M_k7gtWo.jar"
>
dependencies: <
type_urn: "beam:artifact:type:file:v1"
type_payload: "\nD/tmp/artifacts/dnsns-byzoQxdXengTvA5IlbH9gSIzfhNQElRYltuMJN0vjcc.jar\022@6f2ce84317577a7813bc0e4895b1fd8122337e135012545896db8c24dd2f8dc7"
role_urn: "beam:artifact:role:staging_to:v1"
role_payload: "\n5dnsns-byzoQxdXengTvA5IlbH9gSIzfhNQElRYltuMJN0vjcc.jar"
>
dependencies: <
type_urn: "beam:artifact:type:file:v1"
type_payload: "\nr/tmp/artifacts/beam-sdks-java-io-expansion-service-2.42.0-SNAPSHOT-Nc2I3ZhyT7-oyDTgQHRgxjZOKatpiGcPr_Q6tpt-fkg.jar\022@35cd88dd98724fbfa8c834e0407460c6364e29ab6988670faff43ab69b7e7e48"
role_urn: "beam:artifact:role:staging_to:v1"
role_payload: "\ncbeam-sdks-java-io-expansion-service-2.42.0-SNAPSHOT-Nc2I3ZhyT7-oyDTgQHRgxjZOKatpiGcPr_Q6tpt-fkg.jar"
>
>
>
environments: <
key: "go"
value: <
urn: "beam:env:docker:v1"
payload: "\n\026apache/beam_go_sdk:dev"
capabilities: "beam:protocol:progress_reporting:v1"
capabilities: "beam:protocol:multi_core_bundle_processing:v1"
capabilities: "beam:transform:sdf_truncate_sized_restrictions:v1"
capabilities: "beam:protocol:worker_status:v1"
capabilities: "beam:protocol:monitoring_info_short_ids:v1"
capabilities: "beam:version:sdk_base:go"
capabilities: "beam:coder:bytes:v1"
capabilities: "beam:coder:bool:v1"
capabilities: "beam:coder:varint:v1"
capabilities: "beam:coder:double:v1"
capabilities: "beam:coder:string_utf8:v1"
capabilities: "beam:coder:length_prefix:v1"
capabilities: "beam:coder:kv:v1"
capabilities: "beam:coder:iterable:v1"
capabilities: "beam:coder:state_backed_iterable:v1"
capabilities: "beam:coder:windowed_value:v1"
capabilities: "beam:coder:global_window:v1"
capabilities: "beam:coder:interval_window:v1"
capabilities: "beam:coder:row:v1"
capabilities: "beam:coder:nullable:v1"
dependencies: <
type_urn: "beam:artifact:type:file:v1"
role_urn: "beam:artifact:role:go_worker_binary:v1"
>
>
>
>
root_transform_ids: "s1"
root_transform_ids: "e4"
root_transform_ids: "e5"
root_transform_ids: "s3"
requirements: "beam:requirement:pardo:splittable_dofn:v1"
2022/08/14 20:37:05 Cross-compiling <https://ci-beam.apache.org/job/beam_PostCommit_XVR_Spark3/ws/src/sdks/go/test/integration/io/xlang/kafka/kafka_test.go> as /tmp/worker-2-1660509425268646113
2022/08/14 20:37:06 Prepared job with id: go-testkafkaio_basicreadwrite-996_1c7a6b0b-a25b-4060-a9ea-a3e10ca01129 and staging token: go-testkafkaio_basicreadwrite-996_1c7a6b0b-a25b-4060-a9ea-a3e10ca01129
2022/08/14 20:37:07 Staged binary artifact with token:
2022/08/14 20:37:07 Submitted job: go0testkafkaio0basicreadwrite0996-jenkins-0814203707-691ff6d7_b37912c2-9fc7-48e5-9386-9474ae519fee
2022/08/14 20:37:07 Job state: STOPPED
2022/08/14 20:37:07 Job state: STARTING
2022/08/14 20:37:07 Job state: RUNNING
2022/08/14 20:37:29 Job state: DONE
2022/08/14 20:37:29 Warning: 6 errors during metrics processing: [failed to deduce Step from MonitoringInfo: urn:"beam:metric:element_count:v1" type:"beam:metrics:sum_int64:v1" payload:"\x01" labels:{key:"PCOLLECTION" value:"FcIgHQMFRTExternal/KafkaIO.Read/KafkaIO.Read.ReadFromKafkaViaUnbounded/Read(KafkaUnboundedSource)/Create/Read(CreateSource)/ParDo(OutputSingleSource)/ParMultiDo(OutputSingleSource).output/SplitAndSize0"} failed to deduce Step from MonitoringInfo: urn:"beam:metric:sampled_byte_size:v1" type:"beam:metrics:distribution_int64:v1" payload:"\x01\xfd\"\xfd\"\xfd\"" labels:{key:"PCOLLECTION" value:"FcIgHQMFRTExternal/KafkaIO.Read/KafkaIO.Read.ReadFromKafkaViaUnbounded/Read(KafkaUnboundedSource)/Create/Read(CreateSource)/ParDo(OutputSingleSource)/ParMultiDo(OutputSingleSource).output/SplitAndSize0"} failed to deduce Step from MonitoringInfo: urn:"beam:metric:element_count:v1" type:"beam:metrics:sum_int64:v1" payload:"\x01" labels:{key:"PCOLLECTION" value:"FcIgHQMFRTExternal/KafkaIO.Read/KafkaIO.Read.ReadFromKafkaViaUnbounded/Read(KafkaUnboundedSource)/Create/Read(CreateSource)/ParDo(OutputSingleSource)/ParMultiDo(OutputSingleSource).output/PairWithRestriction0"} failed to deduce Step from MonitoringInfo: urn:"beam:metric:element_count:v1" type:"beam:metrics:sum_int64:v1" payload:"\x01" labels:{key:"PCOLLECTION" value:"FcIgHQMFRTExternal/KafkaIO.Read/KafkaIO.Read.ReadFromKafkaViaUnbounded/Read(KafkaUnboundedSource)/Create/Read(CreateSource)/ParDo(OutputSingleSource)/ParMultiDo(OutputSingleSource).output/SplitAndSize0"} failed to deduce Step from MonitoringInfo: urn:"beam:metric:sampled_byte_size:v1" type:"beam:metrics:distribution_int64:v1" payload:"\x01\xf8\"\xf8\"\xf8\"" labels:{key:"PCOLLECTION" value:"FcIgHQMFRTExternal/KafkaIO.Read/KafkaIO.Read.ReadFromKafkaViaUnbounded/Read(KafkaUnboundedSource)/Create/Read(CreateSource)/ParDo(OutputSingleSource)/ParMultiDo(OutputSingleSource).output/SplitAndSize0"} failed to deduce Step from MonitoringInfo: urn:"beam:metric:sampled_byte_size:v1" type:"beam:metrics:distribution_int64:v1" payload:"\x01\xf0\"\xf0\"\xf0\"" labels:{key:"PCOLLECTION" value:"FcIgHQMFRTExternal/KafkaIO.Read/KafkaIO.Read.ReadFromKafkaViaUnbounded/Read(KafkaUnboundedSource)/Create/Read(CreateSource)/ParDo(OutputSingleSource)/ParMultiDo(OutputSingleSource).output/PairWithRestriction0"}]
--- PASS: TestKafkaIO_BasicReadWrite (36.93s)
PASS
ok github.com/apache/beam/sdks/v2/go/test/integration/io/xlang/kafka 42.967s
> Task :runners:spark:3:job-server:validatesCrossLanguageRunnerJavaUsingPython
org.apache.beam.runners.core.construction.ValidateRunnerXlangTest$SingleInputOutputTest > test FAILED
java.lang.RuntimeException at ValidateRunnerXlangTest.java:242
java.lang.NullPointerException at Preconditions.java:980
14 tests completed, 1 failed
> Task :runners:spark:3:job-server:validatesCrossLanguageRunnerJavaUsingPython FAILED
> Task :runners:spark:3:job-server:validatesCrossLanguageRunnerPythonUsingJava
> Task :runners:spark:3:job-server:validatesCrossLanguageRunnerPythonUsingSql
> Task :runners:spark:3:job-server:validatesCrossLanguageRunnerCleanup
> Task :runners:spark:3:job-server:sparkJobServerCleanup
FAILURE: Build failed with an exception.
* What went wrong:
Execution failed for task ':runners:spark:3:job-server:validatesCrossLanguageRunnerJavaUsingPython'.
> There were failing tests. See the report at: file://<https://ci-beam.apache.org/job/beam_PostCommit_XVR_Spark3/ws/src/runners/spark/3/job-server/build/reports/tests/validatesCrossLanguageRunnerJavaUsingPython/index.html>
* Try:
> Run with --stacktrace option to get the stack trace.
> Run with --info or --debug option to get more log output.
> Run with --scan to get full insights.
* Get more help at https://help.gradle.org
Deprecated Gradle features were used in this build, making it incompatible with Gradle 8.0.
You can use '--warning-mode all' to show the individual deprecation warnings and determine if they come from your own scripts or plugins.
See https://docs.gradle.org/7.4/userguide/command_line_interface.html#sec:command_line_warnings
Execution optimizations have been disabled for 1 invalid unit(s) of work during this build to ensure correctness.
Please consult deprecation warnings for more details.
BUILD FAILED in 33m
263 actionable tasks: 173 executed, 78 from cache, 12 up-to-date
Publishing build scan...
https://gradle.com/s/3zscjctsq74qo
Build step 'Invoke Gradle script' changed build result to FAILURE
Build step 'Invoke Gradle script' marked build as failure
---------------------------------------------------------------------
To unsubscribe, e-mail: builds-unsubscribe@beam.apache.org
For additional commands, e-mail: builds-help@beam.apache.org
Build failed in Jenkins: beam_PostCommit_XVR_Spark3 #2010
Posted by Apache Jenkins Server <je...@builds.apache.org>.
See <https://ci-beam.apache.org/job/beam_PostCommit_XVR_Spark3/2010/display/redirect>
Changes:
------------------------------------------
[...truncated 724.76 KB...]
INFO apache_beam.utils.subprocess_server:subprocess_server.py:132 beam:transform:org.apache.beam:spanner_insert_or_update:v1: org.apache.beam.sdk.expansion.service.ExpansionService$ExternalTransformRegistrarLoader$1@14cd1699
INFO apache_beam.utils.subprocess_server:subprocess_server.py:132 beam:transform:org.apache.beam:spanner_delete:v1: org.apache.beam.sdk.expansion.service.ExpansionService$ExternalTransformRegistrarLoader$1@77888435
INFO apache_beam.utils.subprocess_server:subprocess_server.py:132 beam:transform:org.apache.beam:spanner_read:v1: org.apache.beam.sdk.expansion.service.ExpansionService$ExternalTransformRegistrarLoader$1@73a1e9a9
INFO apache_beam.utils.subprocess_server:subprocess_server.py:132 beam:transform:org.apache.beam:kafka_read_with_metadata:v1: org.apache.beam.sdk.expansion.service.ExpansionService$ExternalTransformRegistrarLoader$1@71d44a3
INFO apache_beam.utils.subprocess_server:subprocess_server.py:132 beam:transform:org.apache.beam:kafka_read_without_metadata:v1: org.apache.beam.sdk.expansion.service.ExpansionService$ExternalTransformRegistrarLoader$1@7b98f307
INFO apache_beam.utils.subprocess_server:subprocess_server.py:132 beam:transform:org.apache.beam:kafka_write:v1: org.apache.beam.sdk.expansion.service.ExpansionService$ExternalTransformRegistrarLoader$1@4802796d
INFO apache_beam.utils.subprocess_server:subprocess_server.py:132 beam:external:java:generate_sequence:v1: org.apache.beam.sdk.expansion.service.ExpansionService$ExternalTransformRegistrarLoader$1@34123d65
INFO apache_beam.utils.subprocess_server:subprocess_server.py:132 Aug 14, 2022 2:56:13 PM org.apache.beam.sdk.expansion.service.ExpansionService expand
INFO apache_beam.utils.subprocess_server:subprocess_server.py:132 INFO: Expanding 'SqlTransform(beam:external:java:sql:v1)' with URN 'beam:external:java:sql:v1'
INFO apache_beam.utils.subprocess_server:subprocess_server.py:132 Aug 14, 2022 2:56:13 PM org.apache.beam.sdk.expansion.service.ExpansionService$ExternalTransformRegistrarLoader payloadToConfig
INFO apache_beam.utils.subprocess_server:subprocess_server.py:132 WARNING: Configuration class 'org.apache.beam.sdk.extensions.sql.expansion.ExternalSqlTransformRegistrar$Configuration' has no schema registered. Attempting to construct with setter approach.
INFO apache_beam.utils.subprocess_server:subprocess_server.py:132 Aug 14, 2022 2:56:14 PM org.apache.beam.sdk.expansion.service.ExpansionService$ExternalTransformRegistrarLoader payloadToConfig
INFO apache_beam.utils.subprocess_server:subprocess_server.py:132 WARNING: Configuration class 'org.apache.beam.sdk.extensions.sql.expansion.ExternalSqlTransformRegistrar$Configuration' has no schema registered. Attempting to construct with setter approach.
INFO apache_beam.utils.subprocess_server:subprocess_server.py:132 Aug 14, 2022 2:56:16 PM org.apache.beam.sdk.extensions.sql.impl.CalciteQueryPlanner convertToBeamRel
INFO apache_beam.utils.subprocess_server:subprocess_server.py:132 INFO: SQL:
INFO apache_beam.utils.subprocess_server:subprocess_server.py:132 SELECT `PCOLLECTION`.`a` * `PCOLLECTION`.`a` AS `s`, `LENGTH`(`PCOLLECTION`.`b`) AS `c`
INFO apache_beam.utils.subprocess_server:subprocess_server.py:132 FROM `beam`.`PCOLLECTION` AS `PCOLLECTION`
INFO apache_beam.utils.subprocess_server:subprocess_server.py:132 Aug 14, 2022 2:56:16 PM org.apache.beam.sdk.extensions.sql.impl.CalciteQueryPlanner convertToBeamRel
INFO apache_beam.utils.subprocess_server:subprocess_server.py:132 INFO: SQLPlan>
INFO apache_beam.utils.subprocess_server:subprocess_server.py:132 LogicalProject(s=[*($0, $0)], c=[LENGTH($1)])
INFO apache_beam.utils.subprocess_server:subprocess_server.py:132 BeamIOSourceRel(table=[[beam, PCOLLECTION]])
INFO apache_beam.utils.subprocess_server:subprocess_server.py:132
INFO apache_beam.utils.subprocess_server:subprocess_server.py:132 Aug 14, 2022 2:56:16 PM org.apache.beam.sdk.extensions.sql.impl.CalciteQueryPlanner convertToBeamRel
INFO apache_beam.utils.subprocess_server:subprocess_server.py:132 INFO: BEAMPlan>
INFO apache_beam.utils.subprocess_server:subprocess_server.py:132 BeamCalcRel(expr#0..1=[{inputs}], expr#2=[*($t0, $t0)], expr#3=[LENGTH($t1)], s=[$t2], c=[$t3])
INFO apache_beam.utils.subprocess_server:subprocess_server.py:132 BeamIOSourceRel(table=[[beam, PCOLLECTION]])
INFO apache_beam.utils.subprocess_server:subprocess_server.py:132
INFO root:environments.py:376 Default Python SDK image for environment is apache/beam_python3.7_sdk:2.42.0.dev
INFO root:environments.py:299 No image given, using default Python SDK image
INFO root:environments.py:376 Default Python SDK image for environment is apache/beam_python3.7_sdk:2.42.0.dev
INFO root:environments.py:304 Python SDK container image set to "apache/beam_python3.7_sdk:2.42.0.dev" for Docker environment
INFO apache_beam.runners.portability.fn_api_runner.translations:translations.py:714 ==================== <function pack_combiners at 0x7f4680f7ee60> ====================
INFO apache_beam.runners.portability.fn_api_runner.translations:translations.py:714 ==================== <function lift_combiners at 0x7f4680f7eef0> ====================
INFO apache_beam.runners.portability.fn_api_runner.translations:translations.py:714 ==================== <function sort_stages at 0x7f4680f7f680> ====================
INFO apache_beam.runners.portability.portable_runner:portable_runner.py:583 Job state changed to STOPPED
INFO apache_beam.runners.portability.portable_runner:portable_runner.py:583 Job state changed to STARTING
INFO apache_beam.runners.portability.portable_runner:portable_runner.py:583 Job state changed to RUNNING
INFO apache_beam.runners.portability.portable_runner:portable_runner.py:583 Job state changed to DONE
PASSED [ 66%]
apache_beam/transforms/sql_test.py::SqlTransformTest::test_tagged_join
-------------------------------- live log call ---------------------------------
INFO apache_beam.utils.subprocess_server:subprocess_server.py:254 Using pre-built snapshot at <https://ci-beam.apache.org/job/beam_PostCommit_XVR_Spark3/ws/src/sdks/java/extensions/sql/expansion-service/build/libs/beam-sdks-java-extensions-sql-expansion-service-2.42.0-SNAPSHOT.jar>
INFO root:external.py:773 Starting a JAR-based expansion service from JAR <https://ci-beam.apache.org/job/beam_PostCommit_XVR_Spark3/ws/src/sdks/java/extensions/sql/expansion-service/build/libs/beam-sdks-java-extensions-sql-expansion-service-2.42.0-SNAPSHOT.jar>
INFO apache_beam.utils.subprocess_server:subprocess_server.py:116 Starting service with ['java' '-jar' '<https://ci-beam.apache.org/job/beam_PostCommit_XVR_Spark3/ws/src/sdks/java/extensions/sql/expansion-service/build/libs/beam-sdks-java-extensions-sql-expansion-service-2.42.0-SNAPSHOT.jar'> '51025' '--filesToStage=<https://ci-beam.apache.org/job/beam_PostCommit_XVR_Spark3/ws/src/sdks/java/extensions/sql/expansion-service/build/libs/beam-sdks-java-extensions-sql-expansion-service-2.42.0-SNAPSHOT.jar']>
INFO apache_beam.utils.subprocess_server:subprocess_server.py:132 Starting expansion service at localhost:51025
INFO apache_beam.utils.subprocess_server:subprocess_server.py:132 Aug 14, 2022 2:56:38 PM org.apache.beam.sdk.expansion.service.ExpansionService loadRegisteredTransforms
INFO apache_beam.utils.subprocess_server:subprocess_server.py:132 INFO: Registering external transforms: [beam:external:java:sql:v1, beam:transform:org.apache.beam:pubsub_read:v1, beam:transform:org.apache.beam:pubsub_write:v1, beam:transform:org.apache.beam:pubsublite_write:v1, beam:transform:org.apache.beam:pubsublite_read:v1, beam:transform:org.apache.beam:spanner_insert:v1, beam:transform:org.apache.beam:spanner_update:v1, beam:transform:org.apache.beam:spanner_replace:v1, beam:transform:org.apache.beam:spanner_insert_or_update:v1, beam:transform:org.apache.beam:spanner_delete:v1, beam:transform:org.apache.beam:spanner_read:v1, beam:transform:org.apache.beam:kafka_read_with_metadata:v1, beam:transform:org.apache.beam:kafka_read_without_metadata:v1, beam:transform:org.apache.beam:kafka_write:v1, beam:external:java:generate_sequence:v1]
INFO apache_beam.utils.subprocess_server:subprocess_server.py:132 beam:external:java:sql:v1: org.apache.beam.sdk.expansion.service.ExpansionService$ExternalTransformRegistrarLoader$1@47eaca72
INFO apache_beam.utils.subprocess_server:subprocess_server.py:132 beam:transform:org.apache.beam:pubsub_read:v1: org.apache.beam.sdk.expansion.service.ExpansionService$ExternalTransformRegistrarLoader$1@55141def
INFO apache_beam.utils.subprocess_server:subprocess_server.py:132 beam:transform:org.apache.beam:pubsub_write:v1: org.apache.beam.sdk.expansion.service.ExpansionService$ExternalTransformRegistrarLoader$1@55182842
INFO apache_beam.utils.subprocess_server:subprocess_server.py:132 beam:transform:org.apache.beam:pubsublite_write:v1: org.apache.beam.sdk.expansion.service.ExpansionService$ExternalTransformRegistrarLoader$1@3270d194
INFO apache_beam.utils.subprocess_server:subprocess_server.py:132 beam:transform:org.apache.beam:pubsublite_read:v1: org.apache.beam.sdk.expansion.service.ExpansionService$ExternalTransformRegistrarLoader$1@235834f2
INFO apache_beam.utils.subprocess_server:subprocess_server.py:132 beam:transform:org.apache.beam:spanner_insert:v1: org.apache.beam.sdk.expansion.service.ExpansionService$ExternalTransformRegistrarLoader$1@5656be13
INFO apache_beam.utils.subprocess_server:subprocess_server.py:132 beam:transform:org.apache.beam:spanner_update:v1: org.apache.beam.sdk.expansion.service.ExpansionService$ExternalTransformRegistrarLoader$1@4218d6a3
INFO apache_beam.utils.subprocess_server:subprocess_server.py:132 beam:transform:org.apache.beam:spanner_replace:v1: org.apache.beam.sdk.expansion.service.ExpansionService$ExternalTransformRegistrarLoader$1@76505305
INFO apache_beam.utils.subprocess_server:subprocess_server.py:132 beam:transform:org.apache.beam:spanner_insert_or_update:v1: org.apache.beam.sdk.expansion.service.ExpansionService$ExternalTransformRegistrarLoader$1@14cd1699
INFO apache_beam.utils.subprocess_server:subprocess_server.py:132 beam:transform:org.apache.beam:spanner_delete:v1: org.apache.beam.sdk.expansion.service.ExpansionService$ExternalTransformRegistrarLoader$1@77888435
INFO apache_beam.utils.subprocess_server:subprocess_server.py:132 beam:transform:org.apache.beam:spanner_read:v1: org.apache.beam.sdk.expansion.service.ExpansionService$ExternalTransformRegistrarLoader$1@73a1e9a9
INFO apache_beam.utils.subprocess_server:subprocess_server.py:132 beam:transform:org.apache.beam:kafka_read_with_metadata:v1: org.apache.beam.sdk.expansion.service.ExpansionService$ExternalTransformRegistrarLoader$1@71d44a3
INFO apache_beam.utils.subprocess_server:subprocess_server.py:132 beam:transform:org.apache.beam:kafka_read_without_metadata:v1: org.apache.beam.sdk.expansion.service.ExpansionService$ExternalTransformRegistrarLoader$1@7b98f307
INFO apache_beam.utils.subprocess_server:subprocess_server.py:132 beam:transform:org.apache.beam:kafka_write:v1: org.apache.beam.sdk.expansion.service.ExpansionService$ExternalTransformRegistrarLoader$1@4802796d
INFO apache_beam.utils.subprocess_server:subprocess_server.py:132 beam:external:java:generate_sequence:v1: org.apache.beam.sdk.expansion.service.ExpansionService$ExternalTransformRegistrarLoader$1@34123d65
INFO apache_beam.utils.subprocess_server:subprocess_server.py:132 Aug 14, 2022 2:56:39 PM org.apache.beam.sdk.expansion.service.ExpansionService expand
INFO apache_beam.utils.subprocess_server:subprocess_server.py:132 INFO: Expanding 'SqlTransform(beam:external:java:sql:v1)' with URN 'beam:external:java:sql:v1'
INFO apache_beam.utils.subprocess_server:subprocess_server.py:132 Aug 14, 2022 2:56:39 PM org.apache.beam.sdk.expansion.service.ExpansionService$ExternalTransformRegistrarLoader payloadToConfig
INFO apache_beam.utils.subprocess_server:subprocess_server.py:132 WARNING: Configuration class 'org.apache.beam.sdk.extensions.sql.expansion.ExternalSqlTransformRegistrar$Configuration' has no schema registered. Attempting to construct with setter approach.
INFO apache_beam.utils.subprocess_server:subprocess_server.py:132 Aug 14, 2022 2:56:39 PM org.apache.beam.sdk.expansion.service.ExpansionService$ExternalTransformRegistrarLoader payloadToConfig
INFO apache_beam.utils.subprocess_server:subprocess_server.py:132 WARNING: Configuration class 'org.apache.beam.sdk.extensions.sql.expansion.ExternalSqlTransformRegistrar$Configuration' has no schema registered. Attempting to construct with setter approach.
INFO apache_beam.utils.subprocess_server:subprocess_server.py:132 Aug 14, 2022 2:56:41 PM org.apache.beam.sdk.extensions.sql.impl.CalciteQueryPlanner convertToBeamRel
INFO apache_beam.utils.subprocess_server:subprocess_server.py:132 INFO: SQL:
INFO apache_beam.utils.subprocess_server:subprocess_server.py:132 SELECT `simple`.`id` AS `id`, `enrich`.`metadata` AS `metadata`
INFO apache_beam.utils.subprocess_server:subprocess_server.py:132 FROM `beam`.`simple` AS `simple`
INFO apache_beam.utils.subprocess_server:subprocess_server.py:132 INNER JOIN `beam`.`enrich` AS `enrich` ON `simple`.`id` = `enrich`.`id`
INFO apache_beam.utils.subprocess_server:subprocess_server.py:132 Aug 14, 2022 2:56:42 PM org.apache.beam.sdk.extensions.sql.impl.CalciteQueryPlanner convertToBeamRel
INFO apache_beam.utils.subprocess_server:subprocess_server.py:132 INFO: SQLPlan>
INFO apache_beam.utils.subprocess_server:subprocess_server.py:132 LogicalProject(id=[$0], metadata=[$4])
INFO apache_beam.utils.subprocess_server:subprocess_server.py:132 LogicalJoin(condition=[=($0, $3)], joinType=[inner])
INFO apache_beam.utils.subprocess_server:subprocess_server.py:132 BeamIOSourceRel(table=[[beam, simple]])
INFO apache_beam.utils.subprocess_server:subprocess_server.py:132 BeamIOSourceRel(table=[[beam, enrich]])
INFO apache_beam.utils.subprocess_server:subprocess_server.py:132
INFO apache_beam.utils.subprocess_server:subprocess_server.py:132 Aug 14, 2022 2:56:42 PM org.apache.beam.sdk.extensions.sql.impl.CalciteQueryPlanner convertToBeamRel
INFO apache_beam.utils.subprocess_server:subprocess_server.py:132 INFO: BEAMPlan>
INFO apache_beam.utils.subprocess_server:subprocess_server.py:132 BeamCalcRel(expr#0..4=[{inputs}], id=[$t0], metadata=[$t4])
INFO apache_beam.utils.subprocess_server:subprocess_server.py:132 BeamCoGBKJoinRel(condition=[=($0, $3)], joinType=[inner])
INFO apache_beam.utils.subprocess_server:subprocess_server.py:132 BeamIOSourceRel(table=[[beam, simple]])
INFO apache_beam.utils.subprocess_server:subprocess_server.py:132 BeamIOSourceRel(table=[[beam, enrich]])
INFO apache_beam.utils.subprocess_server:subprocess_server.py:132
INFO root:environments.py:376 Default Python SDK image for environment is apache/beam_python3.7_sdk:2.42.0.dev
INFO root:environments.py:299 No image given, using default Python SDK image
INFO root:environments.py:376 Default Python SDK image for environment is apache/beam_python3.7_sdk:2.42.0.dev
INFO root:environments.py:304 Python SDK container image set to "apache/beam_python3.7_sdk:2.42.0.dev" for Docker environment
INFO apache_beam.runners.portability.fn_api_runner.translations:translations.py:714 ==================== <function pack_combiners at 0x7f4680f7ee60> ====================
INFO apache_beam.runners.portability.fn_api_runner.translations:translations.py:714 ==================== <function lift_combiners at 0x7f4680f7eef0> ====================
INFO apache_beam.runners.portability.fn_api_runner.translations:translations.py:714 ==================== <function sort_stages at 0x7f4680f7f680> ====================
INFO apache_beam.runners.portability.portable_runner:portable_runner.py:583 Job state changed to STOPPED
INFO apache_beam.runners.portability.portable_runner:portable_runner.py:583 Job state changed to STARTING
INFO apache_beam.runners.portability.portable_runner:portable_runner.py:583 Job state changed to RUNNING
INFO apache_beam.runners.portability.portable_runner:portable_runner.py:583 Job state changed to DONE
PASSED [ 77%]
apache_beam/transforms/sql_test.py::SqlTransformTest::test_windowing_before_sql
-------------------------------- live log call ---------------------------------
INFO apache_beam.utils.subprocess_server:subprocess_server.py:254 Using pre-built snapshot at <https://ci-beam.apache.org/job/beam_PostCommit_XVR_Spark3/ws/src/sdks/java/extensions/sql/expansion-service/build/libs/beam-sdks-java-extensions-sql-expansion-service-2.42.0-SNAPSHOT.jar>
INFO root:external.py:773 Starting a JAR-based expansion service from JAR <https://ci-beam.apache.org/job/beam_PostCommit_XVR_Spark3/ws/src/sdks/java/extensions/sql/expansion-service/build/libs/beam-sdks-java-extensions-sql-expansion-service-2.42.0-SNAPSHOT.jar>
INFO apache_beam.utils.subprocess_server:subprocess_server.py:116 Starting service with ['java' '-jar' '<https://ci-beam.apache.org/job/beam_PostCommit_XVR_Spark3/ws/src/sdks/java/extensions/sql/expansion-service/build/libs/beam-sdks-java-extensions-sql-expansion-service-2.42.0-SNAPSHOT.jar'> '36377' '--filesToStage=<https://ci-beam.apache.org/job/beam_PostCommit_XVR_Spark3/ws/src/sdks/java/extensions/sql/expansion-service/build/libs/beam-sdks-java-extensions-sql-expansion-service-2.42.0-SNAPSHOT.jar']>
INFO apache_beam.utils.subprocess_server:subprocess_server.py:132 Starting expansion service at localhost:36377
INFO apache_beam.utils.subprocess_server:subprocess_server.py:132 Aug 14, 2022 2:57:03 PM org.apache.beam.sdk.expansion.service.ExpansionService loadRegisteredTransforms
INFO apache_beam.utils.subprocess_server:subprocess_server.py:132 INFO: Registering external transforms: [beam:external:java:sql:v1, beam:transform:org.apache.beam:pubsub_read:v1, beam:transform:org.apache.beam:pubsub_write:v1, beam:transform:org.apache.beam:pubsublite_write:v1, beam:transform:org.apache.beam:pubsublite_read:v1, beam:transform:org.apache.beam:spanner_insert:v1, beam:transform:org.apache.beam:spanner_update:v1, beam:transform:org.apache.beam:spanner_replace:v1, beam:transform:org.apache.beam:spanner_insert_or_update:v1, beam:transform:org.apache.beam:spanner_delete:v1, beam:transform:org.apache.beam:spanner_read:v1, beam:transform:org.apache.beam:kafka_read_with_metadata:v1, beam:transform:org.apache.beam:kafka_read_without_metadata:v1, beam:transform:org.apache.beam:kafka_write:v1, beam:external:java:generate_sequence:v1]
INFO apache_beam.utils.subprocess_server:subprocess_server.py:132 beam:external:java:sql:v1: org.apache.beam.sdk.expansion.service.ExpansionService$ExternalTransformRegistrarLoader$1@47eaca72
INFO apache_beam.utils.subprocess_server:subprocess_server.py:132 beam:transform:org.apache.beam:pubsub_read:v1: org.apache.beam.sdk.expansion.service.ExpansionService$ExternalTransformRegistrarLoader$1@55141def
INFO apache_beam.utils.subprocess_server:subprocess_server.py:132 beam:transform:org.apache.beam:pubsub_write:v1: org.apache.beam.sdk.expansion.service.ExpansionService$ExternalTransformRegistrarLoader$1@55182842
INFO apache_beam.utils.subprocess_server:subprocess_server.py:132 beam:transform:org.apache.beam:pubsublite_write:v1: org.apache.beam.sdk.expansion.service.ExpansionService$ExternalTransformRegistrarLoader$1@3270d194
INFO apache_beam.utils.subprocess_server:subprocess_server.py:132 beam:transform:org.apache.beam:pubsublite_read:v1: org.apache.beam.sdk.expansion.service.ExpansionService$ExternalTransformRegistrarLoader$1@235834f2
INFO apache_beam.utils.subprocess_server:subprocess_server.py:132 beam:transform:org.apache.beam:spanner_insert:v1: org.apache.beam.sdk.expansion.service.ExpansionService$ExternalTransformRegistrarLoader$1@5656be13
INFO apache_beam.utils.subprocess_server:subprocess_server.py:132 beam:transform:org.apache.beam:spanner_update:v1: org.apache.beam.sdk.expansion.service.ExpansionService$ExternalTransformRegistrarLoader$1@4218d6a3
INFO apache_beam.utils.subprocess_server:subprocess_server.py:132 beam:transform:org.apache.beam:spanner_replace:v1: org.apache.beam.sdk.expansion.service.ExpansionService$ExternalTransformRegistrarLoader$1@76505305
INFO apache_beam.utils.subprocess_server:subprocess_server.py:132 beam:transform:org.apache.beam:spanner_insert_or_update:v1: org.apache.beam.sdk.expansion.service.ExpansionService$ExternalTransformRegistrarLoader$1@14cd1699
INFO apache_beam.utils.subprocess_server:subprocess_server.py:132 beam:transform:org.apache.beam:spanner_delete:v1: org.apache.beam.sdk.expansion.service.ExpansionService$ExternalTransformRegistrarLoader$1@77888435
INFO apache_beam.utils.subprocess_server:subprocess_server.py:132 beam:transform:org.apache.beam:spanner_read:v1: org.apache.beam.sdk.expansion.service.ExpansionService$ExternalTransformRegistrarLoader$1@73a1e9a9
INFO apache_beam.utils.subprocess_server:subprocess_server.py:132 beam:transform:org.apache.beam:kafka_read_with_metadata:v1: org.apache.beam.sdk.expansion.service.ExpansionService$ExternalTransformRegistrarLoader$1@71d44a3
INFO apache_beam.utils.subprocess_server:subprocess_server.py:132 beam:transform:org.apache.beam:kafka_read_without_metadata:v1: org.apache.beam.sdk.expansion.service.ExpansionService$ExternalTransformRegistrarLoader$1@7b98f307
INFO apache_beam.utils.subprocess_server:subprocess_server.py:132 beam:transform:org.apache.beam:kafka_write:v1: org.apache.beam.sdk.expansion.service.ExpansionService$ExternalTransformRegistrarLoader$1@4802796d
INFO apache_beam.utils.subprocess_server:subprocess_server.py:132 beam:external:java:generate_sequence:v1: org.apache.beam.sdk.expansion.service.ExpansionService$ExternalTransformRegistrarLoader$1@34123d65
INFO apache_beam.utils.subprocess_server:subprocess_server.py:132 Aug 14, 2022 2:57:05 PM org.apache.beam.sdk.expansion.service.ExpansionService expand
INFO apache_beam.utils.subprocess_server:subprocess_server.py:132 INFO: Expanding 'SqlTransform(beam:external:java:sql:v1)' with URN 'beam:external:java:sql:v1'
INFO apache_beam.utils.subprocess_server:subprocess_server.py:132 Aug 14, 2022 2:57:05 PM org.apache.beam.sdk.expansion.service.ExpansionService$ExternalTransformRegistrarLoader payloadToConfig
INFO apache_beam.utils.subprocess_server:subprocess_server.py:132 WARNING: Configuration class 'org.apache.beam.sdk.extensions.sql.expansion.ExternalSqlTransformRegistrar$Configuration' has no schema registered. Attempting to construct with setter approach.
INFO apache_beam.utils.subprocess_server:subprocess_server.py:132 Aug 14, 2022 2:57:05 PM org.apache.beam.sdk.expansion.service.ExpansionService$ExternalTransformRegistrarLoader payloadToConfig
INFO apache_beam.utils.subprocess_server:subprocess_server.py:132 WARNING: Configuration class 'org.apache.beam.sdk.extensions.sql.expansion.ExternalSqlTransformRegistrar$Configuration' has no schema registered. Attempting to construct with setter approach.
INFO apache_beam.utils.subprocess_server:subprocess_server.py:132 Aug 14, 2022 2:57:07 PM org.apache.beam.sdk.extensions.sql.impl.CalciteQueryPlanner convertToBeamRel
INFO apache_beam.utils.subprocess_server:subprocess_server.py:132 INFO: SQL:
INFO apache_beam.utils.subprocess_server:subprocess_server.py:132 SELECT COUNT(*) AS `count`
INFO apache_beam.utils.subprocess_server:subprocess_server.py:132 FROM `beam`.`PCOLLECTION` AS `PCOLLECTION`
INFO apache_beam.utils.subprocess_server:subprocess_server.py:132 Aug 14, 2022 2:57:07 PM org.apache.beam.sdk.extensions.sql.impl.CalciteQueryPlanner convertToBeamRel
INFO apache_beam.utils.subprocess_server:subprocess_server.py:132 INFO: SQLPlan>
INFO apache_beam.utils.subprocess_server:subprocess_server.py:132 LogicalAggregate(group=[{}], count=[COUNT()])
INFO apache_beam.utils.subprocess_server:subprocess_server.py:132 BeamIOSourceRel(table=[[beam, PCOLLECTION]])
INFO apache_beam.utils.subprocess_server:subprocess_server.py:132
INFO apache_beam.utils.subprocess_server:subprocess_server.py:132 Aug 14, 2022 2:57:07 PM org.apache.beam.sdk.extensions.sql.impl.CalciteQueryPlanner convertToBeamRel
INFO apache_beam.utils.subprocess_server:subprocess_server.py:132 INFO: BEAMPlan>
INFO apache_beam.utils.subprocess_server:subprocess_server.py:132 BeamAggregationRel(group=[{}], count=[COUNT()])
INFO apache_beam.utils.subprocess_server:subprocess_server.py:132 BeamIOSourceRel(table=[[beam, PCOLLECTION]])
INFO apache_beam.utils.subprocess_server:subprocess_server.py:132
INFO root:environments.py:376 Default Python SDK image for environment is apache/beam_python3.7_sdk:2.42.0.dev
INFO root:environments.py:299 No image given, using default Python SDK image
INFO root:environments.py:376 Default Python SDK image for environment is apache/beam_python3.7_sdk:2.42.0.dev
INFO root:environments.py:304 Python SDK container image set to "apache/beam_python3.7_sdk:2.42.0.dev" for Docker environment
INFO apache_beam.runners.portability.fn_api_runner.translations:translations.py:714 ==================== <function pack_combiners at 0x7f4680f7ee60> ====================
INFO apache_beam.runners.portability.fn_api_runner.translations:translations.py:714 ==================== <function lift_combiners at 0x7f4680f7eef0> ====================
INFO apache_beam.runners.portability.fn_api_runner.translations:translations.py:714 ==================== <function sort_stages at 0x7f4680f7f680> ====================
INFO apache_beam.runners.portability.portable_runner:portable_runner.py:583 Job state changed to STOPPED
INFO apache_beam.runners.portability.portable_runner:portable_runner.py:583 Job state changed to STARTING
INFO apache_beam.runners.portability.portable_runner:portable_runner.py:583 Job state changed to RUNNING
INFO apache_beam.runners.portability.portable_runner:portable_runner.py:583 Job state changed to DONE
PASSED [ 88%]
apache_beam/transforms/sql_test.py::SqlTransformTest::test_zetasql_generate_data
-------------------------------- live log call ---------------------------------
INFO apache_beam.utils.subprocess_server:subprocess_server.py:254 Using pre-built snapshot at <https://ci-beam.apache.org/job/beam_PostCommit_XVR_Spark3/ws/src/sdks/java/extensions/sql/expansion-service/build/libs/beam-sdks-java-extensions-sql-expansion-service-2.42.0-SNAPSHOT.jar>
INFO root:external.py:773 Starting a JAR-based expansion service from JAR <https://ci-beam.apache.org/job/beam_PostCommit_XVR_Spark3/ws/src/sdks/java/extensions/sql/expansion-service/build/libs/beam-sdks-java-extensions-sql-expansion-service-2.42.0-SNAPSHOT.jar>
INFO apache_beam.utils.subprocess_server:subprocess_server.py:116 Starting service with ['java' '-jar' '<https://ci-beam.apache.org/job/beam_PostCommit_XVR_Spark3/ws/src/sdks/java/extensions/sql/expansion-service/build/libs/beam-sdks-java-extensions-sql-expansion-service-2.42.0-SNAPSHOT.jar'> '45687' '--filesToStage=<https://ci-beam.apache.org/job/beam_PostCommit_XVR_Spark3/ws/src/sdks/java/extensions/sql/expansion-service/build/libs/beam-sdks-java-extensions-sql-expansion-service-2.42.0-SNAPSHOT.jar']>
INFO apache_beam.utils.subprocess_server:subprocess_server.py:132 Starting expansion service at localhost:45687
INFO apache_beam.utils.subprocess_server:subprocess_server.py:132 Aug 14, 2022 2:57:26 PM org.apache.beam.sdk.expansion.service.ExpansionService loadRegisteredTransforms
INFO apache_beam.utils.subprocess_server:subprocess_server.py:132 INFO: Registering external transforms: [beam:external:java:sql:v1, beam:transform:org.apache.beam:pubsub_read:v1, beam:transform:org.apache.beam:pubsub_write:v1, beam:transform:org.apache.beam:pubsublite_write:v1, beam:transform:org.apache.beam:pubsublite_read:v1, beam:transform:org.apache.beam:spanner_insert:v1, beam:transform:org.apache.beam:spanner_update:v1, beam:transform:org.apache.beam:spanner_replace:v1, beam:transform:org.apache.beam:spanner_insert_or_update:v1, beam:transform:org.apache.beam:spanner_delete:v1, beam:transform:org.apache.beam:spanner_read:v1, beam:transform:org.apache.beam:kafka_read_with_metadata:v1, beam:transform:org.apache.beam:kafka_read_without_metadata:v1, beam:transform:org.apache.beam:kafka_write:v1, beam:external:java:generate_sequence:v1]
INFO apache_beam.utils.subprocess_server:subprocess_server.py:132 beam:external:java:sql:v1: org.apache.beam.sdk.expansion.service.ExpansionService$ExternalTransformRegistrarLoader$1@47eaca72
INFO apache_beam.utils.subprocess_server:subprocess_server.py:132 beam:transform:org.apache.beam:pubsub_read:v1: org.apache.beam.sdk.expansion.service.ExpansionService$ExternalTransformRegistrarLoader$1@55141def
INFO apache_beam.utils.subprocess_server:subprocess_server.py:132 beam:transform:org.apache.beam:pubsub_write:v1: org.apache.beam.sdk.expansion.service.ExpansionService$ExternalTransformRegistrarLoader$1@55182842
INFO apache_beam.utils.subprocess_server:subprocess_server.py:132 beam:transform:org.apache.beam:pubsublite_write:v1: org.apache.beam.sdk.expansion.service.ExpansionService$ExternalTransformRegistrarLoader$1@3270d194
INFO apache_beam.utils.subprocess_server:subprocess_server.py:132 beam:transform:org.apache.beam:pubsublite_read:v1: org.apache.beam.sdk.expansion.service.ExpansionService$ExternalTransformRegistrarLoader$1@235834f2
INFO apache_beam.utils.subprocess_server:subprocess_server.py:132 beam:transform:org.apache.beam:spanner_insert:v1: org.apache.beam.sdk.expansion.service.ExpansionService$ExternalTransformRegistrarLoader$1@5656be13
INFO apache_beam.utils.subprocess_server:subprocess_server.py:132 beam:transform:org.apache.beam:spanner_update:v1: org.apache.beam.sdk.expansion.service.ExpansionService$ExternalTransformRegistrarLoader$1@4218d6a3
INFO apache_beam.utils.subprocess_server:subprocess_server.py:132 beam:transform:org.apache.beam:spanner_replace:v1: org.apache.beam.sdk.expansion.service.ExpansionService$ExternalTransformRegistrarLoader$1@76505305
INFO apache_beam.utils.subprocess_server:subprocess_server.py:132 beam:transform:org.apache.beam:spanner_insert_or_update:v1: org.apache.beam.sdk.expansion.service.ExpansionService$ExternalTransformRegistrarLoader$1@14cd1699
INFO apache_beam.utils.subprocess_server:subprocess_server.py:132 beam:transform:org.apache.beam:spanner_delete:v1: org.apache.beam.sdk.expansion.service.ExpansionService$ExternalTransformRegistrarLoader$1@77888435
INFO apache_beam.utils.subprocess_server:subprocess_server.py:132 beam:transform:org.apache.beam:spanner_read:v1: org.apache.beam.sdk.expansion.service.ExpansionService$ExternalTransformRegistrarLoader$1@73a1e9a9
INFO apache_beam.utils.subprocess_server:subprocess_server.py:132 beam:transform:org.apache.beam:kafka_read_with_metadata:v1: org.apache.beam.sdk.expansion.service.ExpansionService$ExternalTransformRegistrarLoader$1@71d44a3
INFO apache_beam.utils.subprocess_server:subprocess_server.py:132 beam:transform:org.apache.beam:kafka_read_without_metadata:v1: org.apache.beam.sdk.expansion.service.ExpansionService$ExternalTransformRegistrarLoader$1@7b98f307
INFO apache_beam.utils.subprocess_server:subprocess_server.py:132 beam:transform:org.apache.beam:kafka_write:v1: org.apache.beam.sdk.expansion.service.ExpansionService$ExternalTransformRegistrarLoader$1@4802796d
INFO apache_beam.utils.subprocess_server:subprocess_server.py:132 beam:external:java:generate_sequence:v1: org.apache.beam.sdk.expansion.service.ExpansionService$ExternalTransformRegistrarLoader$1@34123d65
INFO apache_beam.utils.subprocess_server:subprocess_server.py:132 Aug 14, 2022 2:57:28 PM org.apache.beam.sdk.expansion.service.ExpansionService expand
INFO apache_beam.utils.subprocess_server:subprocess_server.py:132 INFO: Expanding 'SqlTransform(beam:external:java:sql:v1)' with URN 'beam:external:java:sql:v1'
INFO apache_beam.utils.subprocess_server:subprocess_server.py:132 Aug 14, 2022 2:57:28 PM org.apache.beam.sdk.expansion.service.ExpansionService$ExternalTransformRegistrarLoader payloadToConfig
INFO apache_beam.utils.subprocess_server:subprocess_server.py:132 WARNING: Configuration class 'org.apache.beam.sdk.extensions.sql.expansion.ExternalSqlTransformRegistrar$Configuration' has no schema registered. Attempting to construct with setter approach.
INFO apache_beam.utils.subprocess_server:subprocess_server.py:132 Aug 14, 2022 2:57:28 PM org.apache.beam.sdk.expansion.service.ExpansionService$ExternalTransformRegistrarLoader payloadToConfig
INFO apache_beam.utils.subprocess_server:subprocess_server.py:132 WARNING: Configuration class 'org.apache.beam.sdk.extensions.sql.expansion.ExternalSqlTransformRegistrar$Configuration' has no schema registered. Attempting to construct with setter approach.
INFO apache_beam.utils.subprocess_server:subprocess_server.py:132 Aug 14, 2022 2:57:30 PM com.google.zetasql.io.grpc.NameResolverRegistry getDefaultRegistry
INFO apache_beam.utils.subprocess_server:subprocess_server.py:132 WARNING: No NameResolverProviders found via ServiceLoader, including for DNS. This is probably due to a broken build. If using ProGuard, check your configuration
INFO apache_beam.utils.subprocess_server:subprocess_server.py:132 Aug 14, 2022 2:57:32 PM org.apache.beam.sdk.extensions.sql.zetasql.ZetaSQLQueryPlanner convertToBeamRelInternal
INFO apache_beam.utils.subprocess_server:subprocess_server.py:132 INFO: BEAMPlan>
INFO apache_beam.utils.subprocess_server:subprocess_server.py:132 BeamZetaSqlCalcRel(expr#0=[{inputs}], expr#1=[1:BIGINT], expr#2=['foo':VARCHAR], expr#3=[3.1400000000000001243E0:DOUBLE], int=[$t1], str=[$t2], flt=[$t3])
INFO apache_beam.utils.subprocess_server:subprocess_server.py:132 BeamValuesRel(tuples=[[{ 0 }]])
INFO apache_beam.utils.subprocess_server:subprocess_server.py:132
INFO root:environments.py:376 Default Python SDK image for environment is apache/beam_python3.7_sdk:2.42.0.dev
INFO root:environments.py:299 No image given, using default Python SDK image
INFO root:environments.py:376 Default Python SDK image for environment is apache/beam_python3.7_sdk:2.42.0.dev
INFO root:environments.py:304 Python SDK container image set to "apache/beam_python3.7_sdk:2.42.0.dev" for Docker environment
INFO apache_beam.runners.portability.fn_api_runner.translations:translations.py:714 ==================== <function pack_combiners at 0x7f4680f7ee60> ====================
INFO apache_beam.runners.portability.fn_api_runner.translations:translations.py:714 ==================== <function lift_combiners at 0x7f4680f7eef0> ====================
INFO apache_beam.runners.portability.fn_api_runner.translations:translations.py:714 ==================== <function sort_stages at 0x7f4680f7f680> ====================
INFO apache_beam.runners.portability.portable_runner:portable_runner.py:583 Job state changed to STOPPED
INFO apache_beam.runners.portability.portable_runner:portable_runner.py:583 Job state changed to STARTING
INFO apache_beam.runners.portability.portable_runner:portable_runner.py:583 Job state changed to RUNNING
INFO apache_beam.runners.portability.portable_runner:portable_runner.py:583 Job state changed to DONE
PASSED [100%]
=============================== warnings summary ===============================
../../build/gradleenv/1922375555/lib/python3.7/site-packages/hdfs/config.py:15
<https://ci-beam.apache.org/job/beam_PostCommit_XVR_Spark3/ws/src/build/gradleenv/1922375555/lib/python3.7/site-packages/hdfs/config.py>:15: DeprecationWarning: the imp module is deprecated in favour of importlib; see the module's documentation for alternative uses
from imp import load_source
-- Docs: https://docs.pytest.org/en/stable/how-to/capture-warnings.html
- generated xml file: <https://ci-beam.apache.org/job/beam_PostCommit_XVR_Spark3/ws/src/sdks/python/pytest_xlangSqlValidateRunner.xml> -
===== 9 passed, 2 skipped, 6541 deselected, 1 warning in 282.37s (0:04:42) =====
> Task :runners:spark:3:job-server:validatesCrossLanguageRunnerCleanup
Stopping expansion service pid: 204339.
Stopping expansion service pid: 204340.
> Task :runners:spark:3:job-server:sparkJobServerCleanup
Stopping job server pid: 195476.
FAILURE: Build failed with an exception.
* What went wrong:
Execution failed for task ':runners:spark:3:job-server:validatesCrossLanguageRunnerJavaUsingPython'.
> There were failing tests. See the report at: file://<https://ci-beam.apache.org/job/beam_PostCommit_XVR_Spark3/ws/src/runners/spark/3/job-server/build/reports/tests/validatesCrossLanguageRunnerJavaUsingPython/index.html>
* Try:
> Run with --stacktrace option to get the stack trace.
> Run with --info or --debug option to get more log output.
> Run with --scan to get full insights.
* Get more help at https://help.gradle.org
Deprecated Gradle features were used in this build, making it incompatible with Gradle 8.0.
You can use '--warning-mode all' to show the individual deprecation warnings and determine if they come from your own scripts or plugins.
See https://docs.gradle.org/7.4/userguide/command_line_interface.html#sec:command_line_warnings
Execution optimizations have been disabled for 1 invalid unit(s) of work during this build to ensure correctness.
Please consult deprecation warnings for more details.
BUILD FAILED in 32m 28s
263 actionable tasks: 173 executed, 78 from cache, 12 up-to-date
Publishing build scan...
https://gradle.com/s/pbmuuszh5wjf4
Build step 'Invoke Gradle script' changed build result to FAILURE
Build step 'Invoke Gradle script' marked build as failure
---------------------------------------------------------------------
To unsubscribe, e-mail: builds-unsubscribe@beam.apache.org
For additional commands, e-mail: builds-help@beam.apache.org
Build failed in Jenkins: beam_PostCommit_XVR_Spark3 #2009
Posted by Apache Jenkins Server <je...@builds.apache.org>.
See <https://ci-beam.apache.org/job/beam_PostCommit_XVR_Spark3/2009/display/redirect>
Changes:
------------------------------------------
[...truncated 1.00 MB...]
spec: <
urn: "beam:coder:kv:v1"
>
component_coder_ids: "jlmOPnnVWtVarIntCoder"
component_coder_ids: "jlmOPnnVWtTimestampedValueCoder"
>
>
coders: <
key: "jlmOPnnVWtKvCoder4"
value: <
spec: <
urn: "beam:coder:kv:v1"
>
component_coder_ids: "jlmOPnnVWtVarIntCoder"
component_coder_ids: "jlmOPnnVWtIterableCoder"
>
>
coders: <
key: "jlmOPnnVWtNullableCoder"
value: <
spec: <
urn: "beam:coder:nullable:v1"
>
component_coder_ids: "jlmOPnnVWtByteArrayCoder"
>
>
coders: <
key: "jlmOPnnVWtSerializableCoder"
value: <
spec: <
urn: "beam:coders:javasdk:0.1"
payload: "\202SNAPPY\000\000\000\000\001\000\000\000\001\000\000\000\312\214\002\360^\254\355\000\005sr\000,org.apache.beam.sdk.coders.SerializableCoder\010\364 \216\305ynl\002\000\001L\000\004typet\000\021Ljava/lang/Class;xr\000&ofV\000\024Custom\005P8j\260\010\235\013;\035\013\002\000\000xr\000 j\213\000\005/\034C\335\325\211\256\274~\370\001/\020pvr\000;N1\000Pio.BoundedReadFromUnb\t\021`Source$Shardd\236\240U\205\000j\363\002\000\000xp"
>
>
>
coders: <
key: "jlmOPnnVWtSnappyCoder"
value: <
spec: <
urn: "beam:coders:javasdk:0.1"
payload: "\202SNAPPY\000\000\000\000\001\000\000\000\001\000\000\001.\307\003\360@\254\355\000\005sr\000&org.apache.beam.sdk.coders.SnappyCoder1\033\243\356\177\362\366,\002\000\001L\000\ninner\005\030 t\000\"Lorg/a\005B\000/\001B\020/sdk/\tB\000/\005$\020;xr\000*ng\000 tructured\005/8s\277\022\016\325\3246\021\002\000\000xr\000 j9\000\005/\034C\335\325\211\256\274~\370\001/\020psr\000,j1\000,Serializable\005= \010\364 \216\305ynl\002\001\327\\\004typet\000\021Ljava/lang/Class\001\300n'\001\024Custom\005PPj\260\010\235\013;\035\013\002\000\000xq\000~\000\003vr\000$N\221\000\\io.BoundedSource!`v\023\177\370QA\0019\010r\000\035Z3\000\t,0\020\213\372\020Y\214\347\323\002\000\000xp"
>
>
>
coders: <
key: "jlmOPnnVWtTimestampedValueCoder"
value: <
spec: <
urn: "beam:coders:javasdk:0.1"
payload: "\202SNAPPY\000\000\000\000\001\000\000\000\001\000\000\001?\315\003\270\254\355\000\005sr\000Aorg.apache.beam.sdk.values.TimestampedV\001\022\000$>\021\000LCoder\364\376\202p\274iX-\002\000\001L\000\nv\001)\005\030\034t\000\"Lorg/\t]\000/\001],/sdk/coders/\005$\020;xr\000*N\202\000\t%(.Structured\005/8s\277\022\016\325\3246\021\002\000\000xr\000 j9\000\005/\034C\335\325\211\256\274~\370\001/\020psr\000,j1\000(Serializabl\t\277\034\010\364 \216\305ynl\005\327\\\004typet\000\021Ljava/lang/Class\001\300\000&jV\000\024Custom\005\215Pj\260\010\235\013;\035\013\002\000\000xq\000~\000\003vr\000;N;\000Pio.BoundedReadFromUnb\t\021`Source$Shardd\236\240U\205\000j\363\002\000\000xp"
>
>
>
coders: <
key: "jlmOPnnVWtValueWithRecordIdCoder"
value: <
spec: <
urn: "beam:coders:javasdk:0.1"
payload: "\202SNAPPY\000\000\000\000\001\000\000\000\001\000\000\001\213\311\005\320\254\355\000\005sr\000Corg.apache.beam.sdk.values.ValueWithRecordId$B\022\000LCoder{\343\376bQ\014\204>\002\000\002L\000\007i\t\025\034t\000+Lorg/\t\\\000/\001\\\024/sdk/c\0012(s/ByteArray\005B\014;L\000\n\005u\005\016\010t\000\"n;\000\005$\020;xr\000*N\274\000\t`(.Structured\005/8s\277\022\016\325\3246\021\002\000\000xr\000 j9\000\005/\034C\335\325\211\256\274~\370\001/\020psr\000)j1\0006\312\000\034\351\277\005|\263\3746\333\001:\010r\000&j8\000\024Atomic\005o\034\307\354\265\314\205tPF\0015 q\000~\000\003sr\000-N;\000$io.kafka.K\001\006\000R%\227\005B<I\320\251Y\032\341{#\002\000\001L\000\007kv\005\025\010t\000$nH\001\000K\t&\000;\025s\000\"Ns\000-P\r- j\000\275\271\035\243\3126\002!\353\010\010ke)\277\001\264\000\0022\303\001\005\022\025Y\000(jY\000\030Nullabl)\372\034E\333\0336>\220\247\007\005\307]\022.O\000\001\014,\006sq\000~\000\016q\000~\000\020"
>
>
>
coders: <
key: "jlmOPnnVWtVarIntCoder"
value: <
spec: <
urn: "beam:coders:javasdk:0.1"
payload: "\202SNAPPY\000\000\000\000\001\000\000\000\001\000\000\000\210\330\001\350\254\355\000\005sr\000&org.apache.beam.sdk.coders.VarIntCoder\300K2\332\251KVh\002\000\000xrr5\000\024Atomic\0055 \307\354\265\314\205tPF\002\0055\000*jj\000$Structured\0059\034s\277\022\016\325\3246\021\t9\000 j9\000\005/0C\335\325\211\256\274~\370\002\000\000xp"
>
>
>
coders: <
key: "jlmOPnnVWtVoidCoder"
value: <
spec: <
urn: "beam:coders:javasdk:0.1"
payload: "\202SNAPPY\000\000\000\000\001\000\000\000\001\000\000\000\210\326\001\350\254\355\000\005sr\000$org.apache.beam.sdk.coders.VoidCoder\271\277U\233\350\r\257U\002\000\000xr\000&j3\000\024Atomic\0055 \307\354\265\314\205tPF\002\0055\000*j5\000$Structured\0059\034s\277\022\016\325\3246\021\t9\000 j9\000\005/0C\335\325\211\256\274~\370\002\000\000xp"
>
>
>
environments: <
key: "go"
value: <
urn: "beam:env:docker:v1"
payload: "\n\026apache/beam_go_sdk:dev"
capabilities: "beam:protocol:progress_reporting:v1"
capabilities: "beam:protocol:multi_core_bundle_processing:v1"
capabilities: "beam:transform:sdf_truncate_sized_restrictions:v1"
capabilities: "beam:protocol:worker_status:v1"
capabilities: "beam:protocol:monitoring_info_short_ids:v1"
capabilities: "beam:version:sdk_base:go"
capabilities: "beam:coder:bytes:v1"
capabilities: "beam:coder:bool:v1"
capabilities: "beam:coder:varint:v1"
capabilities: "beam:coder:double:v1"
capabilities: "beam:coder:string_utf8:v1"
capabilities: "beam:coder:length_prefix:v1"
capabilities: "beam:coder:kv:v1"
capabilities: "beam:coder:iterable:v1"
capabilities: "beam:coder:state_backed_iterable:v1"
capabilities: "beam:coder:windowed_value:v1"
capabilities: "beam:coder:global_window:v1"
capabilities: "beam:coder:interval_window:v1"
capabilities: "beam:coder:row:v1"
capabilities: "beam:coder:nullable:v1"
dependencies: <
type_urn: "beam:artifact:type:file:v1"
role_urn: "beam:artifact:role:go_worker_binary:v1"
>
>
>
environments: <
key: "jlmOPnnVWtbeam:env:docker:v1"
value: <
urn: "beam:env:docker:v1"
payload: "\n apache/beam_java8_sdk:2.42.0.dev"
capabilities: "beam:coder:bytes:v1"
capabilities: "beam:coder:bool:v1"
capabilities: "beam:coder:varint:v1"
capabilities: "beam:coder:string_utf8:v1"
capabilities: "beam:coder:iterable:v1"
capabilities: "beam:coder:timer:v1"
capabilities: "beam:coder:kv:v1"
capabilities: "beam:coder:length_prefix:v1"
capabilities: "beam:coder:global_window:v1"
capabilities: "beam:coder:interval_window:v1"
capabilities: "beam:coder:custom_window:v1"
capabilities: "beam:coder:windowed_value:v1"
capabilities: "beam:coder:double:v1"
capabilities: "beam:coder:row:v1"
capabilities: "beam:coder:param_windowed_value:v1"
capabilities: "beam:coder:state_backed_iterable:v1"
capabilities: "beam:coder:sharded_key:v1"
capabilities: "beam:coder:nullable:v1"
capabilities: "beam:protocol:multi_core_bundle_processing:v1"
capabilities: "beam:protocol:progress_reporting:v1"
capabilities: "beam:protocol:harness_monitoring_infos:v1"
capabilities: "beam:protocol:control_request_elements_embedding:v1"
capabilities: "beam:protocol:state_caching:v1"
capabilities: "beam:version:sdk_base:apache/beam_java8_sdk:2.42.0.dev"
capabilities: "beam:transform:sdf_truncate_sized_restrictions:v1"
capabilities: "beam:transform:to_string:v1"
dependencies: <
type_urn: "beam:artifact:type:file:v1"
type_payload: "\nL/tmp/artifacts/icedtea-sound-CGRxIE9edPHnbxQhM-L5mp8h21H-ySB79uQtSquPV_Q.jar\022@086471204f5e74f1e76f142133e2f99a9f21db51fec9207bf6e42d4aab8f57f4"
role_urn: "beam:artifact:role:staging_to:v1"
role_payload: "\n=icedtea-sound-CGRxIE9edPHnbxQhM-L5mp8h21H-ySB79uQtSquPV_Q.jar"
>
dependencies: <
type_urn: "beam:artifact:type:file:v1"
type_payload: "\nF/tmp/artifacts/jaccess-FBI0Bb27lF3oEBieWAi7SP8X1zBR8k4BJQOVpsoK9a0.jar\022@14123405bdbb945de810189e5808bb48ff17d73051f24e01250395a6ca0af5ad"
role_urn: "beam:artifact:role:staging_to:v1"
role_payload: "\n7jaccess-FBI0Bb27lF3oEBieWAi7SP8X1zBR8k4BJQOVpsoK9a0.jar"
>
dependencies: <
type_urn: "beam:artifact:type:file:v1"
type_payload: "\nI/tmp/artifacts/localedata-kJ2mc8rBH5-IklhfR1XzNotlIQ_mnVMA-pgaXv2r8Ag.jar\022@909da673cac11f9f8892585f4755f3368b65210fe69d5300fa981a5efdabf008"
role_urn: "beam:artifact:role:staging_to:v1"
role_payload: "\n:localedata-kJ2mc8rBH5-IklhfR1XzNotlIQ_mnVMA-pgaXv2r8Ag.jar"
>
dependencies: <
type_urn: "beam:artifact:type:file:v1"
type_payload: "\nF/tmp/artifacts/nashorn-B0CAb3QpJET_6VsT3hcC_89VtvhV616H8N2bHAIaqWo.jar\022@0740806f74292444ffe95b13de1702ffcf55b6f855eb5e87f0dd9b1c021aa96a"
role_urn: "beam:artifact:role:staging_to:v1"
role_payload: "\n7nashorn-B0CAb3QpJET_6VsT3hcC_89VtvhV616H8N2bHAIaqWo.jar"
>
dependencies: <
type_urn: "beam:artifact:type:file:v1"
type_payload: "\nG/tmp/artifacts/cldrdata-gclqV9lOGqQOKesG-a6TAUTGEYlyIDqpyd4M_k7gtWo.jar\022@81c96a57d94e1aa40e29eb06f9ae930144c6118972203aa9c9de0cfe4ee0b56a"
role_urn: "beam:artifact:role:staging_to:v1"
role_payload: "\n8cldrdata-gclqV9lOGqQOKesG-a6TAUTGEYlyIDqpyd4M_k7gtWo.jar"
>
dependencies: <
type_urn: "beam:artifact:type:file:v1"
type_payload: "\nD/tmp/artifacts/dnsns-byzoQxdXengTvA5IlbH9gSIzfhNQElRYltuMJN0vjcc.jar\022@6f2ce84317577a7813bc0e4895b1fd8122337e135012545896db8c24dd2f8dc7"
role_urn: "beam:artifact:role:staging_to:v1"
role_payload: "\n5dnsns-byzoQxdXengTvA5IlbH9gSIzfhNQElRYltuMJN0vjcc.jar"
>
dependencies: <
type_urn: "beam:artifact:type:file:v1"
type_payload: "\nr/tmp/artifacts/beam-sdks-java-io-expansion-service-2.42.0-SNAPSHOT-Nc2I3ZhyT7-oyDTgQHRgxjZOKatpiGcPr_Q6tpt-fkg.jar\022@35cd88dd98724fbfa8c834e0407460c6364e29ab6988670faff43ab69b7e7e48"
role_urn: "beam:artifact:role:staging_to:v1"
role_payload: "\ncbeam-sdks-java-io-expansion-service-2.42.0-SNAPSHOT-Nc2I3ZhyT7-oyDTgQHRgxjZOKatpiGcPr_Q6tpt-fkg.jar"
>
>
>
>
root_transform_ids: "s1"
root_transform_ids: "e4"
root_transform_ids: "e5"
root_transform_ids: "s3"
requirements: "beam:requirement:pardo:splittable_dofn:v1"
2022/08/14 08:37:02 Cross-compiling <https://ci-beam.apache.org/job/beam_PostCommit_XVR_Spark3/ws/src/sdks/go/test/integration/io/xlang/kafka/kafka_test.go> as /tmp/worker-2-1660466222214322431
2022/08/14 08:37:03 Prepared job with id: go-testkafkaio_basicreadwrite-182_d498ac9a-2b3b-4a49-8d09-5c808d762b87 and staging token: go-testkafkaio_basicreadwrite-182_d498ac9a-2b3b-4a49-8d09-5c808d762b87
2022/08/14 08:37:03 Staged binary artifact with token:
2022/08/14 08:37:03 Submitted job: go0testkafkaio0basicreadwrite0182-jenkins-0814083703-ffa84495_dc562cf3-5d8e-4975-a243-2ce759a658b5
2022/08/14 08:37:03 Job state: STOPPED
2022/08/14 08:37:03 Job state: STARTING
2022/08/14 08:37:03 Job state: RUNNING
2022/08/14 08:37:26 Job state: DONE
2022/08/14 08:37:26 Warning: 6 errors during metrics processing: [failed to deduce Step from MonitoringInfo: urn:"beam:metric:element_count:v1" type:"beam:metrics:sum_int64:v1" payload:"\x01" labels:{key:"PCOLLECTION" value:"jlmOPnnVWtExternal/KafkaIO.Read/KafkaIO.Read.ReadFromKafkaViaUnbounded/Read(KafkaUnboundedSource)/Create/Read(CreateSource)/ParDo(OutputSingleSource)/ParMultiDo(OutputSingleSource).output/SplitAndSize0"} failed to deduce Step from MonitoringInfo: urn:"beam:metric:sampled_byte_size:v1" type:"beam:metrics:distribution_int64:v1" payload:"\x01\xfd\"\xfd\"\xfd\"" labels:{key:"PCOLLECTION" value:"jlmOPnnVWtExternal/KafkaIO.Read/KafkaIO.Read.ReadFromKafkaViaUnbounded/Read(KafkaUnboundedSource)/Create/Read(CreateSource)/ParDo(OutputSingleSource)/ParMultiDo(OutputSingleSource).output/SplitAndSize0"} failed to deduce Step from MonitoringInfo: urn:"beam:metric:element_count:v1" type:"beam:metrics:sum_int64:v1" payload:"\x01" labels:{key:"PCOLLECTION" value:"jlmOPnnVWtExternal/KafkaIO.Read/KafkaIO.Read.ReadFromKafkaViaUnbounded/Read(KafkaUnboundedSource)/Create/Read(CreateSource)/ParDo(OutputSingleSource)/ParMultiDo(OutputSingleSource).output/SplitAndSize0"} failed to deduce Step from MonitoringInfo: urn:"beam:metric:element_count:v1" type:"beam:metrics:sum_int64:v1" payload:"\x01" labels:{key:"PCOLLECTION" value:"jlmOPnnVWtExternal/KafkaIO.Read/KafkaIO.Read.ReadFromKafkaViaUnbounded/Read(KafkaUnboundedSource)/Create/Read(CreateSource)/ParDo(OutputSingleSource)/ParMultiDo(OutputSingleSource).output/PairWithRestriction0"} failed to deduce Step from MonitoringInfo: urn:"beam:metric:sampled_byte_size:v1" type:"beam:metrics:distribution_int64:v1" payload:"\x01\xf8\"\xf8\"\xf8\"" labels:{key:"PCOLLECTION" value:"jlmOPnnVWtExternal/KafkaIO.Read/KafkaIO.Read.ReadFromKafkaViaUnbounded/Read(KafkaUnboundedSource)/Create/Read(CreateSource)/ParDo(OutputSingleSource)/ParMultiDo(OutputSingleSource).output/SplitAndSize0"} failed to deduce Step from MonitoringInfo: urn:"beam:metric:sampled_byte_size:v1" type:"beam:metrics:distribution_int64:v1" payload:"\x01\xf0\"\xf0\"\xf0\"" labels:{key:"PCOLLECTION" value:"jlmOPnnVWtExternal/KafkaIO.Read/KafkaIO.Read.ReadFromKafkaViaUnbounded/Read(KafkaUnboundedSource)/Create/Read(CreateSource)/ParDo(OutputSingleSource)/ParMultiDo(OutputSingleSource).output/PairWithRestriction0"}]
--- PASS: TestKafkaIO_BasicReadWrite (39.37s)
PASS
ok github.com/apache/beam/sdks/v2/go/test/integration/io/xlang/kafka 45.397s
> Task :runners:spark:3:job-server:validatesCrossLanguageRunnerJavaUsingPython
org.apache.beam.runners.core.construction.ValidateRunnerXlangTest$SingleInputOutputTest > test FAILED
java.lang.RuntimeException at ValidateRunnerXlangTest.java:242
java.lang.NullPointerException at Preconditions.java:980
14 tests completed, 1 failed
> Task :runners:spark:3:job-server:validatesCrossLanguageRunnerJavaUsingPython FAILED
> Task :runners:spark:3:job-server:validatesCrossLanguageRunnerPythonUsingJava
> Task :runners:spark:3:job-server:validatesCrossLanguageRunnerPythonUsingSql
> Task :runners:spark:3:job-server:validatesCrossLanguageRunnerCleanup
> Task :runners:spark:3:job-server:sparkJobServerCleanup
FAILURE: Build failed with an exception.
* What went wrong:
Execution failed for task ':runners:spark:3:job-server:validatesCrossLanguageRunnerJavaUsingPython'.
> There were failing tests. See the report at: file://<https://ci-beam.apache.org/job/beam_PostCommit_XVR_Spark3/ws/src/runners/spark/3/job-server/build/reports/tests/validatesCrossLanguageRunnerJavaUsingPython/index.html>
* Try:
> Run with --stacktrace option to get the stack trace.
> Run with --info or --debug option to get more log output.
> Run with --scan to get full insights.
* Get more help at https://help.gradle.org
Deprecated Gradle features were used in this build, making it incompatible with Gradle 8.0.
You can use '--warning-mode all' to show the individual deprecation warnings and determine if they come from your own scripts or plugins.
See https://docs.gradle.org/7.4/userguide/command_line_interface.html#sec:command_line_warnings
Execution optimizations have been disabled for 1 invalid unit(s) of work during this build to ensure correctness.
Please consult deprecation warnings for more details.
BUILD FAILED in 32m 26s
263 actionable tasks: 173 executed, 78 from cache, 12 up-to-date
Publishing build scan...
https://gradle.com/s/vrcrg32wap6gs
Build step 'Invoke Gradle script' changed build result to FAILURE
Build step 'Invoke Gradle script' marked build as failure
---------------------------------------------------------------------
To unsubscribe, e-mail: builds-unsubscribe@beam.apache.org
For additional commands, e-mail: builds-help@beam.apache.org
Build failed in Jenkins: beam_PostCommit_XVR_Spark3 #2008
Posted by Apache Jenkins Server <je...@builds.apache.org>.
See <https://ci-beam.apache.org/job/beam_PostCommit_XVR_Spark3/2008/display/redirect>
Changes:
------------------------------------------
[...truncated 1.02 MB...]
coders: <
key: "ErQPhfTDKNTimestampedValueCoder"
value: <
spec: <
urn: "beam:coders:javasdk:0.1"
payload: "\202SNAPPY\000\000\000\000\001\000\000\000\001\000\000\001?\315\003\270\254\355\000\005sr\000Aorg.apache.beam.sdk.values.TimestampedV\001\022\000$>\021\000LCoder\364\376\202p\274iX-\002\000\001L\000\nv\001)\005\030\034t\000\"Lorg/\t]\000/\001],/sdk/coders/\005$\020;xr\000*N\202\000\t%(.Structured\005/8s\277\022\016\325\3246\021\002\000\000xr\000 j9\000\005/\034C\335\325\211\256\274~\370\001/\020psr\000,j1\000(Serializabl\t\277\034\010\364 \216\305ynl\005\327\\\004typet\000\021Ljava/lang/Class\001\300\000&jV\000\024Custom\005\215Pj\260\010\235\013;\035\013\002\000\000xq\000~\000\003vr\000;N;\000Pio.BoundedReadFromUnb\t\021`Source$Shardd\236\240U\205\000j\363\002\000\000xp"
>
>
>
coders: <
key: "ErQPhfTDKNValueWithRecordIdCoder"
value: <
spec: <
urn: "beam:coders:javasdk:0.1"
payload: "\202SNAPPY\000\000\000\000\001\000\000\000\001\000\000\001\213\311\005\320\254\355\000\005sr\000Corg.apache.beam.sdk.values.ValueWithRecordId$B\022\000LCoder{\343\376bQ\014\204>\002\000\002L\000\007i\t\025\034t\000+Lorg/\t\\\000/\001\\\024/sdk/c\0012(s/ByteArray\005B\014;L\000\n\005u\005\016\010t\000\"n;\000\005$\020;xr\000*N\274\000\t`(.Structured\005/8s\277\022\016\325\3246\021\002\000\000xr\000 j9\000\005/\034C\335\325\211\256\274~\370\001/\020psr\000)j1\0006\312\000\034\351\277\005|\263\3746\333\001:\010r\000&j8\000\024Atomic\005o\034\307\354\265\314\205tPF\0015 q\000~\000\003sr\000-N;\000$io.kafka.K\001\006\000R%\227\005B<I\320\251Y\032\341{#\002\000\001L\000\007kv\005\025\010t\000$nH\001\000K\t&\000;\025s\000\"Ns\000-P\r- j\000\275\271\035\243\3126\002!\353\010\010ke)\277\001\264\000\0022\303\001\005\022\025Y\000(jY\000\030Nullabl)\372\034E\333\0336>\220\247\007\005\307]\022.O\000\001\014,\006sq\000~\000\016q\000~\000\020"
>
>
>
coders: <
key: "ErQPhfTDKNVarIntCoder"
value: <
spec: <
urn: "beam:coders:javasdk:0.1"
payload: "\202SNAPPY\000\000\000\000\001\000\000\000\001\000\000\000\210\330\001\350\254\355\000\005sr\000&org.apache.beam.sdk.coders.VarIntCoder\300K2\332\251KVh\002\000\000xrr5\000\024Atomic\0055 \307\354\265\314\205tPF\002\0055\000*jj\000$Structured\0059\034s\277\022\016\325\3246\021\t9\000 j9\000\005/0C\335\325\211\256\274~\370\002\000\000xp"
>
>
>
coders: <
key: "ErQPhfTDKNVoidCoder"
value: <
spec: <
urn: "beam:coders:javasdk:0.1"
payload: "\202SNAPPY\000\000\000\000\001\000\000\000\001\000\000\000\210\326\001\350\254\355\000\005sr\000$org.apache.beam.sdk.coders.VoidCoder\271\277U\233\350\r\257U\002\000\000xr\000&j3\000\024Atomic\0055 \307\354\265\314\205tPF\002\0055\000*j5\000$Structured\0059\034s\277\022\016\325\3246\021\t9\000 j9\000\005/0C\335\325\211\256\274~\370\002\000\000xp"
>
>
>
coders: <
key: "c0"
value: <
spec: <
urn: "beam:coder:bytes:v1"
>
>
>
coders: <
key: "c1"
value: <
spec: <
urn: "beam:coder:global_window:v1"
>
>
>
coders: <
key: "c2"
value: <
spec: <
urn: "beam:go:coder:custom:v1"
payload: "Cgd2YXJpbnR6EgIIAhpdCklnaXRodWIuY29tL2FwYWNoZS9iZWFtL3Nka3MvdjIvZ28vcGtnL2JlYW0vY29yZS9ydW50aW1lL2NvZGVyeC5lbmNWYXJJbnRaEhAIFiIECBlADyoGCBQSAggIImkKSWdpdGh1Yi5jb20vYXBhY2hlL2JlYW0vc2Rrcy92Mi9nby9wa2cvYmVhbS9jb3JlL3J1bnRpbWUvY29kZXJ4LmRlY1ZhckludFoSHAgWIgQIGUADIgYIFBICCAgqBAgZQA8qBAgZQAE="
>
>
>
coders: <
key: "c3"
value: <
spec: <
urn: "beam:coder:length_prefix:v1"
>
component_coder_ids: "c2"
>
>
coders: <
key: "c4"
value: <
spec: <
urn: "beam:coder:kv:v1"
>
component_coder_ids: "c0"
component_coder_ids: "c0"
>
>
environments: <
key: "ErQPhfTDKNbeam:env:docker:v1"
value: <
urn: "beam:env:docker:v1"
payload: "\n apache/beam_java8_sdk:2.42.0.dev"
capabilities: "beam:coder:bytes:v1"
capabilities: "beam:coder:bool:v1"
capabilities: "beam:coder:varint:v1"
capabilities: "beam:coder:string_utf8:v1"
capabilities: "beam:coder:iterable:v1"
capabilities: "beam:coder:timer:v1"
capabilities: "beam:coder:kv:v1"
capabilities: "beam:coder:length_prefix:v1"
capabilities: "beam:coder:global_window:v1"
capabilities: "beam:coder:interval_window:v1"
capabilities: "beam:coder:custom_window:v1"
capabilities: "beam:coder:windowed_value:v1"
capabilities: "beam:coder:double:v1"
capabilities: "beam:coder:row:v1"
capabilities: "beam:coder:param_windowed_value:v1"
capabilities: "beam:coder:state_backed_iterable:v1"
capabilities: "beam:coder:sharded_key:v1"
capabilities: "beam:coder:nullable:v1"
capabilities: "beam:protocol:multi_core_bundle_processing:v1"
capabilities: "beam:protocol:progress_reporting:v1"
capabilities: "beam:protocol:harness_monitoring_infos:v1"
capabilities: "beam:protocol:control_request_elements_embedding:v1"
capabilities: "beam:protocol:state_caching:v1"
capabilities: "beam:version:sdk_base:apache/beam_java8_sdk:2.42.0.dev"
capabilities: "beam:transform:sdf_truncate_sized_restrictions:v1"
capabilities: "beam:transform:to_string:v1"
dependencies: <
type_urn: "beam:artifact:type:file:v1"
type_payload: "\nL/tmp/artifacts/icedtea-sound-CGRxIE9edPHnbxQhM-L5mp8h21H-ySB79uQtSquPV_Q.jar\022@086471204f5e74f1e76f142133e2f99a9f21db51fec9207bf6e42d4aab8f57f4"
role_urn: "beam:artifact:role:staging_to:v1"
role_payload: "\n=icedtea-sound-CGRxIE9edPHnbxQhM-L5mp8h21H-ySB79uQtSquPV_Q.jar"
>
dependencies: <
type_urn: "beam:artifact:type:file:v1"
type_payload: "\nF/tmp/artifacts/jaccess-FBI0Bb27lF3oEBieWAi7SP8X1zBR8k4BJQOVpsoK9a0.jar\022@14123405bdbb945de810189e5808bb48ff17d73051f24e01250395a6ca0af5ad"
role_urn: "beam:artifact:role:staging_to:v1"
role_payload: "\n7jaccess-FBI0Bb27lF3oEBieWAi7SP8X1zBR8k4BJQOVpsoK9a0.jar"
>
dependencies: <
type_urn: "beam:artifact:type:file:v1"
type_payload: "\nI/tmp/artifacts/localedata-kJ2mc8rBH5-IklhfR1XzNotlIQ_mnVMA-pgaXv2r8Ag.jar\022@909da673cac11f9f8892585f4755f3368b65210fe69d5300fa981a5efdabf008"
role_urn: "beam:artifact:role:staging_to:v1"
role_payload: "\n:localedata-kJ2mc8rBH5-IklhfR1XzNotlIQ_mnVMA-pgaXv2r8Ag.jar"
>
dependencies: <
type_urn: "beam:artifact:type:file:v1"
type_payload: "\nF/tmp/artifacts/nashorn-B0CAb3QpJET_6VsT3hcC_89VtvhV616H8N2bHAIaqWo.jar\022@0740806f74292444ffe95b13de1702ffcf55b6f855eb5e87f0dd9b1c021aa96a"
role_urn: "beam:artifact:role:staging_to:v1"
role_payload: "\n7nashorn-B0CAb3QpJET_6VsT3hcC_89VtvhV616H8N2bHAIaqWo.jar"
>
dependencies: <
type_urn: "beam:artifact:type:file:v1"
type_payload: "\nG/tmp/artifacts/cldrdata-gclqV9lOGqQOKesG-a6TAUTGEYlyIDqpyd4M_k7gtWo.jar\022@81c96a57d94e1aa40e29eb06f9ae930144c6118972203aa9c9de0cfe4ee0b56a"
role_urn: "beam:artifact:role:staging_to:v1"
role_payload: "\n8cldrdata-gclqV9lOGqQOKesG-a6TAUTGEYlyIDqpyd4M_k7gtWo.jar"
>
dependencies: <
type_urn: "beam:artifact:type:file:v1"
type_payload: "\nD/tmp/artifacts/dnsns-byzoQxdXengTvA5IlbH9gSIzfhNQElRYltuMJN0vjcc.jar\022@6f2ce84317577a7813bc0e4895b1fd8122337e135012545896db8c24dd2f8dc7"
role_urn: "beam:artifact:role:staging_to:v1"
role_payload: "\n5dnsns-byzoQxdXengTvA5IlbH9gSIzfhNQElRYltuMJN0vjcc.jar"
>
dependencies: <
type_urn: "beam:artifact:type:file:v1"
type_payload: "\nr/tmp/artifacts/beam-sdks-java-io-expansion-service-2.42.0-SNAPSHOT-Nc2I3ZhyT7-oyDTgQHRgxjZOKatpiGcPr_Q6tpt-fkg.jar\022@35cd88dd98724fbfa8c834e0407460c6364e29ab6988670faff43ab69b7e7e48"
role_urn: "beam:artifact:role:staging_to:v1"
role_payload: "\ncbeam-sdks-java-io-expansion-service-2.42.0-SNAPSHOT-Nc2I3ZhyT7-oyDTgQHRgxjZOKatpiGcPr_Q6tpt-fkg.jar"
>
>
>
environments: <
key: "go"
value: <
urn: "beam:env:docker:v1"
payload: "\n\026apache/beam_go_sdk:dev"
capabilities: "beam:protocol:progress_reporting:v1"
capabilities: "beam:protocol:multi_core_bundle_processing:v1"
capabilities: "beam:transform:sdf_truncate_sized_restrictions:v1"
capabilities: "beam:protocol:worker_status:v1"
capabilities: "beam:protocol:monitoring_info_short_ids:v1"
capabilities: "beam:version:sdk_base:go"
capabilities: "beam:coder:bytes:v1"
capabilities: "beam:coder:bool:v1"
capabilities: "beam:coder:varint:v1"
capabilities: "beam:coder:double:v1"
capabilities: "beam:coder:string_utf8:v1"
capabilities: "beam:coder:length_prefix:v1"
capabilities: "beam:coder:kv:v1"
capabilities: "beam:coder:iterable:v1"
capabilities: "beam:coder:state_backed_iterable:v1"
capabilities: "beam:coder:windowed_value:v1"
capabilities: "beam:coder:global_window:v1"
capabilities: "beam:coder:interval_window:v1"
capabilities: "beam:coder:row:v1"
capabilities: "beam:coder:nullable:v1"
dependencies: <
type_urn: "beam:artifact:type:file:v1"
role_urn: "beam:artifact:role:go_worker_binary:v1"
>
>
>
>
root_transform_ids: "e4"
root_transform_ids: "s1"
root_transform_ids: "e5"
root_transform_ids: "s3"
requirements: "beam:requirement:pardo:splittable_dofn:v1"
2022/08/14 02:36:51 Cross-compiling <https://ci-beam.apache.org/job/beam_PostCommit_XVR_Spark3/ws/src/sdks/go/test/integration/io/xlang/kafka/kafka_test.go> as /tmp/worker-2-1660444611992101737
2022/08/14 02:36:53 Prepared job with id: go-testkafkaio_basicreadwrite-562_dda88693-aae3-4dd4-972c-33ab25ccefaf and staging token: go-testkafkaio_basicreadwrite-562_dda88693-aae3-4dd4-972c-33ab25ccefaf
2022/08/14 02:36:53 Staged binary artifact with token:
2022/08/14 02:36:53 Submitted job: go0testkafkaio0basicreadwrite0562-jenkins-0814023653-8720773_b8baa26f-e064-45f7-9f62-58ac162ad6a6
2022/08/14 02:36:53 Job state: STOPPED
2022/08/14 02:36:53 Job state: STARTING
2022/08/14 02:36:53 Job state: RUNNING
2022/08/14 02:37:16 Job state: DONE
2022/08/14 02:37:16 Warning: 6 errors during metrics processing: [failed to deduce Step from MonitoringInfo: urn:"beam:metric:element_count:v1" type:"beam:metrics:sum_int64:v1" payload:"\x01" labels:{key:"PCOLLECTION" value:"ErQPhfTDKNExternal/KafkaIO.Read/KafkaIO.Read.ReadFromKafkaViaUnbounded/Read(KafkaUnboundedSource)/Create/Read(CreateSource)/ParDo(OutputSingleSource)/ParMultiDo(OutputSingleSource).output/SplitAndSize0"} failed to deduce Step from MonitoringInfo: urn:"beam:metric:sampled_byte_size:v1" type:"beam:metrics:distribution_int64:v1" payload:"\x01\xfd\"\xfd\"\xfd\"" labels:{key:"PCOLLECTION" value:"ErQPhfTDKNExternal/KafkaIO.Read/KafkaIO.Read.ReadFromKafkaViaUnbounded/Read(KafkaUnboundedSource)/Create/Read(CreateSource)/ParDo(OutputSingleSource)/ParMultiDo(OutputSingleSource).output/SplitAndSize0"} failed to deduce Step from MonitoringInfo: urn:"beam:metric:element_count:v1" type:"beam:metrics:sum_int64:v1" payload:"\x01" labels:{key:"PCOLLECTION" value:"ErQPhfTDKNExternal/KafkaIO.Read/KafkaIO.Read.ReadFromKafkaViaUnbounded/Read(KafkaUnboundedSource)/Create/Read(CreateSource)/ParDo(OutputSingleSource)/ParMultiDo(OutputSingleSource).output/SplitAndSize0"} failed to deduce Step from MonitoringInfo: urn:"beam:metric:element_count:v1" type:"beam:metrics:sum_int64:v1" payload:"\x01" labels:{key:"PCOLLECTION" value:"ErQPhfTDKNExternal/KafkaIO.Read/KafkaIO.Read.ReadFromKafkaViaUnbounded/Read(KafkaUnboundedSource)/Create/Read(CreateSource)/ParDo(OutputSingleSource)/ParMultiDo(OutputSingleSource).output/PairWithRestriction0"} failed to deduce Step from MonitoringInfo: urn:"beam:metric:sampled_byte_size:v1" type:"beam:metrics:distribution_int64:v1" payload:"\x01\xf8\"\xf8\"\xf8\"" labels:{key:"PCOLLECTION" value:"ErQPhfTDKNExternal/KafkaIO.Read/KafkaIO.Read.ReadFromKafkaViaUnbounded/Read(KafkaUnboundedSource)/Create/Read(CreateSource)/ParDo(OutputSingleSource)/ParMultiDo(OutputSingleSource).output/SplitAndSize0"} failed to deduce Step from MonitoringInfo: urn:"beam:metric:sampled_byte_size:v1" type:"beam:metrics:distribution_int64:v1" payload:"\x01\xf0\"\xf0\"\xf0\"" labels:{key:"PCOLLECTION" value:"ErQPhfTDKNExternal/KafkaIO.Read/KafkaIO.Read.ReadFromKafkaViaUnbounded/Read(KafkaUnboundedSource)/Create/Read(CreateSource)/ParDo(OutputSingleSource)/ParMultiDo(OutputSingleSource).output/PairWithRestriction0"}]
--- PASS: TestKafkaIO_BasicReadWrite (39.82s)
PASS
ok github.com/apache/beam/sdks/v2/go/test/integration/io/xlang/kafka 45.849s
> Task :runners:spark:3:job-server:validatesCrossLanguageRunnerJavaUsingPython
org.apache.beam.runners.core.construction.ValidateRunnerXlangTest$SingleInputOutputTest > test FAILED
java.lang.RuntimeException at ValidateRunnerXlangTest.java:242
java.lang.NullPointerException at Preconditions.java:980
14 tests completed, 1 failed
> Task :runners:spark:3:job-server:validatesCrossLanguageRunnerJavaUsingPython FAILED
> Task :runners:spark:3:job-server:validatesCrossLanguageRunnerPythonUsingJava
> Task :runners:spark:3:job-server:validatesCrossLanguageRunnerPythonUsingSql
> Task :runners:spark:3:job-server:validatesCrossLanguageRunnerCleanup
> Task :runners:spark:3:job-server:sparkJobServerCleanup
FAILURE: Build failed with an exception.
* What went wrong:
Execution failed for task ':runners:spark:3:job-server:validatesCrossLanguageRunnerJavaUsingPython'.
> There were failing tests. See the report at: file://<https://ci-beam.apache.org/job/beam_PostCommit_XVR_Spark3/ws/src/runners/spark/3/job-server/build/reports/tests/validatesCrossLanguageRunnerJavaUsingPython/index.html>
* Try:
> Run with --stacktrace option to get the stack trace.
> Run with --info or --debug option to get more log output.
> Run with --scan to get full insights.
* Get more help at https://help.gradle.org
Deprecated Gradle features were used in this build, making it incompatible with Gradle 8.0.
You can use '--warning-mode all' to show the individual deprecation warnings and determine if they come from your own scripts or plugins.
See https://docs.gradle.org/7.4/userguide/command_line_interface.html#sec:command_line_warnings
Execution optimizations have been disabled for 1 invalid unit(s) of work during this build to ensure correctness.
Please consult deprecation warnings for more details.
BUILD FAILED in 32m 11s
263 actionable tasks: 173 executed, 78 from cache, 12 up-to-date
Publishing build scan...
https://gradle.com/s/bkz5x22ss2ico
Build step 'Invoke Gradle script' changed build result to FAILURE
Build step 'Invoke Gradle script' marked build as failure
---------------------------------------------------------------------
To unsubscribe, e-mail: builds-unsubscribe@beam.apache.org
For additional commands, e-mail: builds-help@beam.apache.org
Build failed in Jenkins: beam_PostCommit_XVR_Spark3 #2007
Posted by Apache Jenkins Server <je...@builds.apache.org>.
See <https://ci-beam.apache.org/job/beam_PostCommit_XVR_Spark3/2007/display/redirect>
Changes:
------------------------------------------
[...truncated 1.03 MB...]
coders: <
key: "UcRSLtoEzuTimestampedValueCoder"
value: <
spec: <
urn: "beam:coders:javasdk:0.1"
payload: "\202SNAPPY\000\000\000\000\001\000\000\000\001\000\000\001?\315\003\270\254\355\000\005sr\000Aorg.apache.beam.sdk.values.TimestampedV\001\022\000$>\021\000LCoder\364\376\202p\274iX-\002\000\001L\000\nv\001)\005\030\034t\000\"Lorg/\t]\000/\001],/sdk/coders/\005$\020;xr\000*N\202\000\t%(.Structured\005/8s\277\022\016\325\3246\021\002\000\000xr\000 j9\000\005/\034C\335\325\211\256\274~\370\001/\020psr\000,j1\000(Serializabl\t\277\034\010\364 \216\305ynl\005\327\\\004typet\000\021Ljava/lang/Class\001\300\000&jV\000\024Custom\005\215Pj\260\010\235\013;\035\013\002\000\000xq\000~\000\003vr\000;N;\000Pio.BoundedReadFromUnb\t\021`Source$Shardd\236\240U\205\000j\363\002\000\000xp"
>
>
>
coders: <
key: "UcRSLtoEzuValueWithRecordIdCoder"
value: <
spec: <
urn: "beam:coders:javasdk:0.1"
payload: "\202SNAPPY\000\000\000\000\001\000\000\000\001\000\000\001\213\311\005\320\254\355\000\005sr\000Corg.apache.beam.sdk.values.ValueWithRecordId$B\022\000LCoder{\343\376bQ\014\204>\002\000\002L\000\007i\t\025\034t\000+Lorg/\t\\\000/\001\\\024/sdk/c\0012(s/ByteArray\005B\014;L\000\n\005u\005\016\010t\000\"n;\000\005$\020;xr\000*N\274\000\t`(.Structured\005/8s\277\022\016\325\3246\021\002\000\000xr\000 j9\000\005/\034C\335\325\211\256\274~\370\001/\020psr\000)j1\0006\312\000\034\351\277\005|\263\3746\333\001:\010r\000&j8\000\024Atomic\005o\034\307\354\265\314\205tPF\0015 q\000~\000\003sr\000-N;\000$io.kafka.K\001\006\000R%\227\005B<I\320\251Y\032\341{#\002\000\001L\000\007kv\005\025\010t\000$nH\001\000K\t&\000;\025s\000\"Ns\000-P\r- j\000\275\271\035\243\3126\002!\353\010\010ke)\277\001\264\000\0022\303\001\005\022\025Y\000(jY\000\030Nullabl)\372\034E\333\0336>\220\247\007\005\307]\022.O\000\001\014,\006sq\000~\000\016q\000~\000\020"
>
>
>
coders: <
key: "UcRSLtoEzuVarIntCoder"
value: <
spec: <
urn: "beam:coders:javasdk:0.1"
payload: "\202SNAPPY\000\000\000\000\001\000\000\000\001\000\000\000\210\330\001\350\254\355\000\005sr\000&org.apache.beam.sdk.coders.VarIntCoder\300K2\332\251KVh\002\000\000xrr5\000\024Atomic\0055 \307\354\265\314\205tPF\002\0055\000*jj\000$Structured\0059\034s\277\022\016\325\3246\021\t9\000 j9\000\005/0C\335\325\211\256\274~\370\002\000\000xp"
>
>
>
coders: <
key: "UcRSLtoEzuVoidCoder"
value: <
spec: <
urn: "beam:coders:javasdk:0.1"
payload: "\202SNAPPY\000\000\000\000\001\000\000\000\001\000\000\000\210\326\001\350\254\355\000\005sr\000$org.apache.beam.sdk.coders.VoidCoder\271\277U\233\350\r\257U\002\000\000xr\000&j3\000\024Atomic\0055 \307\354\265\314\205tPF\002\0055\000*j5\000$Structured\0059\034s\277\022\016\325\3246\021\t9\000 j9\000\005/0C\335\325\211\256\274~\370\002\000\000xp"
>
>
>
coders: <
key: "c0"
value: <
spec: <
urn: "beam:coder:bytes:v1"
>
>
>
coders: <
key: "c1"
value: <
spec: <
urn: "beam:coder:global_window:v1"
>
>
>
coders: <
key: "c2"
value: <
spec: <
urn: "beam:go:coder:custom:v1"
payload: "Cgd2YXJpbnR6EgIIAhpdCklnaXRodWIuY29tL2FwYWNoZS9iZWFtL3Nka3MvdjIvZ28vcGtnL2JlYW0vY29yZS9ydW50aW1lL2NvZGVyeC5lbmNWYXJJbnRaEhAIFiIECBlADyoGCBQSAggIImkKSWdpdGh1Yi5jb20vYXBhY2hlL2JlYW0vc2Rrcy92Mi9nby9wa2cvYmVhbS9jb3JlL3J1bnRpbWUvY29kZXJ4LmRlY1ZhckludFoSHAgWIgQIGUADIgYIFBICCAgqBAgZQA8qBAgZQAE="
>
>
>
coders: <
key: "c3"
value: <
spec: <
urn: "beam:coder:length_prefix:v1"
>
component_coder_ids: "c2"
>
>
coders: <
key: "c4"
value: <
spec: <
urn: "beam:coder:kv:v1"
>
component_coder_ids: "c0"
component_coder_ids: "c0"
>
>
environments: <
key: "UcRSLtoEzubeam:env:docker:v1"
value: <
urn: "beam:env:docker:v1"
payload: "\n apache/beam_java8_sdk:2.42.0.dev"
capabilities: "beam:coder:bytes:v1"
capabilities: "beam:coder:bool:v1"
capabilities: "beam:coder:varint:v1"
capabilities: "beam:coder:string_utf8:v1"
capabilities: "beam:coder:iterable:v1"
capabilities: "beam:coder:timer:v1"
capabilities: "beam:coder:kv:v1"
capabilities: "beam:coder:length_prefix:v1"
capabilities: "beam:coder:global_window:v1"
capabilities: "beam:coder:interval_window:v1"
capabilities: "beam:coder:custom_window:v1"
capabilities: "beam:coder:windowed_value:v1"
capabilities: "beam:coder:double:v1"
capabilities: "beam:coder:row:v1"
capabilities: "beam:coder:param_windowed_value:v1"
capabilities: "beam:coder:state_backed_iterable:v1"
capabilities: "beam:coder:sharded_key:v1"
capabilities: "beam:coder:nullable:v1"
capabilities: "beam:protocol:multi_core_bundle_processing:v1"
capabilities: "beam:protocol:progress_reporting:v1"
capabilities: "beam:protocol:harness_monitoring_infos:v1"
capabilities: "beam:protocol:control_request_elements_embedding:v1"
capabilities: "beam:protocol:state_caching:v1"
capabilities: "beam:version:sdk_base:apache/beam_java8_sdk:2.42.0.dev"
capabilities: "beam:transform:sdf_truncate_sized_restrictions:v1"
capabilities: "beam:transform:to_string:v1"
dependencies: <
type_urn: "beam:artifact:type:file:v1"
type_payload: "\nL/tmp/artifacts/icedtea-sound-CGRxIE9edPHnbxQhM-L5mp8h21H-ySB79uQtSquPV_Q.jar\022@086471204f5e74f1e76f142133e2f99a9f21db51fec9207bf6e42d4aab8f57f4"
role_urn: "beam:artifact:role:staging_to:v1"
role_payload: "\n=icedtea-sound-CGRxIE9edPHnbxQhM-L5mp8h21H-ySB79uQtSquPV_Q.jar"
>
dependencies: <
type_urn: "beam:artifact:type:file:v1"
type_payload: "\nF/tmp/artifacts/jaccess-FBI0Bb27lF3oEBieWAi7SP8X1zBR8k4BJQOVpsoK9a0.jar\022@14123405bdbb945de810189e5808bb48ff17d73051f24e01250395a6ca0af5ad"
role_urn: "beam:artifact:role:staging_to:v1"
role_payload: "\n7jaccess-FBI0Bb27lF3oEBieWAi7SP8X1zBR8k4BJQOVpsoK9a0.jar"
>
dependencies: <
type_urn: "beam:artifact:type:file:v1"
type_payload: "\nI/tmp/artifacts/localedata-kJ2mc8rBH5-IklhfR1XzNotlIQ_mnVMA-pgaXv2r8Ag.jar\022@909da673cac11f9f8892585f4755f3368b65210fe69d5300fa981a5efdabf008"
role_urn: "beam:artifact:role:staging_to:v1"
role_payload: "\n:localedata-kJ2mc8rBH5-IklhfR1XzNotlIQ_mnVMA-pgaXv2r8Ag.jar"
>
dependencies: <
type_urn: "beam:artifact:type:file:v1"
type_payload: "\nF/tmp/artifacts/nashorn-B0CAb3QpJET_6VsT3hcC_89VtvhV616H8N2bHAIaqWo.jar\022@0740806f74292444ffe95b13de1702ffcf55b6f855eb5e87f0dd9b1c021aa96a"
role_urn: "beam:artifact:role:staging_to:v1"
role_payload: "\n7nashorn-B0CAb3QpJET_6VsT3hcC_89VtvhV616H8N2bHAIaqWo.jar"
>
dependencies: <
type_urn: "beam:artifact:type:file:v1"
type_payload: "\nG/tmp/artifacts/cldrdata-gclqV9lOGqQOKesG-a6TAUTGEYlyIDqpyd4M_k7gtWo.jar\022@81c96a57d94e1aa40e29eb06f9ae930144c6118972203aa9c9de0cfe4ee0b56a"
role_urn: "beam:artifact:role:staging_to:v1"
role_payload: "\n8cldrdata-gclqV9lOGqQOKesG-a6TAUTGEYlyIDqpyd4M_k7gtWo.jar"
>
dependencies: <
type_urn: "beam:artifact:type:file:v1"
type_payload: "\nD/tmp/artifacts/dnsns-byzoQxdXengTvA5IlbH9gSIzfhNQElRYltuMJN0vjcc.jar\022@6f2ce84317577a7813bc0e4895b1fd8122337e135012545896db8c24dd2f8dc7"
role_urn: "beam:artifact:role:staging_to:v1"
role_payload: "\n5dnsns-byzoQxdXengTvA5IlbH9gSIzfhNQElRYltuMJN0vjcc.jar"
>
dependencies: <
type_urn: "beam:artifact:type:file:v1"
type_payload: "\nr/tmp/artifacts/beam-sdks-java-io-expansion-service-2.42.0-SNAPSHOT-Nc2I3ZhyT7-oyDTgQHRgxjZOKatpiGcPr_Q6tpt-fkg.jar\022@35cd88dd98724fbfa8c834e0407460c6364e29ab6988670faff43ab69b7e7e48"
role_urn: "beam:artifact:role:staging_to:v1"
role_payload: "\ncbeam-sdks-java-io-expansion-service-2.42.0-SNAPSHOT-Nc2I3ZhyT7-oyDTgQHRgxjZOKatpiGcPr_Q6tpt-fkg.jar"
>
>
>
environments: <
key: "go"
value: <
urn: "beam:env:docker:v1"
payload: "\n\026apache/beam_go_sdk:dev"
capabilities: "beam:protocol:progress_reporting:v1"
capabilities: "beam:protocol:multi_core_bundle_processing:v1"
capabilities: "beam:transform:sdf_truncate_sized_restrictions:v1"
capabilities: "beam:protocol:worker_status:v1"
capabilities: "beam:protocol:monitoring_info_short_ids:v1"
capabilities: "beam:version:sdk_base:go"
capabilities: "beam:coder:bytes:v1"
capabilities: "beam:coder:bool:v1"
capabilities: "beam:coder:varint:v1"
capabilities: "beam:coder:double:v1"
capabilities: "beam:coder:string_utf8:v1"
capabilities: "beam:coder:length_prefix:v1"
capabilities: "beam:coder:kv:v1"
capabilities: "beam:coder:iterable:v1"
capabilities: "beam:coder:state_backed_iterable:v1"
capabilities: "beam:coder:windowed_value:v1"
capabilities: "beam:coder:global_window:v1"
capabilities: "beam:coder:interval_window:v1"
capabilities: "beam:coder:row:v1"
capabilities: "beam:coder:nullable:v1"
dependencies: <
type_urn: "beam:artifact:type:file:v1"
role_urn: "beam:artifact:role:go_worker_binary:v1"
>
>
>
>
root_transform_ids: "s1"
root_transform_ids: "e4"
root_transform_ids: "e5"
root_transform_ids: "s3"
requirements: "beam:requirement:pardo:splittable_dofn:v1"
2022/08/13 20:36:54 Cross-compiling <https://ci-beam.apache.org/job/beam_PostCommit_XVR_Spark3/ws/src/sdks/go/test/integration/io/xlang/kafka/kafka_test.go> as /tmp/worker-2-1660423014543460850
2022/08/13 20:36:56 Prepared job with id: go-testkafkaio_basicreadwrite-519_2c1622fb-e41e-4672-8276-f43fc8e8c9e2 and staging token: go-testkafkaio_basicreadwrite-519_2c1622fb-e41e-4672-8276-f43fc8e8c9e2
2022/08/13 20:36:56 Staged binary artifact with token:
2022/08/13 20:36:56 Submitted job: go0testkafkaio0basicreadwrite0519-jenkins-0813203656-18961ec9_60f7773d-ad81-498a-8fa3-10f38c9478d9
2022/08/13 20:36:56 Job state: STOPPED
2022/08/13 20:36:56 Job state: STARTING
2022/08/13 20:36:56 Job state: RUNNING
2022/08/13 20:37:18 Job state: DONE
2022/08/13 20:37:18 Warning: 6 errors during metrics processing: [failed to deduce Step from MonitoringInfo: urn:"beam:metric:element_count:v1" type:"beam:metrics:sum_int64:v1" payload:"\x01" labels:{key:"PCOLLECTION" value:"UcRSLtoEzuExternal/KafkaIO.Read/KafkaIO.Read.ReadFromKafkaViaUnbounded/Read(KafkaUnboundedSource)/Create/Read(CreateSource)/ParDo(OutputSingleSource)/ParMultiDo(OutputSingleSource).output/SplitAndSize0"} failed to deduce Step from MonitoringInfo: urn:"beam:metric:sampled_byte_size:v1" type:"beam:metrics:distribution_int64:v1" payload:"\x01\xfd\"\xfd\"\xfd\"" labels:{key:"PCOLLECTION" value:"UcRSLtoEzuExternal/KafkaIO.Read/KafkaIO.Read.ReadFromKafkaViaUnbounded/Read(KafkaUnboundedSource)/Create/Read(CreateSource)/ParDo(OutputSingleSource)/ParMultiDo(OutputSingleSource).output/SplitAndSize0"} failed to deduce Step from MonitoringInfo: urn:"beam:metric:element_count:v1" type:"beam:metrics:sum_int64:v1" payload:"\x01" labels:{key:"PCOLLECTION" value:"UcRSLtoEzuExternal/KafkaIO.Read/KafkaIO.Read.ReadFromKafkaViaUnbounded/Read(KafkaUnboundedSource)/Create/Read(CreateSource)/ParDo(OutputSingleSource)/ParMultiDo(OutputSingleSource).output/PairWithRestriction0"} failed to deduce Step from MonitoringInfo: urn:"beam:metric:element_count:v1" type:"beam:metrics:sum_int64:v1" payload:"\x01" labels:{key:"PCOLLECTION" value:"UcRSLtoEzuExternal/KafkaIO.Read/KafkaIO.Read.ReadFromKafkaViaUnbounded/Read(KafkaUnboundedSource)/Create/Read(CreateSource)/ParDo(OutputSingleSource)/ParMultiDo(OutputSingleSource).output/SplitAndSize0"} failed to deduce Step from MonitoringInfo: urn:"beam:metric:sampled_byte_size:v1" type:"beam:metrics:distribution_int64:v1" payload:"\x01\xf8\"\xf8\"\xf8\"" labels:{key:"PCOLLECTION" value:"UcRSLtoEzuExternal/KafkaIO.Read/KafkaIO.Read.ReadFromKafkaViaUnbounded/Read(KafkaUnboundedSource)/Create/Read(CreateSource)/ParDo(OutputSingleSource)/ParMultiDo(OutputSingleSource).output/SplitAndSize0"} failed to deduce Step from MonitoringInfo: urn:"beam:metric:sampled_byte_size:v1" type:"beam:metrics:distribution_int64:v1" payload:"\x01\xf0\"\xf0\"\xf0\"" labels:{key:"PCOLLECTION" value:"UcRSLtoEzuExternal/KafkaIO.Read/KafkaIO.Read.ReadFromKafkaViaUnbounded/Read(KafkaUnboundedSource)/Create/Read(CreateSource)/ParDo(OutputSingleSource)/ParMultiDo(OutputSingleSource).output/PairWithRestriction0"}]
--- PASS: TestKafkaIO_BasicReadWrite (38.90s)
PASS
ok github.com/apache/beam/sdks/v2/go/test/integration/io/xlang/kafka 44.929s
> Task :runners:spark:3:job-server:validatesCrossLanguageRunnerJavaUsingPython
org.apache.beam.runners.core.construction.ValidateRunnerXlangTest$SingleInputOutputTest > test FAILED
java.lang.RuntimeException at ValidateRunnerXlangTest.java:242
java.lang.NullPointerException at Preconditions.java:980
14 tests completed, 1 failed
> Task :runners:spark:3:job-server:validatesCrossLanguageRunnerJavaUsingPython FAILED
> Task :runners:spark:3:job-server:validatesCrossLanguageRunnerPythonUsingJava
> Task :runners:spark:3:job-server:validatesCrossLanguageRunnerPythonUsingSql
> Task :runners:spark:3:job-server:validatesCrossLanguageRunnerCleanup
> Task :runners:spark:3:job-server:sparkJobServerCleanup
FAILURE: Build failed with an exception.
* What went wrong:
Execution failed for task ':runners:spark:3:job-server:validatesCrossLanguageRunnerJavaUsingPython'.
> There were failing tests. See the report at: file://<https://ci-beam.apache.org/job/beam_PostCommit_XVR_Spark3/ws/src/runners/spark/3/job-server/build/reports/tests/validatesCrossLanguageRunnerJavaUsingPython/index.html>
* Try:
> Run with --stacktrace option to get the stack trace.
> Run with --info or --debug option to get more log output.
> Run with --scan to get full insights.
* Get more help at https://help.gradle.org
Deprecated Gradle features were used in this build, making it incompatible with Gradle 8.0.
You can use '--warning-mode all' to show the individual deprecation warnings and determine if they come from your own scripts or plugins.
See https://docs.gradle.org/7.4/userguide/command_line_interface.html#sec:command_line_warnings
Execution optimizations have been disabled for 1 invalid unit(s) of work during this build to ensure correctness.
Please consult deprecation warnings for more details.
BUILD FAILED in 32m 26s
263 actionable tasks: 173 executed, 78 from cache, 12 up-to-date
Publishing build scan...
https://gradle.com/s/ltbd5tpym37em
Build step 'Invoke Gradle script' changed build result to FAILURE
Build step 'Invoke Gradle script' marked build as failure
---------------------------------------------------------------------
To unsubscribe, e-mail: builds-unsubscribe@beam.apache.org
For additional commands, e-mail: builds-help@beam.apache.org
Build failed in Jenkins: beam_PostCommit_XVR_Spark3 #2006
Posted by Apache Jenkins Server <je...@builds.apache.org>.
See <https://ci-beam.apache.org/job/beam_PostCommit_XVR_Spark3/2006/display/redirect>
Changes:
------------------------------------------
[...truncated 1.02 MB...]
spec: <
urn: "beam:coder:kv:v1"
>
component_coder_ids: "tnhTVJGnQLVarIntCoder"
component_coder_ids: "tnhTVJGnQLTimestampedValueCoder"
>
>
coders: <
key: "tnhTVJGnQLKvCoder4"
value: <
spec: <
urn: "beam:coder:kv:v1"
>
component_coder_ids: "tnhTVJGnQLVarIntCoder"
component_coder_ids: "tnhTVJGnQLIterableCoder"
>
>
coders: <
key: "tnhTVJGnQLNullableCoder"
value: <
spec: <
urn: "beam:coder:nullable:v1"
>
component_coder_ids: "tnhTVJGnQLByteArrayCoder"
>
>
coders: <
key: "tnhTVJGnQLSerializableCoder"
value: <
spec: <
urn: "beam:coders:javasdk:0.1"
payload: "\202SNAPPY\000\000\000\000\001\000\000\000\001\000\000\000\312\214\002\360^\254\355\000\005sr\000,org.apache.beam.sdk.coders.SerializableCoder\010\364 \216\305ynl\002\000\001L\000\004typet\000\021Ljava/lang/Class;xr\000&ofV\000\024Custom\005P8j\260\010\235\013;\035\013\002\000\000xr\000 j\213\000\005/\034C\335\325\211\256\274~\370\001/\020pvr\000;N1\000Pio.BoundedReadFromUnb\t\021`Source$Shardd\236\240U\205\000j\363\002\000\000xp"
>
>
>
coders: <
key: "tnhTVJGnQLSnappyCoder"
value: <
spec: <
urn: "beam:coders:javasdk:0.1"
payload: "\202SNAPPY\000\000\000\000\001\000\000\000\001\000\000\001.\307\003\360@\254\355\000\005sr\000&org.apache.beam.sdk.coders.SnappyCoder1\033\243\356\177\362\366,\002\000\001L\000\ninner\005\030 t\000\"Lorg/a\005B\000/\001B\020/sdk/\tB\000/\005$\020;xr\000*ng\000 tructured\005/8s\277\022\016\325\3246\021\002\000\000xr\000 j9\000\005/\034C\335\325\211\256\274~\370\001/\020psr\000,j1\000,Serializable\005= \010\364 \216\305ynl\002\001\327\\\004typet\000\021Ljava/lang/Class\001\300n'\001\024Custom\005PPj\260\010\235\013;\035\013\002\000\000xq\000~\000\003vr\000$N\221\000\\io.BoundedSource!`v\023\177\370QA\0019\010r\000\035Z3\000\t,0\020\213\372\020Y\214\347\323\002\000\000xp"
>
>
>
coders: <
key: "tnhTVJGnQLTimestampedValueCoder"
value: <
spec: <
urn: "beam:coders:javasdk:0.1"
payload: "\202SNAPPY\000\000\000\000\001\000\000\000\001\000\000\001?\315\003\270\254\355\000\005sr\000Aorg.apache.beam.sdk.values.TimestampedV\001\022\000$>\021\000LCoder\364\376\202p\274iX-\002\000\001L\000\nv\001)\005\030\034t\000\"Lorg/\t]\000/\001],/sdk/coders/\005$\020;xr\000*N\202\000\t%(.Structured\005/8s\277\022\016\325\3246\021\002\000\000xr\000 j9\000\005/\034C\335\325\211\256\274~\370\001/\020psr\000,j1\000(Serializabl\t\277\034\010\364 \216\305ynl\005\327\\\004typet\000\021Ljava/lang/Class\001\300\000&jV\000\024Custom\005\215Pj\260\010\235\013;\035\013\002\000\000xq\000~\000\003vr\000;N;\000Pio.BoundedReadFromUnb\t\021`Source$Shardd\236\240U\205\000j\363\002\000\000xp"
>
>
>
coders: <
key: "tnhTVJGnQLValueWithRecordIdCoder"
value: <
spec: <
urn: "beam:coders:javasdk:0.1"
payload: "\202SNAPPY\000\000\000\000\001\000\000\000\001\000\000\001\213\311\005\320\254\355\000\005sr\000Corg.apache.beam.sdk.values.ValueWithRecordId$B\022\000LCoder{\343\376bQ\014\204>\002\000\002L\000\007i\t\025\034t\000+Lorg/\t\\\000/\001\\\024/sdk/c\0012(s/ByteArray\005B\014;L\000\n\005u\005\016\010t\000\"n;\000\005$\020;xr\000*N\274\000\t`(.Structured\005/8s\277\022\016\325\3246\021\002\000\000xr\000 j9\000\005/\034C\335\325\211\256\274~\370\001/\020psr\000)j1\0006\312\000\034\351\277\005|\263\3746\333\001:\010r\000&j8\000\024Atomic\005o\034\307\354\265\314\205tPF\0015 q\000~\000\003sr\000-N;\000$io.kafka.K\001\006\000R%\227\005B<I\320\251Y\032\341{#\002\000\001L\000\007kv\005\025\010t\000$nH\001\000K\t&\000;\025s\000\"Ns\000-P\r- j\000\275\271\035\243\3126\002!\353\010\010ke)\277\001\264\000\0022\303\001\005\022\025Y\000(jY\000\030Nullabl)\372\034E\333\0336>\220\247\007\005\307]\022.O\000\001\014,\006sq\000~\000\016q\000~\000\020"
>
>
>
coders: <
key: "tnhTVJGnQLVarIntCoder"
value: <
spec: <
urn: "beam:coders:javasdk:0.1"
payload: "\202SNAPPY\000\000\000\000\001\000\000\000\001\000\000\000\210\330\001\350\254\355\000\005sr\000&org.apache.beam.sdk.coders.VarIntCoder\300K2\332\251KVh\002\000\000xrr5\000\024Atomic\0055 \307\354\265\314\205tPF\002\0055\000*jj\000$Structured\0059\034s\277\022\016\325\3246\021\t9\000 j9\000\005/0C\335\325\211\256\274~\370\002\000\000xp"
>
>
>
coders: <
key: "tnhTVJGnQLVoidCoder"
value: <
spec: <
urn: "beam:coders:javasdk:0.1"
payload: "\202SNAPPY\000\000\000\000\001\000\000\000\001\000\000\000\210\326\001\350\254\355\000\005sr\000$org.apache.beam.sdk.coders.VoidCoder\271\277U\233\350\r\257U\002\000\000xr\000&j3\000\024Atomic\0055 \307\354\265\314\205tPF\002\0055\000*j5\000$Structured\0059\034s\277\022\016\325\3246\021\t9\000 j9\000\005/0C\335\325\211\256\274~\370\002\000\000xp"
>
>
>
environments: <
key: "go"
value: <
urn: "beam:env:docker:v1"
payload: "\n\026apache/beam_go_sdk:dev"
capabilities: "beam:protocol:progress_reporting:v1"
capabilities: "beam:protocol:multi_core_bundle_processing:v1"
capabilities: "beam:transform:sdf_truncate_sized_restrictions:v1"
capabilities: "beam:protocol:worker_status:v1"
capabilities: "beam:protocol:monitoring_info_short_ids:v1"
capabilities: "beam:version:sdk_base:go"
capabilities: "beam:coder:bytes:v1"
capabilities: "beam:coder:bool:v1"
capabilities: "beam:coder:varint:v1"
capabilities: "beam:coder:double:v1"
capabilities: "beam:coder:string_utf8:v1"
capabilities: "beam:coder:length_prefix:v1"
capabilities: "beam:coder:kv:v1"
capabilities: "beam:coder:iterable:v1"
capabilities: "beam:coder:state_backed_iterable:v1"
capabilities: "beam:coder:windowed_value:v1"
capabilities: "beam:coder:global_window:v1"
capabilities: "beam:coder:interval_window:v1"
capabilities: "beam:coder:row:v1"
capabilities: "beam:coder:nullable:v1"
dependencies: <
type_urn: "beam:artifact:type:file:v1"
role_urn: "beam:artifact:role:go_worker_binary:v1"
>
>
>
environments: <
key: "tnhTVJGnQLbeam:env:docker:v1"
value: <
urn: "beam:env:docker:v1"
payload: "\n apache/beam_java8_sdk:2.42.0.dev"
capabilities: "beam:coder:bytes:v1"
capabilities: "beam:coder:bool:v1"
capabilities: "beam:coder:varint:v1"
capabilities: "beam:coder:string_utf8:v1"
capabilities: "beam:coder:iterable:v1"
capabilities: "beam:coder:timer:v1"
capabilities: "beam:coder:kv:v1"
capabilities: "beam:coder:length_prefix:v1"
capabilities: "beam:coder:global_window:v1"
capabilities: "beam:coder:interval_window:v1"
capabilities: "beam:coder:custom_window:v1"
capabilities: "beam:coder:windowed_value:v1"
capabilities: "beam:coder:double:v1"
capabilities: "beam:coder:row:v1"
capabilities: "beam:coder:param_windowed_value:v1"
capabilities: "beam:coder:state_backed_iterable:v1"
capabilities: "beam:coder:sharded_key:v1"
capabilities: "beam:coder:nullable:v1"
capabilities: "beam:protocol:multi_core_bundle_processing:v1"
capabilities: "beam:protocol:progress_reporting:v1"
capabilities: "beam:protocol:harness_monitoring_infos:v1"
capabilities: "beam:protocol:control_request_elements_embedding:v1"
capabilities: "beam:protocol:state_caching:v1"
capabilities: "beam:version:sdk_base:apache/beam_java8_sdk:2.42.0.dev"
capabilities: "beam:transform:sdf_truncate_sized_restrictions:v1"
capabilities: "beam:transform:to_string:v1"
dependencies: <
type_urn: "beam:artifact:type:file:v1"
type_payload: "\nL/tmp/artifacts/icedtea-sound-CGRxIE9edPHnbxQhM-L5mp8h21H-ySB79uQtSquPV_Q.jar\022@086471204f5e74f1e76f142133e2f99a9f21db51fec9207bf6e42d4aab8f57f4"
role_urn: "beam:artifact:role:staging_to:v1"
role_payload: "\n=icedtea-sound-CGRxIE9edPHnbxQhM-L5mp8h21H-ySB79uQtSquPV_Q.jar"
>
dependencies: <
type_urn: "beam:artifact:type:file:v1"
type_payload: "\nF/tmp/artifacts/jaccess-FBI0Bb27lF3oEBieWAi7SP8X1zBR8k4BJQOVpsoK9a0.jar\022@14123405bdbb945de810189e5808bb48ff17d73051f24e01250395a6ca0af5ad"
role_urn: "beam:artifact:role:staging_to:v1"
role_payload: "\n7jaccess-FBI0Bb27lF3oEBieWAi7SP8X1zBR8k4BJQOVpsoK9a0.jar"
>
dependencies: <
type_urn: "beam:artifact:type:file:v1"
type_payload: "\nI/tmp/artifacts/localedata-kJ2mc8rBH5-IklhfR1XzNotlIQ_mnVMA-pgaXv2r8Ag.jar\022@909da673cac11f9f8892585f4755f3368b65210fe69d5300fa981a5efdabf008"
role_urn: "beam:artifact:role:staging_to:v1"
role_payload: "\n:localedata-kJ2mc8rBH5-IklhfR1XzNotlIQ_mnVMA-pgaXv2r8Ag.jar"
>
dependencies: <
type_urn: "beam:artifact:type:file:v1"
type_payload: "\nF/tmp/artifacts/nashorn-B0CAb3QpJET_6VsT3hcC_89VtvhV616H8N2bHAIaqWo.jar\022@0740806f74292444ffe95b13de1702ffcf55b6f855eb5e87f0dd9b1c021aa96a"
role_urn: "beam:artifact:role:staging_to:v1"
role_payload: "\n7nashorn-B0CAb3QpJET_6VsT3hcC_89VtvhV616H8N2bHAIaqWo.jar"
>
dependencies: <
type_urn: "beam:artifact:type:file:v1"
type_payload: "\nG/tmp/artifacts/cldrdata-gclqV9lOGqQOKesG-a6TAUTGEYlyIDqpyd4M_k7gtWo.jar\022@81c96a57d94e1aa40e29eb06f9ae930144c6118972203aa9c9de0cfe4ee0b56a"
role_urn: "beam:artifact:role:staging_to:v1"
role_payload: "\n8cldrdata-gclqV9lOGqQOKesG-a6TAUTGEYlyIDqpyd4M_k7gtWo.jar"
>
dependencies: <
type_urn: "beam:artifact:type:file:v1"
type_payload: "\nD/tmp/artifacts/dnsns-byzoQxdXengTvA5IlbH9gSIzfhNQElRYltuMJN0vjcc.jar\022@6f2ce84317577a7813bc0e4895b1fd8122337e135012545896db8c24dd2f8dc7"
role_urn: "beam:artifact:role:staging_to:v1"
role_payload: "\n5dnsns-byzoQxdXengTvA5IlbH9gSIzfhNQElRYltuMJN0vjcc.jar"
>
dependencies: <
type_urn: "beam:artifact:type:file:v1"
type_payload: "\nr/tmp/artifacts/beam-sdks-java-io-expansion-service-2.42.0-SNAPSHOT-Nc2I3ZhyT7-oyDTgQHRgxjZOKatpiGcPr_Q6tpt-fkg.jar\022@35cd88dd98724fbfa8c834e0407460c6364e29ab6988670faff43ab69b7e7e48"
role_urn: "beam:artifact:role:staging_to:v1"
role_payload: "\ncbeam-sdks-java-io-expansion-service-2.42.0-SNAPSHOT-Nc2I3ZhyT7-oyDTgQHRgxjZOKatpiGcPr_Q6tpt-fkg.jar"
>
>
>
>
root_transform_ids: "s1"
root_transform_ids: "e4"
root_transform_ids: "e5"
root_transform_ids: "s3"
requirements: "beam:requirement:pardo:splittable_dofn:v1"
2022/08/13 14:36:58 Cross-compiling <https://ci-beam.apache.org/job/beam_PostCommit_XVR_Spark3/ws/src/sdks/go/test/integration/io/xlang/kafka/kafka_test.go> as /tmp/worker-2-1660401418280228406
2022/08/13 14:36:59 Prepared job with id: go-testkafkaio_basicreadwrite-141_25e74734-2548-4975-abe7-9cfd24c3ac8a and staging token: go-testkafkaio_basicreadwrite-141_25e74734-2548-4975-abe7-9cfd24c3ac8a
2022/08/13 14:37:00 Staged binary artifact with token:
2022/08/13 14:37:00 Submitted job: go0testkafkaio0basicreadwrite0141-jenkins-0813143700-5a5e2892_83c15b4f-e532-4dc7-9e07-b06bc36fd874
2022/08/13 14:37:00 Job state: STOPPED
2022/08/13 14:37:00 Job state: STARTING
2022/08/13 14:37:00 Job state: RUNNING
2022/08/13 14:37:22 Job state: DONE
2022/08/13 14:37:22 Warning: 6 errors during metrics processing: [failed to deduce Step from MonitoringInfo: urn:"beam:metric:element_count:v1" type:"beam:metrics:sum_int64:v1" payload:"\x01" labels:{key:"PCOLLECTION" value:"tnhTVJGnQLExternal/KafkaIO.Read/KafkaIO.Read.ReadFromKafkaViaUnbounded/Read(KafkaUnboundedSource)/Create/Read(CreateSource)/ParDo(OutputSingleSource)/ParMultiDo(OutputSingleSource).output/SplitAndSize0"} failed to deduce Step from MonitoringInfo: urn:"beam:metric:sampled_byte_size:v1" type:"beam:metrics:distribution_int64:v1" payload:"\x01\xfd\"\xfd\"\xfd\"" labels:{key:"PCOLLECTION" value:"tnhTVJGnQLExternal/KafkaIO.Read/KafkaIO.Read.ReadFromKafkaViaUnbounded/Read(KafkaUnboundedSource)/Create/Read(CreateSource)/ParDo(OutputSingleSource)/ParMultiDo(OutputSingleSource).output/SplitAndSize0"} failed to deduce Step from MonitoringInfo: urn:"beam:metric:element_count:v1" type:"beam:metrics:sum_int64:v1" payload:"\x01" labels:{key:"PCOLLECTION" value:"tnhTVJGnQLExternal/KafkaIO.Read/KafkaIO.Read.ReadFromKafkaViaUnbounded/Read(KafkaUnboundedSource)/Create/Read(CreateSource)/ParDo(OutputSingleSource)/ParMultiDo(OutputSingleSource).output/PairWithRestriction0"} failed to deduce Step from MonitoringInfo: urn:"beam:metric:element_count:v1" type:"beam:metrics:sum_int64:v1" payload:"\x01" labels:{key:"PCOLLECTION" value:"tnhTVJGnQLExternal/KafkaIO.Read/KafkaIO.Read.ReadFromKafkaViaUnbounded/Read(KafkaUnboundedSource)/Create/Read(CreateSource)/ParDo(OutputSingleSource)/ParMultiDo(OutputSingleSource).output/SplitAndSize0"} failed to deduce Step from MonitoringInfo: urn:"beam:metric:sampled_byte_size:v1" type:"beam:metrics:distribution_int64:v1" payload:"\x01\xf8\"\xf8\"\xf8\"" labels:{key:"PCOLLECTION" value:"tnhTVJGnQLExternal/KafkaIO.Read/KafkaIO.Read.ReadFromKafkaViaUnbounded/Read(KafkaUnboundedSource)/Create/Read(CreateSource)/ParDo(OutputSingleSource)/ParMultiDo(OutputSingleSource).output/SplitAndSize0"} failed to deduce Step from MonitoringInfo: urn:"beam:metric:sampled_byte_size:v1" type:"beam:metrics:distribution_int64:v1" payload:"\x01\xf0\"\xf0\"\xf0\"" labels:{key:"PCOLLECTION" value:"tnhTVJGnQLExternal/KafkaIO.Read/KafkaIO.Read.ReadFromKafkaViaUnbounded/Read(KafkaUnboundedSource)/Create/Read(CreateSource)/ParDo(OutputSingleSource)/ParMultiDo(OutputSingleSource).output/PairWithRestriction0"}]
--- PASS: TestKafkaIO_BasicReadWrite (38.80s)
PASS
ok github.com/apache/beam/sdks/v2/go/test/integration/io/xlang/kafka 44.829s
> Task :runners:spark:3:job-server:validatesCrossLanguageRunnerJavaUsingPython
org.apache.beam.runners.core.construction.ValidateRunnerXlangTest$SingleInputOutputTest > test FAILED
java.lang.RuntimeException at ValidateRunnerXlangTest.java:242
java.lang.NullPointerException at Preconditions.java:980
14 tests completed, 1 failed
> Task :runners:spark:3:job-server:validatesCrossLanguageRunnerJavaUsingPython FAILED
> Task :runners:spark:3:job-server:validatesCrossLanguageRunnerPythonUsingJava
> Task :runners:spark:3:job-server:validatesCrossLanguageRunnerPythonUsingSql
> Task :runners:spark:3:job-server:validatesCrossLanguageRunnerCleanup
> Task :runners:spark:3:job-server:sparkJobServerCleanup
FAILURE: Build failed with an exception.
* What went wrong:
Execution failed for task ':runners:spark:3:job-server:validatesCrossLanguageRunnerJavaUsingPython'.
> There were failing tests. See the report at: file://<https://ci-beam.apache.org/job/beam_PostCommit_XVR_Spark3/ws/src/runners/spark/3/job-server/build/reports/tests/validatesCrossLanguageRunnerJavaUsingPython/index.html>
* Try:
> Run with --stacktrace option to get the stack trace.
> Run with --info or --debug option to get more log output.
> Run with --scan to get full insights.
* Get more help at https://help.gradle.org
Deprecated Gradle features were used in this build, making it incompatible with Gradle 8.0.
You can use '--warning-mode all' to show the individual deprecation warnings and determine if they come from your own scripts or plugins.
See https://docs.gradle.org/7.4/userguide/command_line_interface.html#sec:command_line_warnings
Execution optimizations have been disabled for 1 invalid unit(s) of work during this build to ensure correctness.
Please consult deprecation warnings for more details.
BUILD FAILED in 32m 5s
263 actionable tasks: 173 executed, 78 from cache, 12 up-to-date
Publishing build scan...
https://gradle.com/s/bdi7kzok4bbds
Build step 'Invoke Gradle script' changed build result to FAILURE
Build step 'Invoke Gradle script' marked build as failure
---------------------------------------------------------------------
To unsubscribe, e-mail: builds-unsubscribe@beam.apache.org
For additional commands, e-mail: builds-help@beam.apache.org