You are viewing a plain text version of this content. The canonical link for it is here.
Posted to server-dev@james.apache.org by Apache Hudson Server <hu...@hudson.apache.org> on 2011/03/24 22:55:09 UTC
Build failed in Jenkins: james-server-trunk #1314
See <https://hudson.apache.org/hudson/job/james-server-trunk/1314/changes>
Changes:
[felixk] I don't see the benefit of a nested try block
[felixk] I don't see the benefit of a nested try block
------------------------------------------
[...truncated 1665 lines...]
Downloading: https://repository.apache.org/content/repositories/snapshots/org/apache/james/james-server-ldap/maven-metadata.xml
Downloaded: https://repository.apache.org/content/repositories/snapshots/org/apache/james/james-server-ldap/maven-metadata.xml (294 B at 2.6 KB/sec)
Uploading: https://repository.apache.org/content/repositories/snapshots/org/apache/james/james-server-ldap/3.0-M3-SNAPSHOT/maven-metadata.xml
Uploaded: https://repository.apache.org/content/repositories/snapshots/org/apache/james/james-server-ldap/3.0-M3-SNAPSHOT/maven-metadata.xml (1003 B at 6.5 KB/sec)
Uploading: https://repository.apache.org/content/repositories/snapshots/org/apache/james/james-server-ldap/maven-metadata.xml
Uploaded: https://repository.apache.org/content/repositories/snapshots/org/apache/james/james-server-ldap/maven-metadata.xml (294 B at 1.9 KB/sec)
Uploading: https://repository.apache.org/content/repositories/snapshots/org/apache/james/james-server-ldap/3.0-M3-SNAPSHOT/james-server-ldap-3.0-M3-20110324.215450-74-tests.jar
Uploaded: https://repository.apache.org/content/repositories/snapshots/org/apache/james/james-server-ldap/3.0-M3-SNAPSHOT/james-server-ldap-3.0-M3-20110324.215450-74-tests.jar (8 KB at 19.3 KB/sec)
Uploading: https://repository.apache.org/content/repositories/snapshots/org/apache/james/james-server-ldap/3.0-M3-SNAPSHOT/maven-metadata.xml
Uploaded: https://repository.apache.org/content/repositories/snapshots/org/apache/james/james-server-ldap/3.0-M3-SNAPSHOT/maven-metadata.xml (1003 B at 3.5 KB/sec)
projectSucceeded org.apache.james:james-server-ldap:3.0-M3-SNAPSHOT
[JENKINS] Archiving <https://hudson.apache.org/hudson/job/james-server-trunk/ws/trunk/ldap/pom.xml> to /home/hudson/hudson/jobs/james-server-trunk/modules/org.apache.james$james-server-ldap/builds/2011-03-24_21-52-25/archive/org.apache.james/james-server-ldap/3.0-M3-SNAPSHOT/pom.xml
[JENKINS] Archiving <https://hudson.apache.org/hudson/job/james-server-trunk/ws/trunk/ldap/target/james-server-ldap-3.0-M3-SNAPSHOT.jar> to /home/hudson/hudson/jobs/james-server-trunk/modules/org.apache.james$james-server-ldap/builds/2011-03-24_21-52-25/archive/org.apache.james/james-server-ldap/3.0-M3-20110324.215450-74/james-server-ldap-3.0-M3-SNAPSHOT.jar
[JENKINS] Archiving <https://hudson.apache.org/hudson/job/james-server-trunk/ws/trunk/ldap/target/james-server-ldap-3.0-M3-SNAPSHOT-tests.jar> to /home/hudson/hudson/jobs/james-server-trunk/modules/org.apache.james$james-server-ldap/builds/2011-03-24_21-52-25/archive/org.apache.james/james-server-ldap/3.0-M3-20110324.215450-74/james-server-ldap-3.0-M3-SNAPSHOT-tests.jar
[INFO] Downloading: http://download.java.net/maven/2/org/apache/james/protocols/protocols-smtp/1.4-SNAPSHOT/maven-metadata.xml
Downloading: http://repository.apache.org/snapshots/org/apache/james/protocols/protocols-smtp/1.4-SNAPSHOT/maven-metadata.xml
[INFO] ------------------------------------------------------------------------
[INFO] Building Apache James Server SMTP 3.0-M3-SNAPSHOT
[INFO] ------------------------------------------------------------------------
Downloaded: http://repository.apache.org/snapshots/org/apache/james/protocols/protocols-smtp/1.4-SNAPSHOT/maven-metadata.xml (998 B at 9.0 KB/sec)
Downloading: http://download.java.net/maven/2/org/apache/james/protocols/protocols-smtp/1.4-SNAPSHOT/maven-metadata.xml
Downloading: http://repository.apache.org/snapshots/org/apache/james/protocols/protocols-smtp/1.4-SNAPSHOT/maven-metadata.xml
Downloaded: http://repository.apache.org/snapshots/org/apache/james/protocols/protocols-smtp/1.4-SNAPSHOT/maven-metadata.xml (998 B at 12.0 KB/sec)
[INFO] [INFO] Deleting <https://hudson.apache.org/hudson/job/james-server-trunk/ws/trunk/smtpserver/target>
[INFO] --- maven-clean-plugin:2.4.1:clean (default-clean) @ james-server-smtpserver ---
[INFO]
[INFO] --- maven-remote-resources-plugin:1.1:process (default) @ james-server-smtpserver ---
Downloading: http://download.java.net/maven/2/org/apache/james/protocols/protocols-smtp/1.4-SNAPSHOT/maven-metadata.xml
Downloading: http://repository.apache.org/snapshots/org/apache/james/protocols/protocols-smtp/1.4-SNAPSHOT/maven-metadata.xml
Downloaded: http://repository.apache.org/snapshots/org/apache/james/protocols/protocols-smtp/1.4-SNAPSHOT/maven-metadata.xml (998 B at 12.0 KB/sec)
[INFO] [INFO] Using 'UTF-8' encoding to copy filtered resources.
[INFO] Copying 0 resource
[INFO] Copying 3 resources
[INFO] --- maven-resources-plugin:2.4.3:resources (default-resources) @ james-server-smtpserver ---
[INFO] [INFO] Compiling 48 source files to <https://hudson.apache.org/hudson/job/james-server-trunk/ws/trunk/smtpserver/target/classes>
[INFO] --- maven-compiler-plugin:2.3.2:compile (default-compile) @ james-server-smtpserver ---
[INFO]
[INFO] --- maven-bundle-plugin:2.1.0:manifest (bundle-manifest) @ james-server-smtpserver ---
[INFO] Using 'UTF-8' encoding to copy filtered resources.
[INFO] [INFO] Copying 1 resource
[INFO] Copying 3 resources
[INFO] --- maven-resources-plugin:2.4.3:testResources (default-testResources) @ james-server-smtpserver ---
[INFO] [INFO] Compiling 18 source files to <https://hudson.apache.org/hudson/job/james-server-trunk/ws/trunk/smtpserver/target/test-classes>
[INFO] --- maven-compiler-plugin:2.3.2:testCompile (default-testCompile) @ james-server-smtpserver ---
[INFO] Surefire report directory: <https://hudson.apache.org/hudson/job/james-server-trunk/ws/trunk/smtpserver/target/surefire-reports>
[INFO]
[INFO] --- maven-surefire-plugin:2.7.2:test (default-test) @ james-server-smtpserver ---
-------------------------------------------------------
T E S T S
-------------------------------------------------------
Running org.apache.james.smtpserver.SPFHandlerTest
Tests run: 8, Failures: 0, Errors: 0, Skipped: 0, Time elapsed: 0.175 sec
Running org.apache.james.smtpserver.ValidRcptMXTest
Tests run: 1, Failures: 0, Errors: 0, Skipped: 0, Time elapsed: 0.014 sec
Running org.apache.james.smtpserver.URIRBLHandlerTest
Tests run: 3, Failures: 0, Errors: 0, Skipped: 0, Time elapsed: 0.149 sec
Running org.apache.james.smtpserver.SpamAssassinHandlerTest
Tests run: 3, Failures: 0, Errors: 0, Skipped: 0, Time elapsed: 0.016 sec
Running org.apache.james.smtpserver.ValidRcptHandlerTest
Tests run: 5, Failures: 0, Errors: 0, Skipped: 0, Time elapsed: 0.022 sec
Running org.apache.james.smtpserver.POP3BeforeSMTPHandlerTest
Tests run: 4, Failures: 0, Errors: 0, Skipped: 0, Time elapsed: 0.11 sec
Running org.apache.james.smtpserver.OioSMTPServerTest
500 Line length exceeded. See RFC 2821 #4.5.3.1.
Tests run: 38, Failures: 0, Errors: 0, Skipped: 0, Time elapsed: 1.293 sec
Running org.apache.james.smtpserver.SetMimeHeaderHandlerTest
Tests run: 2, Failures: 0, Errors: 0, Skipped: 0, Time elapsed: 0.003 sec
Results :
Tests run: 64, Failures: 0, Errors: 0, Skipped: 0
[JENKINS] Recording test results
[INFO]
[INFO] --- maven-jar-plugin:2.3.1:jar (default-jar) @ james-server-smtpserver ---
[INFO] Building jar: <https://hudson.apache.org/hudson/job/james-server-trunk/ws/trunk/smtpserver/target/james-server-smtpserver-3.0-M3-SNAPSHOT.jar>
[INFO]
[INFO] --- maven-jar-plugin:2.3.1:test-jar (default) @ james-server-smtpserver ---
[INFO] Building jar: <https://hudson.apache.org/hudson/job/james-server-trunk/ws/trunk/smtpserver/target/james-server-smtpserver-3.0-M3-SNAPSHOT-tests.jar>
[INFO]
[INFO] --- maven-site-plugin:3.0-beta-3:attach-descriptor (attach-descriptor) @ james-server-smtpserver ---
[INFO] Installing <https://hudson.apache.org/hudson/job/james-server-trunk/ws/trunk/smtpserver/target/james-server-smtpserver-3.0-M3-SNAPSHOT.jar> to /home/hudson/.m2/repository/org/apache/james/james-server-smtpserver/3.0-M3-SNAPSHOT/james-server-smtpserver-3.0-M3-SNAPSHOT.jar
[INFO] [INFO] Installing <https://hudson.apache.org/hudson/job/james-server-trunk/ws/trunk/smtpserver/pom.xml> to /home/hudson/.m2/repository/org/apache/james/james-server-smtpserver/3.0-M3-SNAPSHOT/james-server-smtpserver-3.0-M3-SNAPSHOT.pom
[INFO] Installing <https://hudson.apache.org/hudson/job/james-server-trunk/ws/trunk/smtpserver/target/james-server-smtpserver-3.0-M3-SNAPSHOT-tests.jar> to /home/hudson/.m2/repository/org/apache/james/james-server-smtpserver/3.0-M3-SNAPSHOT/james-server-smtpserver-3.0-M3-SNAPSHOT-tests.jar
[INFO] --- maven-install-plugin:2.3.1:install (default-install) @ james-server-smtpserver ---
[INFO] Downloading: https://repository.apache.org/content/repositories/snapshots/org/apache/james/james-server-smtpserver/3.0-M3-SNAPSHOT/maven-metadata.xml
[INFO] --- maven-deploy-plugin:2.4:deploy (default-deploy) @ james-server-smtpserver ---
Downloaded: https://repository.apache.org/content/repositories/snapshots/org/apache/james/james-server-smtpserver/3.0-M3-SNAPSHOT/maven-metadata.xml (1009 B at 10.3 KB/sec)
Uploading: https://repository.apache.org/content/repositories/snapshots/org/apache/james/james-server-smtpserver/3.0-M3-SNAPSHOT/james-server-smtpserver-3.0-M3-20110324.215501-74.jar
Uploaded: https://repository.apache.org/content/repositories/snapshots/org/apache/james/james-server-smtpserver/3.0-M3-SNAPSHOT/james-server-smtpserver-3.0-M3-20110324.215501-74.jar (94 KB at 304.0 KB/sec)
Uploading: https://repository.apache.org/content/repositories/snapshots/org/apache/james/james-server-smtpserver/3.0-M3-SNAPSHOT/james-server-smtpserver-3.0-M3-20110324.215501-74.pom
Uploaded: https://repository.apache.org/content/repositories/snapshots/org/apache/james/james-server-smtpserver/3.0-M3-SNAPSHOT/james-server-smtpserver-3.0-M3-20110324.215501-74.pom (7 KB at 23.3 KB/sec)
Downloading: https://repository.apache.org/content/repositories/snapshots/org/apache/james/james-server-smtpserver/maven-metadata.xml
Downloaded: https://repository.apache.org/content/repositories/snapshots/org/apache/james/james-server-smtpserver/maven-metadata.xml (300 B at 3.3 KB/sec)
Uploading: https://repository.apache.org/content/repositories/snapshots/org/apache/james/james-server-smtpserver/3.0-M3-SNAPSHOT/maven-metadata.xml
Uploaded: https://repository.apache.org/content/repositories/snapshots/org/apache/james/james-server-smtpserver/3.0-M3-SNAPSHOT/maven-metadata.xml (1009 B at 6.8 KB/sec)
Uploading: https://repository.apache.org/content/repositories/snapshots/org/apache/james/james-server-smtpserver/maven-metadata.xml
Uploaded: https://repository.apache.org/content/repositories/snapshots/org/apache/james/james-server-smtpserver/maven-metadata.xml (300 B at 1.8 KB/sec)
Uploading: https://repository.apache.org/content/repositories/snapshots/org/apache/james/james-server-smtpserver/3.0-M3-SNAPSHOT/james-server-smtpserver-3.0-M3-20110324.215501-74-tests.jar
Uploaded: https://repository.apache.org/content/repositories/snapshots/org/apache/james/james-server-smtpserver/3.0-M3-SNAPSHOT/james-server-smtpserver-3.0-M3-20110324.215501-74-tests.jar (66 KB at 282.9 KB/sec)
Uploading: https://repository.apache.org/content/repositories/snapshots/org/apache/james/james-server-smtpserver/3.0-M3-SNAPSHOT/maven-metadata.xml
Uploaded: https://repository.apache.org/content/repositories/snapshots/org/apache/james/james-server-smtpserver/3.0-M3-SNAPSHOT/maven-metadata.xml (1009 B at 6.5 KB/sec)
projectSucceeded org.apache.james:james-server-smtpserver:3.0-M3-SNAPSHOT
[JENKINS] Archiving <https://hudson.apache.org/hudson/job/james-server-trunk/ws/trunk/smtpserver/pom.xml> to /home/hudson/hudson/jobs/james-server-trunk/modules/org.apache.james$james-server-smtpserver/builds/2011-03-24_21-52-25/archive/org.apache.james/james-server-smtpserver/3.0-M3-SNAPSHOT/pom.xml
[JENKINS] Archiving <https://hudson.apache.org/hudson/job/james-server-trunk/ws/trunk/smtpserver/target/james-server-smtpserver-3.0-M3-SNAPSHOT.jar> to /home/hudson/hudson/jobs/james-server-trunk/modules/org.apache.james$james-server-smtpserver/builds/2011-03-24_21-52-25/archive/org.apache.james/james-server-smtpserver/3.0-M3-20110324.215501-74/james-server-smtpserver-3.0-M3-SNAPSHOT.jar
[JENKINS] Archiving <https://hudson.apache.org/hudson/job/james-server-trunk/ws/trunk/smtpserver/target/james-server-smtpserver-3.0-M3-SNAPSHOT-tests.jar> to /home/hudson/hudson/jobs/james-server-trunk/modules/org.apache.james$james-server-smtpserver/builds/2011-03-24_21-52-25/archive/org.apache.james/james-server-smtpserver/3.0-M3-20110324.215501-74/james-server-smtpserver-3.0-M3-SNAPSHOT-tests.jar
[INFO] Downloading: http://download.java.net/maven/2/org/apache/james/apache-james-imap-api/0.2-M2-SNAPSHOT/maven-metadata.xml
Downloading: http://repository.apache.org/snapshots/org/apache/james/apache-james-imap-api/0.2-M2-SNAPSHOT/maven-metadata.xml
[INFO] ------------------------------------------------------------------------
[INFO] Building Apache James Server IMAP 3.0-M3-SNAPSHOT
[INFO] ------------------------------------------------------------------------
Downloaded: http://repository.apache.org/snapshots/org/apache/james/apache-james-imap-api/0.2-M2-SNAPSHOT/maven-metadata.xml (1007 B at 11.6 KB/sec)
Downloading: http://download.java.net/maven/2/org/apache/james/apache-james-imap/0.2-M2-SNAPSHOT/maven-metadata.xml
Downloading: http://repository.apache.org/snapshots/org/apache/james/apache-james-imap/0.2-M2-SNAPSHOT/maven-metadata.xml
Downloaded: http://repository.apache.org/snapshots/org/apache/james/apache-james-imap/0.2-M2-SNAPSHOT/maven-metadata.xml (2 KB at 12.6 KB/sec)
Downloading: http://download.java.net/maven/2/org/apache/james/apache-james-imap-message/0.2-M2-SNAPSHOT/maven-metadata.xml
Downloading: http://repository.apache.org/snapshots/org/apache/james/apache-james-imap-message/0.2-M2-SNAPSHOT/maven-metadata.xml
Downloaded: http://repository.apache.org/snapshots/org/apache/james/apache-james-imap-message/0.2-M2-SNAPSHOT/maven-metadata.xml (1011 B at 11.1 KB/sec)
Downloading: http://download.java.net/maven/2/org/apache/james/apache-james-imap-processor/0.2-M2-SNAPSHOT/maven-metadata.xml
Downloading: http://repository.apache.org/snapshots/org/apache/james/apache-james-imap-processor/0.2-M2-SNAPSHOT/maven-metadata.xml
Downloaded: http://repository.apache.org/snapshots/org/apache/james/apache-james-imap-processor/0.2-M2-SNAPSHOT/maven-metadata.xml (1013 B at 10.9 KB/sec)
[INFO] Deleting <https://hudson.apache.org/hudson/job/james-server-trunk/ws/trunk/imapserver/target>
[INFO]
[INFO] --- maven-clean-plugin:2.4.1:clean (default-clean) @ james-server-imapserver ---
[INFO]
[INFO] --- maven-remote-resources-plugin:1.1:process (default) @ james-server-imapserver ---
Downloading: http://download.java.net/maven/2/org/apache/james/apache-james-imap-api/0.2-M2-SNAPSHOT/maven-metadata.xml
Downloading: http://repository.apache.org/snapshots/org/apache/james/apache-james-imap-api/0.2-M2-SNAPSHOT/maven-metadata.xml
Downloaded: http://repository.apache.org/snapshots/org/apache/james/apache-james-imap-api/0.2-M2-SNAPSHOT/maven-metadata.xml (1007 B at 12.0 KB/sec)
Downloading: http://download.java.net/maven/2/org/apache/james/apache-james-imap-message/0.2-M2-SNAPSHOT/maven-metadata.xml
Downloading: http://repository.apache.org/snapshots/org/apache/james/apache-james-imap-message/0.2-M2-SNAPSHOT/maven-metadata.xml
Downloaded: http://repository.apache.org/snapshots/org/apache/james/apache-james-imap-message/0.2-M2-SNAPSHOT/maven-metadata.xml (1011 B at 10.1 KB/sec)
Downloading: http://download.java.net/maven/2/org/apache/james/apache-james-imap-processor/0.2-M2-SNAPSHOT/maven-metadata.xml
Downloading: http://repository.apache.org/snapshots/org/apache/james/apache-james-imap-processor/0.2-M2-SNAPSHOT/maven-metadata.xml
Downloaded: http://repository.apache.org/snapshots/org/apache/james/apache-james-imap-processor/0.2-M2-SNAPSHOT/maven-metadata.xml (1013 B at 10.5 KB/sec)
[INFO] [INFO] Using 'UTF-8' encoding to copy filtered resources.
[INFO] Copying 0 resource
[INFO] Copying 3 resources
[INFO] --- maven-resources-plugin:2.4.3:resources (default-resources) @ james-server-imapserver ---
[INFO] [INFO] Compiling 16 source files to <https://hudson.apache.org/hudson/job/james-server-trunk/ws/trunk/imapserver/target/classes>
[INFO] --- maven-compiler-plugin:2.3.2:compile (default-compile) @ james-server-imapserver ---
[INFO] -------------------------------------------------------------
[ERROR] COMPILATION ERROR :
[INFO] -------------------------------------------------------------
[ERROR] <https://hudson.apache.org/hudson/job/james-server-trunk/ws/trunk/imapserver/src/main/java/org/apache/james/imapserver/netty/ChannelImapResponseWriter.java>:[54,18] cannot find symbol
symbol : constructor IOException(java.lang.Throwable)
location: class java.io.IOException
[ERROR] <https://hudson.apache.org/hudson/job/james-server-trunk/ws/trunk/imapserver/src/main/java/org/apache/james/imapserver/netty/ChannelWritableByteChannel.java>:[62,18] cannot find symbol
symbol : constructor IOException(java.lang.Throwable)
location: class java.io.IOException
[INFO] 2 errors
[INFO] -------------------------------------------------------------
mojoFailed org.apache.maven.plugins:maven-compiler-plugin:2.3.2(default-compile)
projectFailed org.apache.james:james-server-imapserver:3.0-M3-SNAPSHOT
[JENKINS] Archiving <https://hudson.apache.org/hudson/job/james-server-trunk/ws/trunk/imapserver/pom.xml> to /home/hudson/hudson/jobs/james-server-trunk/modules/org.apache.james$james-server-imapserver/builds/2011-03-24_21-52-25/archive/org.apache.james/james-server-imapserver/3.0-M3-SNAPSHOT/pom.xml
sessionEnded
[INFO] ------------------------------------------------------------------------
[INFO] Reactor Summary:
[INFO]
[INFO] Apache James Server ............................... SUCCESS [11.413s]
[INFO] Apache James Server Data API ...................... SUCCESS [6.232s]
[INFO] Apache James Server Client ........................ SUCCESS [4.258s]
[INFO] Apache James Server Lifecycle API ................. SUCCESS [4.084s]
[INFO] Apache James Server Filesystem API ................ SUCCESS [4.292s]
[INFO] Apache James Server Core .......................... SUCCESS [20.527s]
[INFO] Apache James Server Queue API ..................... SUCCESS [4.256s]
[INFO] Apache James Server Mailetcontainer library ....... SUCCESS [5.651s]
[INFO] Apache James Server DNS Server API ................ SUCCESS [5.172s]
[INFO] Apache James Server DNSService Library ............ SUCCESS [5.069s]
[INFO] Apache James Server Mailetcontainer Camel implementation SUCCESS [8.037s]
[INFO] Apache James Server Mailbox Adapter ............... SUCCESS [4.989s]
[INFO] Apache James Server DNSService Implementation ..... SUCCESS [5.188s]
[INFO] Apache James Server Common Utilities .............. SUCCESS [5.128s]
[INFO] Apache James Server Protocols Library ............. SUCCESS [5.713s]
[INFO] Apache James Server Data Library .................. SUCCESS [5.775s]
[INFO] Apache James Server LDAP Data Implementation ...... SUCCESS [4.694s]
[INFO] Apache James Server SMTP .......................... SUCCESS [8.768s]
[INFO] Apache James Server IMAP .......................... FAILURE [2.352s]
[INFO] Apache James Server LMTP .......................... SKIPPED
[INFO] Apache James Server POP3 .......................... SKIPPED
[INFO] Apache James Server FetchMail ..................... SKIPPED
[INFO] Apache James Server JMS Mail Queue ................ SKIPPED
[INFO] Apache James Server ActiveMQ Queue ................ SKIPPED
[INFO] Apache James Server Mailets ....................... SKIPPED
[INFO] Apache James Server File Data Persistence ......... SKIPPED
[INFO] Apache James Server JPA Data Persistence .......... SKIPPED
[INFO] Apache James Server JDBC Data Persistence ......... SKIPPED
[INFO] Apache James Server JCR Data Persistence .......... SKIPPED
[INFO] Apache James Server Container Spring .............. SKIPPED
[INFO] Apache James Server OSGI Bindings ................. SKIPPED
[INFO] ------------------------------------------------------------------------
[INFO] BUILD FAILURE
[INFO] ------------------------------------------------------------------------
[INFO] Total time: 2:31.779s
[INFO] Finished at: Thu Mar 24 21:55:07 UTC 2011
[INFO] Final Memory: 45M/188M
[INFO] ------------------------------------------------------------------------
maven builder waiting
mavenExecutionResult exceptions not empty
org.apache.maven.lifecycle.LifecycleExecutionException: Failed to execute goal org.apache.maven.plugins:maven-compiler-plugin:2.3.2:compile (default-compile) on project james-server-imapserver: Compilation failure
at org.apache.maven.lifecycle.internal.MojoExecutor.execute(MojoExecutor.java:213)
at org.apache.maven.lifecycle.internal.MojoExecutor.execute(MojoExecutor.java:153)
at org.apache.maven.lifecycle.internal.MojoExecutor.execute(MojoExecutor.java:145)
at org.apache.maven.lifecycle.internal.LifecycleModuleBuilder.buildProject(LifecycleModuleBuilder.java:84)
at org.apache.maven.lifecycle.internal.LifecycleModuleBuilder.buildProject(LifecycleModuleBuilder.java:59)
at org.apache.maven.lifecycle.internal.LifecycleStarter.singleThreadedBuild(LifecycleStarter.java:183)
at org.apache.maven.lifecycle.internal.LifecycleStarter.execute(LifecycleStarter.java:161)
at org.apache.maven.DefaultMaven.doExecute(DefaultMaven.java:319)
at org.apache.maven.DefaultMaven.execute(DefaultMaven.java:156)
at org.jvnet.hudson.maven3.launcher.Maven3Launcher.main(Maven3Launcher.java:79)
at sun.reflect.NativeMethodAccessorImpl.invoke0(Native Method)
at sun.reflect.NativeMethodAccessorImpl.invoke(NativeMethodAccessorImpl.java:39)
at sun.reflect.DelegatingMethodAccessorImpl.invoke(DelegatingMethodAccessorImpl.java:25)
at java.lang.reflect.Method.invoke(Method.java:592)
at org.codehaus.plexus.classworlds.launcher.Launcher.launchStandard(Launcher.java:329)
at org.codehaus.plexus.classworlds.launcher.Launcher.launch(Launcher.java:239)
at org.jvnet.hudson.maven3.agent.Maven3Main.launch(Maven3Main.java:146)
at hudson.maven.Maven3Builder.call(Maven3Builder.java:124)
at hudson.maven.Maven3Builder.call(Maven3Builder.java:71)
at hudson.remoting.UserRequest.perform(UserRequest.java:114)
at hudson.remoting.UserRequest.perform(UserRequest.java:48)
at hudson.remoting.Request$2.run(Request.java:270)
at java.util.concurrent.Executors$RunnableAdapter.call(Executors.java:417)
at java.util.concurrent.FutureTask$Sync.innerRun(FutureTask.java:269)
at java.util.concurrent.FutureTask.run(FutureTask.java:123)
at java.util.concurrent.ThreadPoolExecutor$Worker.runTask(ThreadPoolExecutor.java:651)
at java.util.concurrent.ThreadPoolExecutor$Worker.run(ThreadPoolExecutor.java:676)
at java.lang.Thread.run(Thread.java:595)
Caused by: org.apache.maven.plugin.CompilationFailureException: Compilation failure
at org.apache.maven.plugin.AbstractCompilerMojo.execute(AbstractCompilerMojo.java:656)
at org.apache.maven.plugin.CompilerMojo.execute(CompilerMojo.java:128)
at org.apache.maven.plugin.DefaultBuildPluginManager.executeMojo(DefaultBuildPluginManager.java:101)
at org.apache.maven.lifecycle.internal.MojoExecutor.execute(MojoExecutor.java:209)
... 27 more
Sending e-mails to: server-dev@james.apache.org
channel stopped
---------------------------------------------------------------------
To unsubscribe, e-mail: server-dev-unsubscribe@james.apache.org
For additional commands, e-mail: server-dev-help@james.apache.org
Jenkins build is back to normal : james-server-trunk #1322
Posted by Apache Hudson Server <hu...@hudson.apache.org>.
See <https://hudson.apache.org/hudson/job/james-server-trunk/1322/changes>
---------------------------------------------------------------------
To unsubscribe, e-mail: server-dev-unsubscribe@james.apache.org
For additional commands, e-mail: server-dev-help@james.apache.org
Build failed in Jenkins: james-server-trunk #1321
Posted by Apache Hudson Server <hu...@hudson.apache.org>.
See <https://hudson.apache.org/hudson/job/james-server-trunk/1321/>
------------------------------------------
[...truncated 1721 lines...]
Downloading: http://repository.apache.org/snapshots/org/apache/james/protocols/protocols-smtp/1.4-SNAPSHOT/maven-metadata.xml
Downloading: http://download.java.net/maven/2/org/apache/james/protocols/protocols-smtp/1.4-SNAPSHOT/maven-metadata.xml
Downloaded: http://repository.apache.org/snapshots/org/apache/james/protocols/protocols-smtp/1.4-SNAPSHOT/maven-metadata.xml (998 B at 11.9 KB/sec)
Downloading: http://repository.apache.org/snapshots/org/apache/james/protocols/protocols-smtp/1.4-SNAPSHOT/protocols-smtp-1.4-20110325.065111-48.jar
Downloading: http://repository.apache.org/snapshots/org/apache/james/protocols/protocols-smtp/1.4-SNAPSHOT/protocols-smtp-1.4-20110325.065111-48-tests.jar
Downloaded: http://repository.apache.org/snapshots/org/apache/james/protocols/protocols-smtp/1.4-SNAPSHOT/protocols-smtp-1.4-20110325.065111-48.jar (91 KB at 403.2 KB/sec)
Downloaded: http://repository.apache.org/snapshots/org/apache/james/protocols/protocols-smtp/1.4-SNAPSHOT/protocols-smtp-1.4-20110325.065111-48-tests.jar (30 KB at 133.7 KB/sec)
[INFO] [INFO] Deleting <https://hudson.apache.org/hudson/job/james-server-trunk/ws/trunk/smtpserver/target>
[INFO] --- maven-clean-plugin:2.4.1:clean (default-clean) @ james-server-smtpserver ---
[INFO]
[INFO] --- maven-remote-resources-plugin:1.1:process (default) @ james-server-smtpserver ---
Downloading: http://repository.apache.org/snapshots/org/apache/james/protocols/protocols-smtp/1.4-SNAPSHOT/maven-metadata.xml
Downloading: http://download.java.net/maven/2/org/apache/james/protocols/protocols-smtp/1.4-SNAPSHOT/maven-metadata.xml
Downloaded: http://repository.apache.org/snapshots/org/apache/james/protocols/protocols-smtp/1.4-SNAPSHOT/maven-metadata.xml (998 B at 10.5 KB/sec)
[INFO] Using 'UTF-8' encoding to copy filtered resources.
[INFO] [INFO] Copying 0 resource
[INFO] Copying 3 resources
[INFO] --- maven-resources-plugin:2.4.3:resources (default-resources) @ james-server-smtpserver ---
[INFO]
[INFO] --- maven-compiler-plugin:2.3.2:compile (default-compile) @ james-server-smtpserver ---
[INFO] Compiling 48 source files to <https://hudson.apache.org/hudson/job/james-server-trunk/ws/trunk/smtpserver/target/classes>
[INFO]
[INFO] --- maven-bundle-plugin:2.1.0:manifest (bundle-manifest) @ james-server-smtpserver ---
[INFO] Using 'UTF-8' encoding to copy filtered resources.
[INFO] [INFO] Copying 1 resource
[INFO] Copying 3 resources
[INFO] --- maven-resources-plugin:2.4.3:testResources (default-testResources) @ james-server-smtpserver ---
[INFO]
[INFO] --- maven-compiler-plugin:2.3.2:testCompile (default-testCompile) @ james-server-smtpserver ---
[INFO] Compiling 18 source files to <https://hudson.apache.org/hudson/job/james-server-trunk/ws/trunk/smtpserver/target/test-classes>
[INFO] Surefire report directory: <https://hudson.apache.org/hudson/job/james-server-trunk/ws/trunk/smtpserver/target/surefire-reports>
[INFO]
[INFO] --- maven-surefire-plugin:2.7.2:test (default-test) @ james-server-smtpserver ---
-------------------------------------------------------
T E S T S
-------------------------------------------------------
Running org.apache.james.smtpserver.SPFHandlerTest
Tests run: 8, Failures: 0, Errors: 0, Skipped: 0, Time elapsed: 0.188 sec
Running org.apache.james.smtpserver.ValidRcptMXTest
Tests run: 1, Failures: 0, Errors: 0, Skipped: 0, Time elapsed: 0.015 sec
Running org.apache.james.smtpserver.URIRBLHandlerTest
Tests run: 3, Failures: 0, Errors: 0, Skipped: 0, Time elapsed: 0.155 sec
Running org.apache.james.smtpserver.SpamAssassinHandlerTest
Tests run: 3, Failures: 0, Errors: 0, Skipped: 0, Time elapsed: 0.015 sec
Running org.apache.james.smtpserver.ValidRcptHandlerTest
Tests run: 5, Failures: 0, Errors: 0, Skipped: 0, Time elapsed: 0.023 sec
Running org.apache.james.smtpserver.POP3BeforeSMTPHandlerTest
Tests run: 4, Failures: 0, Errors: 0, Skipped: 0, Time elapsed: 0.109 sec
Running org.apache.james.smtpserver.OioSMTPServerTest
500 Line length exceeded. See RFC 2821 #4.5.3.1.
Tests run: 38, Failures: 0, Errors: 0, Skipped: 0, Time elapsed: 1.41 sec
Running org.apache.james.smtpserver.SetMimeHeaderHandlerTest
Tests run: 2, Failures: 0, Errors: 0, Skipped: 0, Time elapsed: 0.002 sec
Results :
Tests run: 64, Failures: 0, Errors: 0, Skipped: 0
[JENKINS] Recording test results
[INFO]
[INFO] --- maven-jar-plugin:2.3.1:jar (default-jar) @ james-server-smtpserver ---
[INFO] Building jar: <https://hudson.apache.org/hudson/job/james-server-trunk/ws/trunk/smtpserver/target/james-server-smtpserver-3.0-M3-SNAPSHOT.jar>
[INFO]
[INFO] --- maven-jar-plugin:2.3.1:test-jar (default) @ james-server-smtpserver ---
[INFO] Building jar: <https://hudson.apache.org/hudson/job/james-server-trunk/ws/trunk/smtpserver/target/james-server-smtpserver-3.0-M3-SNAPSHOT-tests.jar>
[INFO]
[INFO] --- maven-site-plugin:3.0-beta-3:attach-descriptor (attach-descriptor) @ james-server-smtpserver ---
[INFO] [INFO] Installing <https://hudson.apache.org/hudson/job/james-server-trunk/ws/trunk/smtpserver/target/james-server-smtpserver-3.0-M3-SNAPSHOT.jar> to /home/hudson/.m2/repository/org/apache/james/james-server-smtpserver/3.0-M3-SNAPSHOT/james-server-smtpserver-3.0-M3-SNAPSHOT.jar
[INFO] --- maven-install-plugin:2.3.1:install (default-install) @ james-server-smtpserver ---
[INFO] Installing <https://hudson.apache.org/hudson/job/james-server-trunk/ws/trunk/smtpserver/pom.xml> to /home/hudson/.m2/repository/org/apache/james/james-server-smtpserver/3.0-M3-SNAPSHOT/james-server-smtpserver-3.0-M3-SNAPSHOT.pom
[INFO] Installing <https://hudson.apache.org/hudson/job/james-server-trunk/ws/trunk/smtpserver/target/james-server-smtpserver-3.0-M3-SNAPSHOT-tests.jar> to /home/hudson/.m2/repository/org/apache/james/james-server-smtpserver/3.0-M3-SNAPSHOT/james-server-smtpserver-3.0-M3-SNAPSHOT-tests.jar
[INFO] Downloading: https://repository.apache.org/content/repositories/snapshots/org/apache/james/james-server-smtpserver/3.0-M3-SNAPSHOT/maven-metadata.xml
[INFO] --- maven-deploy-plugin:2.4:deploy (default-deploy) @ james-server-smtpserver ---
Downloaded: https://repository.apache.org/content/repositories/snapshots/org/apache/james/james-server-smtpserver/3.0-M3-SNAPSHOT/maven-metadata.xml (1009 B at 7.0 KB/sec)
Uploading: https://repository.apache.org/content/repositories/snapshots/org/apache/james/james-server-smtpserver/3.0-M3-SNAPSHOT/james-server-smtpserver-3.0-M3-20110325.101128-80.jar
Uploaded: https://repository.apache.org/content/repositories/snapshots/org/apache/james/james-server-smtpserver/3.0-M3-SNAPSHOT/james-server-smtpserver-3.0-M3-20110325.101128-80.jar (94 KB at 196.3 KB/sec)
Uploading: https://repository.apache.org/content/repositories/snapshots/org/apache/james/james-server-smtpserver/3.0-M3-SNAPSHOT/james-server-smtpserver-3.0-M3-20110325.101128-80.pom
Uploaded: https://repository.apache.org/content/repositories/snapshots/org/apache/james/james-server-smtpserver/3.0-M3-SNAPSHOT/james-server-smtpserver-3.0-M3-20110325.101128-80.pom (7 KB at 40.0 KB/sec)
Downloading: https://repository.apache.org/content/repositories/snapshots/org/apache/james/james-server-smtpserver/maven-metadata.xml
Downloaded: https://repository.apache.org/content/repositories/snapshots/org/apache/james/james-server-smtpserver/maven-metadata.xml (300 B at 1.5 KB/sec)
Uploading: https://repository.apache.org/content/repositories/snapshots/org/apache/james/james-server-smtpserver/3.0-M3-SNAPSHOT/maven-metadata.xml
Uploaded: https://repository.apache.org/content/repositories/snapshots/org/apache/james/james-server-smtpserver/3.0-M3-SNAPSHOT/maven-metadata.xml (1009 B at 5.5 KB/sec)
Uploading: https://repository.apache.org/content/repositories/snapshots/org/apache/james/james-server-smtpserver/maven-metadata.xml
Uploaded: https://repository.apache.org/content/repositories/snapshots/org/apache/james/james-server-smtpserver/maven-metadata.xml (300 B at 1.7 KB/sec)
Uploading: https://repository.apache.org/content/repositories/snapshots/org/apache/james/james-server-smtpserver/3.0-M3-SNAPSHOT/james-server-smtpserver-3.0-M3-20110325.101128-80-tests.jar
Uploaded: https://repository.apache.org/content/repositories/snapshots/org/apache/james/james-server-smtpserver/3.0-M3-SNAPSHOT/james-server-smtpserver-3.0-M3-20110325.101128-80-tests.jar (66 KB at 290.4 KB/sec)
Uploading: https://repository.apache.org/content/repositories/snapshots/org/apache/james/james-server-smtpserver/3.0-M3-SNAPSHOT/maven-metadata.xml
Uploaded: https://repository.apache.org/content/repositories/snapshots/org/apache/james/james-server-smtpserver/3.0-M3-SNAPSHOT/maven-metadata.xml (1009 B at 6.7 KB/sec)
projectSucceeded org.apache.james:james-server-smtpserver:3.0-M3-SNAPSHOT
[JENKINS] Archiving <https://hudson.apache.org/hudson/job/james-server-trunk/ws/trunk/smtpserver/pom.xml> to /home/hudson/hudson/jobs/james-server-trunk/modules/org.apache.james$james-server-smtpserver/builds/2011-03-25_10-08-28/archive/org.apache.james/james-server-smtpserver/3.0-M3-SNAPSHOT/pom.xml
[JENKINS] Archiving <https://hudson.apache.org/hudson/job/james-server-trunk/ws/trunk/smtpserver/target/james-server-smtpserver-3.0-M3-SNAPSHOT.jar> to /home/hudson/hudson/jobs/james-server-trunk/modules/org.apache.james$james-server-smtpserver/builds/2011-03-25_10-08-28/archive/org.apache.james/james-server-smtpserver/3.0-M3-20110325.101128-80/james-server-smtpserver-3.0-M3-SNAPSHOT.jar
[JENKINS] Archiving <https://hudson.apache.org/hudson/job/james-server-trunk/ws/trunk/smtpserver/target/james-server-smtpserver-3.0-M3-SNAPSHOT-tests.jar> to /home/hudson/hudson/jobs/james-server-trunk/modules/org.apache.james$james-server-smtpserver/builds/2011-03-25_10-08-28/archive/org.apache.james/james-server-smtpserver/3.0-M3-20110325.101128-80/james-server-smtpserver-3.0-M3-SNAPSHOT-tests.jar
[INFO]
[INFO] ------------------------------------------------------------------------
[INFO] Building Apache James Server IMAP 3.0-M3-SNAPSHOT
[INFO] ------------------------------------------------------------------------
Downloading: http://download.java.net/maven/2/org/apache/james/apache-james-imap-api/0.2-M2-SNAPSHOT/maven-metadata.xml
Downloading: http://repository.apache.org/snapshots/org/apache/james/apache-james-imap-api/0.2-M2-SNAPSHOT/maven-metadata.xml
Downloaded: http://repository.apache.org/snapshots/org/apache/james/apache-james-imap-api/0.2-M2-SNAPSHOT/maven-metadata.xml (1007 B at 1.9 KB/sec)
Downloading: http://download.java.net/maven/2/org/apache/james/apache-james-imap-api/0.2-M2-SNAPSHOT/apache-james-imap-api-0.2-M2-20110325.040728-60.pom
Downloading: http://repository.apache.org/snapshots/org/apache/james/apache-james-imap-api/0.2-M2-SNAPSHOT/apache-james-imap-api-0.2-M2-20110325.040728-60.pom
Downloaded: http://repository.apache.org/snapshots/org/apache/james/apache-james-imap-api/0.2-M2-SNAPSHOT/apache-james-imap-api-0.2-M2-20110325.040728-60.pom (2 KB at 5.4 KB/sec)
Downloading: http://download.java.net/maven/2/org/apache/james/apache-james-imap/0.2-M2-SNAPSHOT/maven-metadata.xml
Downloading: http://repository.apache.org/snapshots/org/apache/james/apache-james-imap/0.2-M2-SNAPSHOT/maven-metadata.xml
Downloaded: http://repository.apache.org/snapshots/org/apache/james/apache-james-imap/0.2-M2-SNAPSHOT/maven-metadata.xml (2 KB at 5.5 KB/sec)
Downloading: http://repository.apache.org/snapshots/org/apache/james/apache-james-imap/0.2-M2-SNAPSHOT/apache-james-imap-0.2-M2-20110325.040714-60.pom
Downloaded: http://repository.apache.org/snapshots/org/apache/james/apache-james-imap/0.2-M2-SNAPSHOT/apache-james-imap-0.2-M2-20110325.040714-60.pom (21 KB at 122.3 KB/sec)
Downloading: http://download.java.net/maven/2/org/apache/james/apache-james-imap-message/0.2-M2-SNAPSHOT/maven-metadata.xml
Downloading: http://repository.apache.org/snapshots/org/apache/james/apache-james-imap-message/0.2-M2-SNAPSHOT/maven-metadata.xml
Downloaded: http://repository.apache.org/snapshots/org/apache/james/apache-james-imap-message/0.2-M2-SNAPSHOT/maven-metadata.xml (1011 B at 7.3 KB/sec)
Downloading: http://download.java.net/maven/2/org/apache/james/apache-james-imap-message/0.2-M2-SNAPSHOT/apache-james-imap-message-0.2-M2-20110325.040802-59.pom
Downloading: http://repository.apache.org/snapshots/org/apache/james/apache-james-imap-message/0.2-M2-SNAPSHOT/apache-james-imap-message-0.2-M2-20110325.040802-59.pom
Downloaded: http://repository.apache.org/snapshots/org/apache/james/apache-james-imap-message/0.2-M2-SNAPSHOT/apache-james-imap-message-0.2-M2-20110325.040802-59.pom (3 KB at 25.8 KB/sec)
Downloading: http://download.java.net/maven/2/org/apache/james/apache-james-imap-processor/0.2-M2-SNAPSHOT/maven-metadata.xml
Downloading: http://repository.apache.org/snapshots/org/apache/james/apache-james-imap-processor/0.2-M2-SNAPSHOT/maven-metadata.xml
Downloaded: http://repository.apache.org/snapshots/org/apache/james/apache-james-imap-processor/0.2-M2-SNAPSHOT/maven-metadata.xml (1013 B at 8.3 KB/sec)
Downloading: http://download.java.net/maven/2/org/apache/james/apache-james-imap-processor/0.2-M2-SNAPSHOT/apache-james-imap-processor-0.2-M2-20110325.040818-59.pom
Downloading: http://repository.apache.org/snapshots/org/apache/james/apache-james-imap-processor/0.2-M2-SNAPSHOT/apache-james-imap-processor-0.2-M2-20110325.040818-59.pom
Downloaded: http://repository.apache.org/snapshots/org/apache/james/apache-james-imap-processor/0.2-M2-SNAPSHOT/apache-james-imap-processor-0.2-M2-20110325.040818-59.pom (2 KB at 23.6 KB/sec)
Downloading: http://repository.apache.org/snapshots/org/apache/james/apache-james-imap-api/0.2-M2-SNAPSHOT/apache-james-imap-api-0.2-M2-20110325.040728-60.jar
Downloading: http://repository.apache.org/snapshots/org/apache/james/apache-james-imap-message/0.2-M2-SNAPSHOT/apache-james-imap-message-0.2-M2-20110325.040802-59.jar
Downloading: http://repository.apache.org/snapshots/org/apache/james/apache-james-imap-processor/0.2-M2-SNAPSHOT/apache-james-imap-processor-0.2-M2-20110325.040818-59.jar
Downloaded: http://repository.apache.org/snapshots/org/apache/james/apache-james-imap-processor/0.2-M2-SNAPSHOT/apache-james-imap-processor-0.2-M2-20110325.040818-59.jar (117 KB at 380.5 KB/sec)
Downloaded: http://repository.apache.org/snapshots/org/apache/james/apache-james-imap-message/0.2-M2-SNAPSHOT/apache-james-imap-message-0.2-M2-20110325.040802-59.jar (160 KB at 469.4 KB/sec)
Downloaded: http://repository.apache.org/snapshots/org/apache/james/apache-james-imap-api/0.2-M2-SNAPSHOT/apache-james-imap-api-0.2-M2-20110325.040728-60.jar (41 KB at 92.2 KB/sec)
[INFO] Deleting <https://hudson.apache.org/hudson/job/james-server-trunk/ws/trunk/imapserver/target>
[INFO]
[INFO] --- maven-clean-plugin:2.4.1:clean (default-clean) @ james-server-imapserver ---
[INFO]
[INFO] --- maven-remote-resources-plugin:1.1:process (default) @ james-server-imapserver ---
Downloading: http://download.java.net/maven/2/org/apache/james/apache-james-imap-api/0.2-M2-SNAPSHOT/maven-metadata.xml
Downloading: http://repository.apache.org/snapshots/org/apache/james/apache-james-imap-api/0.2-M2-SNAPSHOT/maven-metadata.xml
Downloaded: http://repository.apache.org/snapshots/org/apache/james/apache-james-imap-api/0.2-M2-SNAPSHOT/maven-metadata.xml (1007 B at 11.3 KB/sec)
Downloading: http://download.java.net/maven/2/org/apache/james/apache-james-imap-message/0.2-M2-SNAPSHOT/maven-metadata.xml
Downloading: http://repository.apache.org/snapshots/org/apache/james/apache-james-imap-message/0.2-M2-SNAPSHOT/maven-metadata.xml
Downloaded: http://repository.apache.org/snapshots/org/apache/james/apache-james-imap-message/0.2-M2-SNAPSHOT/maven-metadata.xml (1011 B at 6.4 KB/sec)
Downloading: http://repository.apache.org/snapshots/org/apache/james/apache-james-imap-processor/0.2-M2-SNAPSHOT/maven-metadata.xml
Downloading: http://download.java.net/maven/2/org/apache/james/apache-james-imap-processor/0.2-M2-SNAPSHOT/maven-metadata.xml
Downloaded: http://repository.apache.org/snapshots/org/apache/james/apache-james-imap-processor/0.2-M2-SNAPSHOT/maven-metadata.xml (1013 B at 11.0 KB/sec)
[INFO] [INFO] Using 'UTF-8' encoding to copy filtered resources.
[INFO] Copying 0 resource
[INFO] Copying 3 resources
[INFO] --- maven-resources-plugin:2.4.3:resources (default-resources) @ james-server-imapserver ---
[INFO]
[INFO] --- maven-compiler-plugin:2.3.2:compile (default-compile) @ james-server-imapserver ---
[INFO] Compiling 16 source files to <https://hudson.apache.org/hudson/job/james-server-trunk/ws/trunk/imapserver/target/classes>
[INFO] -------------------------------------------------------------
[ERROR] COMPILATION ERROR :
[INFO] -------------------------------------------------------------
[ERROR] <https://hudson.apache.org/hudson/job/james-server-trunk/ws/trunk/imapserver/src/main/java/org/apache/james/imapserver/netty/ChannelImapResponseWriter.java>:[54,18] cannot find symbol
symbol : constructor IOException(java.lang.String,java.lang.Throwable)
location: class java.io.IOException
[ERROR] <https://hudson.apache.org/hudson/job/james-server-trunk/ws/trunk/imapserver/src/main/java/org/apache/james/imapserver/netty/ChannelWritableByteChannel.java>:[62,18] cannot find symbol
symbol : constructor IOException(java.lang.String,java.lang.Throwable)
location: class java.io.IOException
[INFO] 2 errors
[INFO] -------------------------------------------------------------
mojoFailed org.apache.maven.plugins:maven-compiler-plugin:2.3.2(default-compile)
projectFailed org.apache.james:james-server-imapserver:3.0-M3-SNAPSHOT
[JENKINS] Archiving <https://hudson.apache.org/hudson/job/james-server-trunk/ws/trunk/imapserver/pom.xml> to /home/hudson/hudson/jobs/james-server-trunk/modules/org.apache.james$james-server-imapserver/builds/2011-03-25_10-08-28/archive/org.apache.james/james-server-imapserver/3.0-M3-SNAPSHOT/pom.xml
sessionEnded
[INFO] ------------------------------------------------------------------------
[INFO] Reactor Summary:
[INFO]
[INFO] Apache James Server ............................... SUCCESS [13.778s]
[INFO] Apache James Server Data API ...................... SUCCESS [8.247s]
[INFO] Apache James Server Client ........................ SUCCESS [4.864s]
[INFO] Apache James Server Lifecycle API ................. SUCCESS [5.025s]
[INFO] Apache James Server Filesystem API ................ SUCCESS [4.905s]
[INFO] Apache James Server Core .......................... SUCCESS [22.672s]
[INFO] Apache James Server Queue API ..................... SUCCESS [5.215s]
[INFO] Apache James Server Mailetcontainer library ....... SUCCESS [5.982s]
[INFO] Apache James Server DNS Server API ................ SUCCESS [5.246s]
[INFO] Apache James Server DNSService Library ............ SUCCESS [6.008s]
[INFO] Apache James Server Mailetcontainer Camel implementation SUCCESS [8.949s]
[INFO] Apache James Server Mailbox Adapter ............... SUCCESS [7.567s]
[INFO] Apache James Server DNSService Implementation ..... SUCCESS [6.781s]
[INFO] Apache James Server Common Utilities .............. SUCCESS [6.589s]
[INFO] Apache James Server Protocols Library ............. SUCCESS [7.805s]
[INFO] Apache James Server Data Library .................. SUCCESS [6.292s]
[INFO] Apache James Server LDAP Data Implementation ...... SUCCESS [5.076s]
[INFO] Apache James Server SMTP .......................... SUCCESS [10.803s]
[INFO] Apache James Server IMAP .......................... FAILURE [4.894s]
[INFO] Apache James Server LMTP .......................... SKIPPED
[INFO] Apache James Server POP3 .......................... SKIPPED
[INFO] Apache James Server FetchMail ..................... SKIPPED
[INFO] Apache James Server JMS Mail Queue ................ SKIPPED
[INFO] Apache James Server ActiveMQ Queue ................ SKIPPED
[INFO] Apache James Server Mailets ....................... SKIPPED
[INFO] Apache James Server File Data Persistence ......... SKIPPED
[INFO] Apache James Server JPA Data Persistence .......... SKIPPED
[INFO] Apache James Server JDBC Data Persistence ......... SKIPPED
[INFO] Apache James Server JCR Data Persistence .......... SKIPPED
[INFO] Apache James Server Container Spring .............. SKIPPED
[INFO] Apache James Server OSGI Bindings ................. SKIPPED
[INFO] ------------------------------------------------------------------------
[INFO] BUILD FAILURE
[INFO] ------------------------------------------------------------------------
[INFO] Total time: 2:57.465s
[INFO] Finished at: Fri Mar 25 10:11:37 UTC 2011
[INFO] Final Memory: 45M/185M
[INFO] ------------------------------------------------------------------------
maven builder waiting
mavenExecutionResult exceptions not empty
org.apache.maven.lifecycle.LifecycleExecutionException: Failed to execute goal org.apache.maven.plugins:maven-compiler-plugin:2.3.2:compile (default-compile) on project james-server-imapserver: Compilation failure
at org.apache.maven.lifecycle.internal.MojoExecutor.execute(MojoExecutor.java:213)
at org.apache.maven.lifecycle.internal.MojoExecutor.execute(MojoExecutor.java:153)
at org.apache.maven.lifecycle.internal.MojoExecutor.execute(MojoExecutor.java:145)
at org.apache.maven.lifecycle.internal.LifecycleModuleBuilder.buildProject(LifecycleModuleBuilder.java:84)
at org.apache.maven.lifecycle.internal.LifecycleModuleBuilder.buildProject(LifecycleModuleBuilder.java:59)
at org.apache.maven.lifecycle.internal.LifecycleStarter.singleThreadedBuild(LifecycleStarter.java:183)
at org.apache.maven.lifecycle.internal.LifecycleStarter.execute(LifecycleStarter.java:161)
at org.apache.maven.DefaultMaven.doExecute(DefaultMaven.java:319)
at org.apache.maven.DefaultMaven.execute(DefaultMaven.java:156)
at org.jvnet.hudson.maven3.launcher.Maven3Launcher.main(Maven3Launcher.java:79)
at sun.reflect.NativeMethodAccessorImpl.invoke0(Native Method)
at sun.reflect.NativeMethodAccessorImpl.invoke(NativeMethodAccessorImpl.java:39)
at sun.reflect.DelegatingMethodAccessorImpl.invoke(DelegatingMethodAccessorImpl.java:25)
at java.lang.reflect.Method.invoke(Method.java:592)
at org.codehaus.plexus.classworlds.launcher.Launcher.launchStandard(Launcher.java:329)
at org.codehaus.plexus.classworlds.launcher.Launcher.launch(Launcher.java:239)
at org.jvnet.hudson.maven3.agent.Maven3Main.launch(Maven3Main.java:146)
at hudson.maven.Maven3Builder.call(Maven3Builder.java:124)
at hudson.maven.Maven3Builder.call(Maven3Builder.java:71)
at hudson.remoting.UserRequest.perform(UserRequest.java:114)
at hudson.remoting.UserRequest.perform(UserRequest.java:48)
at hudson.remoting.Request$2.run(Request.java:270)
at java.util.concurrent.Executors$RunnableAdapter.call(Executors.java:417)
at java.util.concurrent.FutureTask$Sync.innerRun(FutureTask.java:269)
at java.util.concurrent.FutureTask.run(FutureTask.java:123)
at java.util.concurrent.ThreadPoolExecutor$Worker.runTask(ThreadPoolExecutor.java:651)
at java.util.concurrent.ThreadPoolExecutor$Worker.run(ThreadPoolExecutor.java:676)
at java.lang.Thread.run(Thread.java:595)
Caused by: org.apache.maven.plugin.CompilationFailureException: Compilation failure
at org.apache.maven.plugin.AbstractCompilerMojo.execute(AbstractCompilerMojo.java:656)
at org.apache.maven.plugin.CompilerMojo.execute(CompilerMojo.java:128)
at org.apache.maven.plugin.DefaultBuildPluginManager.executeMojo(DefaultBuildPluginManager.java:101)
at org.apache.maven.lifecycle.internal.MojoExecutor.execute(MojoExecutor.java:209)
... 27 more
Sending e-mails to: server-dev@james.apache.org
channel stopped
---------------------------------------------------------------------
To unsubscribe, e-mail: server-dev-unsubscribe@james.apache.org
For additional commands, e-mail: server-dev-help@james.apache.org
Build failed in Jenkins: james-server-trunk #1320
Posted by Apache Hudson Server <hu...@hudson.apache.org>.
See <https://hudson.apache.org/hudson/job/james-server-trunk/1320/changes>
Changes:
[norman] Let imapserver compile on java5 too
------------------------------------------
Started by an SCM change
Building remotely on ubuntu1
Updating http://svn.apache.org/repos/asf/james/server/trunk
U imapserver/src/main/java/org/apache/james/imapserver/netty/ChannelWritableByteChannel.java
U imapserver/src/main/java/org/apache/james/imapserver/netty/ChannelImapResponseWriter.java
At revision 1085301
Found mavenVersion 3.0.3 from file jar:file:/home/hudson/tools/maven/latest3/lib/maven-core-3.0.3.jar!/META-INF/maven/org.apache.maven/maven-core/pom.properties
Parsing POMs
ERROR: Processing failed due to a bug in the code. Please report this to jenkins-users@googlegroups.com
java.lang.ClassCastException: cannot assign instance of hudson.model.StreamBuildListener to field hudson.maven.MavenModuleSetBuild$PomParser.listener of type hudson.model.BuildListener in instance of hudson.maven.MavenModuleSetBuild$PomParser
at java.io.ObjectStreamClass$FieldReflector.setObjFieldValues(ObjectStreamClass.java:2056)
at java.io.ObjectStreamClass.setObjFieldValues(ObjectStreamClass.java:1229)
at java.io.ObjectInputStream.defaultReadFields(ObjectInputStream.java:1969)
at java.io.ObjectInputStream.readSerialData(ObjectInputStream.java:1887)
at java.io.ObjectInputStream.readOrdinaryObject(ObjectInputStream.java:1770)
at java.io.ObjectInputStream.readObject0(ObjectInputStream.java:1346)
at java.io.ObjectInputStream.defaultReadFields(ObjectInputStream.java:1963)
at java.io.ObjectInputStream.readSerialData(ObjectInputStream.java:1887)
at java.io.ObjectInputStream.readOrdinaryObject(ObjectInputStream.java:1770)
at java.io.ObjectInputStream.readObject0(ObjectInputStream.java:1346)
at java.io.ObjectInputStream.readObject(ObjectInputStream.java:368)
at hudson.remoting.UserRequest.deserialize(UserRequest.java:178)
at hudson.remoting.UserRequest.perform(UserRequest.java:98)
at hudson.remoting.UserRequest.perform(UserRequest.java:48)
at hudson.remoting.Request$2.run(Request.java:270)
at java.util.concurrent.Executors$RunnableAdapter.call(Executors.java:471)
at java.util.concurrent.FutureTask$Sync.innerRun(FutureTask.java:334)
at java.util.concurrent.FutureTask.run(FutureTask.java:166)
at java.util.concurrent.ThreadPoolExecutor.runWorker(ThreadPoolExecutor.java:1110)
at java.util.concurrent.ThreadPoolExecutor$Worker.run(ThreadPoolExecutor.java:603)
at java.lang.Thread.run(Thread.java:636)
project=hudson.maven.MavenModuleSet@5e00b48c[james-server-trunk]
project.getModules()=[hudson.maven.MavenModule@49ec1758[james-server-trunk/org.apache.james:james-server][james-server-trunk/org.apache.james:james-server][relativePath:], hudson.maven.MavenModule@4fbf1942[james-server-trunk/org.apache.james:james-server-cli][james-server-trunk/org.apache.james:james-server-cli][relativePath:cli], hudson.maven.MavenModule@21d52584[james-server-trunk/org.apache.james:james-server-common-util][james-server-trunk/org.apache.james:james-server-common-util][relativePath:common-util], hudson.maven.MavenModule@40f4dd2b[james-server-trunk/org.apache.james:james-server-container-spring][james-server-trunk/org.apache.james:james-server-container-spring][relativePath:container-spring], hudson.maven.MavenModule@5a6ad119[james-server-trunk/org.apache.james:james-server-core][james-server-trunk/org.apache.james:james-server-core][relativePath:core], hudson.maven.MavenModule@43675bf3[james-server-trunk/org.apache.james:james-server-core-api][james-server-trunk/org.apache.james:james-server-core-api][relativePath:core-api], hudson.maven.MavenModule@3ff70d3c[james-server-trunk/org.apache.james:james-server-core-function][james-server-trunk/org.apache.james:james-server-core-function][relativePath:core-function], hudson.maven.MavenModule@48f71ae6[james-server-trunk/org.apache.james:james-server-core-library][james-server-trunk/org.apache.james:james-server-core-library][relativePath:core-library], hudson.maven.MavenModule@60cf4da0[james-server-trunk/org.apache.james:james-server-data-api][james-server-trunk/org.apache.james:james-server-data-api][relativePath:data-api], hudson.maven.MavenModule@4ac92718[james-server-trunk/org.apache.james:james-server-data-library][james-server-trunk/org.apache.james:james-server-data-library][relativePath:data-library], hudson.maven.MavenModule@24b49e52[james-server-trunk/org.apache.james:james-server-dnsserver][james-server-trunk/org.apache.james:james-server-dnsserver][relativePath:dnsserver], hudson.maven.MavenModule@704afdc4[james-server-trunk/org.apache.james:james-server-dnsserver-api][james-server-trunk/org.apache.james:james-server-dnsserver-api][relativePath:dnsserver-api], hudson.maven.MavenModule@16a40b2[james-server-trunk/org.apache.james:james-server-dnsservice-api][james-server-trunk/org.apache.james:james-server-dnsservice-api][relativePath:dnsservice-api], hudson.maven.MavenModule@19bfff0b[james-server-trunk/org.apache.james:james-server-dnsservice-dnsjava][james-server-trunk/org.apache.james:james-server-dnsservice-dnsjava][relativePath:dnsservice-dnsjava], hudson.maven.MavenModule@200704fb[james-server-trunk/org.apache.james:james-server-dnsservice-library][james-server-trunk/org.apache.james:james-server-dnsservice-library][relativePath:dnsservice-library], hudson.maven.MavenModule@5a08f27c[james-server-trunk/org.apache.james:james-server-domain-api][james-server-trunk/org.apache.james:james-server-domain-api][relativePath:domain-api], hudson.maven.MavenModule@1bc50966[james-server-trunk/org.apache.james:james-server-domain-function][james-server-trunk/org.apache.james:james-server-domain-function][relativePath:domain-function], hudson.maven.MavenModule@48f82726[james-server-trunk/org.apache.james:james-server-domain-jdbc][james-server-trunk/org.apache.james:james-server-domain-jdbc][relativePath:domain-jdbc], hudson.maven.MavenModule@6809bdf8[james-server-trunk/org.apache.james:james-server-domain-jpa][james-server-trunk/org.apache.james:james-server-domain-jpa][relativePath:domain-jpa], hudson.maven.MavenModule@2613e674[james-server-trunk/org.apache.james:james-server-domain-library][james-server-trunk/org.apache.james:james-server-domain-library][relativePath:domain-library], hudson.maven.MavenModule@13b4c982[james-server-trunk/org.apache.james:james-server-domain-xml][james-server-trunk/org.apache.james:james-server-domain-xml][relativePath:domain-xml], hudson.maven.MavenModule@78a1068[james-server-trunk/org.apache.james:james-server-domainlist-api][james-server-trunk/org.apache.james:james-server-domainlist-api][relativePath:domainlist-api], hudson.maven.MavenModule@160ac750[james-server-trunk/org.apache.james:james-server-domainlist-jdbc][james-server-trunk/org.apache.james:james-server-domainlist-jdbc][relativePath:domainlist-jdbc], hudson.maven.MavenModule@1355e69[james-server-trunk/org.apache.james:james-server-domainlist-jpa][james-server-trunk/org.apache.james:james-server-domainlist-jpa][relativePath:domainlist-jpa], hudson.maven.MavenModule@178c47d[james-server-trunk/org.apache.james:james-server-domainlist-library][james-server-trunk/org.apache.james:james-server-domainlist-library][relativePath:domainlist-library], hudson.maven.MavenModule@431029a3[james-server-trunk/org.apache.james:james-server-domainlist-xml][james-server-trunk/org.apache.james:james-server-domainlist-xml][relativePath:domainlist-xml], hudson.maven.MavenModule@87fd415[james-server-trunk/org.apache.james:james-server-fetchmail][james-server-trunk/org.apache.james:james-server-fetchmail][relativePath:fetchmail], hudson.maven.MavenModule@6bcea26e[james-server-trunk/org.apache.james:james-server-file][james-server-trunk/org.apache.james:james-server-file][relativePath:file], hudson.maven.MavenModule@3e4e6138[james-server-trunk/org.apache.james:james-server-filesystem-api][james-server-trunk/org.apache.james:james-server-filesystem-api][relativePath:filesystem-api], hudson.maven.MavenModule@4b497c62[james-server-trunk/org.apache.james:james-server-imapserver][james-server-trunk/org.apache.james:james-server-imapserver][relativePath:imapserver], hudson.maven.MavenModule@64f73fe2[james-server-trunk/org.apache.james:james-server-javamail-util][james-server-trunk/org.apache.james:james-server-javamail-util][relativePath:javamail-util], hudson.maven.MavenModule@44af908f[james-server-trunk/org.apache.james:james-server-jcr][james-server-trunk/org.apache.james:james-server-jcr][relativePath:jcr], hudson.maven.MavenModule@71cbab62[james-server-trunk/org.apache.james:james-server-jdbc][james-server-trunk/org.apache.james:james-server-jdbc][relativePath:jdbc], hudson.maven.MavenModule@68fc5a6c[james-server-trunk/org.apache.james:james-server-jpa][james-server-trunk/org.apache.james:james-server-jpa][relativePath:jpa], hudson.maven.MavenModule@396d3e90[james-server-trunk/org.apache.james:james-server-ldap][james-server-trunk/org.apache.james:james-server-ldap][relativePath:ldap], hudson.maven.MavenModule@5d3c9c43[james-server-trunk/org.apache.james:james-server-lifecycle-api][james-server-trunk/org.apache.james:james-server-lifecycle-api][relativePath:lifecycle-api], hudson.maven.MavenModule@43f1a352[james-server-trunk/org.apache.james:james-server-lmtpserver][james-server-trunk/org.apache.james:james-server-lmtpserver][relativePath:lmtpserver], hudson.maven.MavenModule@3f047fc3[james-server-trunk/org.apache.james:james-server-mail-api][james-server-trunk/org.apache.james:james-server-mail-api][relativePath:mail-api], hudson.maven.MavenModule@4dc1ee0f[james-server-trunk/org.apache.james:james-server-mail-file][james-server-trunk/org.apache.james:james-server-mail-file][relativePath:mail-file], hudson.maven.MavenModule@252b6749[james-server-trunk/org.apache.james:james-server-mail-jcr][james-server-trunk/org.apache.james:james-server-mail-jcr][relativePath:mail-jcr], hudson.maven.MavenModule@3b1d466b[james-server-trunk/org.apache.james:james-server-mail-jdbc][james-server-trunk/org.apache.james:james-server-mail-jdbc][relativePath:mail-jdbc], hudson.maven.MavenModule@3eafdb52[james-server-trunk/org.apache.james:james-server-mail-library][james-server-trunk/org.apache.james:james-server-mail-library][relativePath:mail-library], hudson.maven.MavenModule@3681fe9a[james-server-trunk/org.apache.james:james-server-mailbox-adapter][james-server-trunk/org.apache.james:james-server-mailbox-adapter][relativePath:mailbox-adapter], hudson.maven.MavenModule@465e1377[james-server-trunk/org.apache.james:james-server-mailetcontainer-api][james-server-trunk/org.apache.james:james-server-mailetcontainer-api][relativePath:mailetcontainer-api], hudson.maven.MavenModule@62faaa17[james-server-trunk/org.apache.james:james-server-mailetcontainer-camel][james-server-trunk/org.apache.james:james-server-mailetcontainer-camel][relativePath:mailetcontainer-camel], hudson.maven.MavenModule@1e5f0fd7[james-server-trunk/org.apache.james:james-server-mailetcontainer-impl][james-server-trunk/org.apache.james:james-server-mailetcontainer-impl][relativePath:mailetcontainer-impl], hudson.maven.MavenModule@51386c70[james-server-trunk/org.apache.james:james-server-mailetcontainer-library][james-server-trunk/org.apache.james:james-server-mailetcontainer-library][relativePath:mailetcontainer-library], hudson.maven.MavenModule@3135d0d0[james-server-trunk/org.apache.james:james-server-mailets][james-server-trunk/org.apache.james:james-server-mailets][relativePath:mailets], hudson.maven.MavenModule@2c45fe1a[james-server-trunk/org.apache.james:james-server-management][james-server-trunk/org.apache.james:james-server-management][relativePath:management], hudson.maven.MavenModule@3f9ba6d6[james-server-trunk/org.apache.james:james-server-netty-socket][james-server-trunk/org.apache.james:james-server-netty-socket][relativePath:nio-netty], hudson.maven.MavenModule@5449a5ba[james-server-trunk/org.apache.james:james-server-nio-netty][james-server-trunk/org.apache.james:james-server-nio-netty][relativePath:nio-netty], hudson.maven.MavenModule@35aa1137[james-server-trunk/org.apache.james:james-server-osgi][james-server-trunk/org.apache.james:james-server-osgi][relativePath:osgi], hudson.maven.MavenModule@47f47e01[james-server-trunk/org.apache.james:james-server-pop3server][james-server-trunk/org.apache.james:james-server-pop3server][relativePath:pop3server], hudson.maven.MavenModule@56b87a95[james-server-trunk/org.apache.james:james-server-protocols-library][james-server-trunk/org.apache.james:james-server-protocols-library][relativePath:protocols-library], hudson.maven.MavenModule@7939b9bd[james-server-trunk/org.apache.james:james-server-queue-activemq][james-server-trunk/org.apache.james:james-server-queue-activemq][relativePath:queue-activemq], hudson.maven.MavenModule@7e96f890[james-server-trunk/org.apache.james:james-server-queue-api][james-server-trunk/org.apache.james:james-server-queue-api][relativePath:queue-api], hudson.maven.MavenModule@5cd4c5b1[james-server-trunk/org.apache.james:james-server-queue-jms][james-server-trunk/org.apache.james:james-server-queue-jms][relativePath:queue-jms], hudson.maven.MavenModule@6b3ab760[james-server-trunk/org.apache.james:james-server-queue-library][james-server-trunk/org.apache.james:james-server-queue-library][relativePath:queue-library], hudson.maven.MavenModule@691a7733[james-server-trunk/org.apache.james:james-server-remotemanager][james-server-trunk/org.apache.james:james-server-remotemanager][relativePath:remotemanager], hudson.maven.MavenModule@449b369[james-server-trunk/org.apache.james:james-server-repository-api][james-server-trunk/org.apache.james:james-server-repository-api][relativePath:repository-api], hudson.maven.MavenModule@723fff84[james-server-trunk/org.apache.james:james-server-repository-file][james-server-trunk/org.apache.james:james-server-repository-file][relativePath:repository-file], hudson.maven.MavenModule@44f37de3[james-server-trunk/org.apache.james:james-server-resolver-api][james-server-trunk/org.apache.james:james-server-resolver-api][relativePath:resolver-api], hudson.maven.MavenModule@55a32acc[james-server-trunk/org.apache.james:james-server-smtpserver][james-server-trunk/org.apache.james:james-server-smtpserver][relativePath:smtpserver], hudson.maven.MavenModule@47618f8[james-server-trunk/org.apache.james:james-server-spool-api][james-server-trunk/org.apache.james:james-server-spool-api][relativePath:spool-api], hudson.maven.MavenModule@2a2f7d55[james-server-trunk/org.apache.james:james-server-spoolmanager][james-server-trunk/org.apache.james:james-server-spoolmanager][relativePath:spoolmanager], hudson.maven.MavenModule@29c19925[james-server-trunk/org.apache.james:james-server-spring-common][james-server-trunk/org.apache.james:james-server-spring-common][relativePath:spring-common], hudson.maven.MavenModule@32bf9988[james-server-trunk/org.apache.james:james-server-spring-deployment][james-server-trunk/org.apache.james:james-server-spring-deployment][relativePath:spring-deployment], hudson.maven.MavenModule@5dbc21b2[james-server-trunk/org.apache.james:james-server-user-api][james-server-trunk/org.apache.james:james-server-user-api][relativePath:user-api], hudson.maven.MavenModule@14ee0887[james-server-trunk/org.apache.james:james-server-user-file][james-server-trunk/org.apache.james:james-server-user-file][relativePath:user-file], hudson.maven.MavenModule@4db4d125[james-server-trunk/org.apache.james:james-server-user-function][james-server-trunk/org.apache.james:james-server-user-function][relativePath:user-function], hudson.maven.MavenModule@6e9637fe[james-server-trunk/org.apache.james:james-server-user-jcr][james-server-trunk/org.apache.james:james-server-user-jcr][relativePath:user-jcr], hudson.maven.MavenModule@4fe4dad2[james-server-trunk/org.apache.james:james-server-user-jdbc][james-server-trunk/org.apache.james:james-server-user-jdbc][relativePath:user-jdbc], hudson.maven.MavenModule@77442cd0[james-server-trunk/org.apache.james:james-server-user-jpa][james-server-trunk/org.apache.james:james-server-user-jpa][relativePath:user-jpa], hudson.maven.MavenModule@892c746[james-server-trunk/org.apache.james:james-server-user-ldap][james-server-trunk/org.apache.james:james-server-user-ldap][relativePath:user-ldap], hudson.maven.MavenModule@1caae1f3[james-server-trunk/org.apache.james:james-server-user-library][james-server-trunk/org.apache.james:james-server-user-library][relativePath:user-library], hudson.maven.MavenModule@73216bf0[james-server-trunk/org.apache.james:james-server-util][james-server-trunk/org.apache.james:james-server-util][relativePath:util]]
project.getRootModule()=hudson.maven.MavenModule@49ec1758[james-server-trunk/org.apache.james:james-server][james-server-trunk/org.apache.james:james-server][relativePath:]
FATAL: cannot assign instance of hudson.model.StreamBuildListener to field hudson.maven.MavenModuleSetBuild$PomParser.listener of type hudson.model.BuildListener in instance of hudson.maven.MavenModuleSetBuild$PomParser
java.lang.ClassCastException: cannot assign instance of hudson.model.StreamBuildListener to field hudson.maven.MavenModuleSetBuild$PomParser.listener of type hudson.model.BuildListener in instance of hudson.maven.MavenModuleSetBuild$PomParser
at java.io.ObjectStreamClass$FieldReflector.setObjFieldValues(ObjectStreamClass.java:2056)
at java.io.ObjectStreamClass.setObjFieldValues(ObjectStreamClass.java:1229)
at java.io.ObjectInputStream.defaultReadFields(ObjectInputStream.java:1969)
at java.io.ObjectInputStream.readSerialData(ObjectInputStream.java:1887)
at java.io.ObjectInputStream.readOrdinaryObject(ObjectInputStream.java:1770)
at java.io.ObjectInputStream.readObject0(ObjectInputStream.java:1346)
at java.io.ObjectInputStream.defaultReadFields(ObjectInputStream.java:1963)
at java.io.ObjectInputStream.readSerialData(ObjectInputStream.java:1887)
at java.io.ObjectInputStream.readOrdinaryObject(ObjectInputStream.java:1770)
at java.io.ObjectInputStream.readObject0(ObjectInputStream.java:1346)
at java.io.ObjectInputStream.readObject(ObjectInputStream.java:368)
at hudson.remoting.UserRequest.deserialize(UserRequest.java:178)
at hudson.remoting.UserRequest.perform(UserRequest.java:98)
at hudson.remoting.UserRequest.perform(UserRequest.java:48)
at hudson.remoting.Request$2.run(Request.java:270)
at java.util.concurrent.Executors$RunnableAdapter.call(Executors.java:471)
at java.util.concurrent.FutureTask$Sync.innerRun(FutureTask.java:334)
at java.util.concurrent.FutureTask.run(FutureTask.java:166)
at java.util.concurrent.ThreadPoolExecutor.runWorker(ThreadPoolExecutor.java:1110)
at java.util.concurrent.ThreadPoolExecutor$Worker.run(ThreadPoolExecutor.java:603)
at java.lang.Thread.run(Thread.java:636)
---------------------------------------------------------------------
To unsubscribe, e-mail: server-dev-unsubscribe@james.apache.org
For additional commands, e-mail: server-dev-help@james.apache.org
Build failed in Jenkins: james-server-trunk #1319
Posted by Apache Hudson Server <hu...@hudson.apache.org>.
See <https://hudson.apache.org/hudson/job/james-server-trunk/1319/>
------------------------------------------
[...truncated 1683 lines...]
Uploaded: https://repository.apache.org/content/repositories/snapshots/org/apache/james/james-server-ldap/3.0-M3-SNAPSHOT/james-server-ldap-3.0-M3-20110325.065517-79-tests.jar (8 KB at 46.8 KB/sec)
Uploading: https://repository.apache.org/content/repositories/snapshots/org/apache/james/james-server-ldap/3.0-M3-SNAPSHOT/maven-metadata.xml
Uploaded: https://repository.apache.org/content/repositories/snapshots/org/apache/james/james-server-ldap/3.0-M3-SNAPSHOT/maven-metadata.xml (1003 B at 5.7 KB/sec)
projectSucceeded org.apache.james:james-server-ldap:3.0-M3-SNAPSHOT
[JENKINS] Archiving <https://hudson.apache.org/hudson/job/james-server-trunk/ws/trunk/ldap/pom.xml> to /home/hudson/hudson/jobs/james-server-trunk/modules/org.apache.james$james-server-ldap/builds/2011-03-25_06-52-48/archive/org.apache.james/james-server-ldap/3.0-M3-SNAPSHOT/pom.xml
[JENKINS] Archiving <https://hudson.apache.org/hudson/job/james-server-trunk/ws/trunk/ldap/target/james-server-ldap-3.0-M3-SNAPSHOT.jar> to /home/hudson/hudson/jobs/james-server-trunk/modules/org.apache.james$james-server-ldap/builds/2011-03-25_06-52-48/archive/org.apache.james/james-server-ldap/3.0-M3-20110325.065517-79/james-server-ldap-3.0-M3-SNAPSHOT.jar
[JENKINS] Archiving <https://hudson.apache.org/hudson/job/james-server-trunk/ws/trunk/ldap/target/james-server-ldap-3.0-M3-SNAPSHOT-tests.jar> to /home/hudson/hudson/jobs/james-server-trunk/modules/org.apache.james$james-server-ldap/builds/2011-03-25_06-52-48/archive/org.apache.james/james-server-ldap/3.0-M3-20110325.065517-79/james-server-ldap-3.0-M3-SNAPSHOT-tests.jar
[INFO] Downloading: http://download.java.net/maven/2/org/apache/james/protocols/protocols-smtp/1.4-SNAPSHOT/maven-metadata.xml
Downloading: http://repository.apache.org/snapshots/org/apache/james/protocols/protocols-smtp/1.4-SNAPSHOT/maven-metadata.xml
[INFO] ------------------------------------------------------------------------
[INFO] Building Apache James Server SMTP 3.0-M3-SNAPSHOT
[INFO] ------------------------------------------------------------------------
Downloaded: http://repository.apache.org/snapshots/org/apache/james/protocols/protocols-smtp/1.4-SNAPSHOT/maven-metadata.xml (998 B at 5.9 KB/sec)
Downloading: http://download.java.net/maven/2/org/apache/james/protocols/protocols-smtp/1.4-SNAPSHOT/protocols-smtp-1.4-20110325.065111-48.pom
Downloading: http://repository.apache.org/snapshots/org/apache/james/protocols/protocols-smtp/1.4-SNAPSHOT/protocols-smtp-1.4-20110325.065111-48.pom
Downloaded: http://repository.apache.org/snapshots/org/apache/james/protocols/protocols-smtp/1.4-SNAPSHOT/protocols-smtp-1.4-20110325.065111-48.pom (4 KB at 47.6 KB/sec)
Downloading: http://download.java.net/maven/2/org/apache/james/protocols/protocols-smtp/1.4-SNAPSHOT/maven-metadata.xml
Downloading: http://repository.apache.org/snapshots/org/apache/james/protocols/protocols-smtp/1.4-SNAPSHOT/maven-metadata.xml
Downloaded: http://repository.apache.org/snapshots/org/apache/james/protocols/protocols-smtp/1.4-SNAPSHOT/maven-metadata.xml (998 B at 12.3 KB/sec)
Downloading: http://repository.apache.org/snapshots/org/apache/james/protocols/protocols-smtp/1.4-SNAPSHOT/protocols-smtp-1.4-20110325.065111-48.jar
Downloading: http://repository.apache.org/snapshots/org/apache/james/protocols/protocols-smtp/1.4-SNAPSHOT/protocols-smtp-1.4-20110325.065111-48-tests.jar
Downloaded: http://repository.apache.org/snapshots/org/apache/james/protocols/protocols-smtp/1.4-SNAPSHOT/protocols-smtp-1.4-20110325.065111-48.jar (91 KB at 458.5 KB/sec)
Downloaded: http://repository.apache.org/snapshots/org/apache/james/protocols/protocols-smtp/1.4-SNAPSHOT/protocols-smtp-1.4-20110325.065111-48-tests.jar (30 KB at 152.0 KB/sec)
[INFO] [INFO] Deleting <https://hudson.apache.org/hudson/job/james-server-trunk/ws/trunk/smtpserver/target>
[INFO] --- maven-clean-plugin:2.4.1:clean (default-clean) @ james-server-smtpserver ---
[INFO]
[INFO] --- maven-remote-resources-plugin:1.1:process (default) @ james-server-smtpserver ---
Downloading: http://download.java.net/maven/2/org/apache/james/protocols/protocols-smtp/1.4-SNAPSHOT/maven-metadata.xml
Downloading: http://repository.apache.org/snapshots/org/apache/james/protocols/protocols-smtp/1.4-SNAPSHOT/maven-metadata.xml
Downloaded: http://repository.apache.org/snapshots/org/apache/james/protocols/protocols-smtp/1.4-SNAPSHOT/maven-metadata.xml (998 B at 12.0 KB/sec)
[INFO] [INFO] Using 'UTF-8' encoding to copy filtered resources.
[INFO] Copying 0 resource
[INFO] Copying 3 resources
[INFO] --- maven-resources-plugin:2.4.3:resources (default-resources) @ james-server-smtpserver ---
[INFO]
[INFO] --- maven-compiler-plugin:2.3.2:compile (default-compile) @ james-server-smtpserver ---
[INFO] Compiling 48 source files to <https://hudson.apache.org/hudson/job/james-server-trunk/ws/trunk/smtpserver/target/classes>
[INFO]
[INFO] --- maven-bundle-plugin:2.1.0:manifest (bundle-manifest) @ james-server-smtpserver ---
[INFO] [INFO] Using 'UTF-8' encoding to copy filtered resources.
[INFO] Copying 1 resource
[INFO] Copying 3 resources
[INFO] --- maven-resources-plugin:2.4.3:testResources (default-testResources) @ james-server-smtpserver ---
[INFO]
[INFO] Compiling 18 source files to <https://hudson.apache.org/hudson/job/james-server-trunk/ws/trunk/smtpserver/target/test-classes>
[INFO] --- maven-compiler-plugin:2.3.2:testCompile (default-testCompile) @ james-server-smtpserver ---
[INFO] Surefire report directory: <https://hudson.apache.org/hudson/job/james-server-trunk/ws/trunk/smtpserver/target/surefire-reports>
[INFO]
[INFO] --- maven-surefire-plugin:2.7.2:test (default-test) @ james-server-smtpserver ---
-------------------------------------------------------
T E S T S
-------------------------------------------------------
Running org.apache.james.smtpserver.SPFHandlerTest
Tests run: 8, Failures: 0, Errors: 0, Skipped: 0, Time elapsed: 0.182 sec
Running org.apache.james.smtpserver.OioSMTPServerTest
500 Line length exceeded. See RFC 2821 #4.5.3.1.
Tests run: 38, Failures: 0, Errors: 0, Skipped: 0, Time elapsed: 1.474 sec
Running org.apache.james.smtpserver.SetMimeHeaderHandlerTest
Tests run: 2, Failures: 0, Errors: 0, Skipped: 0, Time elapsed: 0.007 sec
Running org.apache.james.smtpserver.URIRBLHandlerTest
Tests run: 3, Failures: 0, Errors: 0, Skipped: 0, Time elapsed: 0.114 sec
Running org.apache.james.smtpserver.ValidRcptHandlerTest
Tests run: 5, Failures: 0, Errors: 0, Skipped: 0, Time elapsed: 0.004 sec
Running org.apache.james.smtpserver.POP3BeforeSMTPHandlerTest
Tests run: 4, Failures: 0, Errors: 0, Skipped: 0, Time elapsed: 0.103 sec
Running org.apache.james.smtpserver.ValidRcptMXTest
Tests run: 1, Failures: 0, Errors: 0, Skipped: 0, Time elapsed: 0.002 sec
Running org.apache.james.smtpserver.SpamAssassinHandlerTest
Tests run: 3, Failures: 0, Errors: 0, Skipped: 0, Time elapsed: 0.009 sec
Results :
Tests run: 64, Failures: 0, Errors: 0, Skipped: 0
[JENKINS] Recording test results
[INFO]
[INFO] --- maven-jar-plugin:2.3.1:jar (default-jar) @ james-server-smtpserver ---
[INFO] Building jar: <https://hudson.apache.org/hudson/job/james-server-trunk/ws/trunk/smtpserver/target/james-server-smtpserver-3.0-M3-SNAPSHOT.jar>
[INFO]
[INFO] --- maven-jar-plugin:2.3.1:test-jar (default) @ james-server-smtpserver ---
[INFO] Building jar: <https://hudson.apache.org/hudson/job/james-server-trunk/ws/trunk/smtpserver/target/james-server-smtpserver-3.0-M3-SNAPSHOT-tests.jar>
[INFO]
[INFO] --- maven-site-plugin:3.0-beta-3:attach-descriptor (attach-descriptor) @ james-server-smtpserver ---
[INFO] [INFO] Installing <https://hudson.apache.org/hudson/job/james-server-trunk/ws/trunk/smtpserver/target/james-server-smtpserver-3.0-M3-SNAPSHOT.jar> to /home/hudson/.m2/repository/org/apache/james/james-server-smtpserver/3.0-M3-SNAPSHOT/james-server-smtpserver-3.0-M3-SNAPSHOT.jar
[INFO] Installing <https://hudson.apache.org/hudson/job/james-server-trunk/ws/trunk/smtpserver/pom.xml> to /home/hudson/.m2/repository/org/apache/james/james-server-smtpserver/3.0-M3-SNAPSHOT/james-server-smtpserver-3.0-M3-SNAPSHOT.pom
[INFO] Installing <https://hudson.apache.org/hudson/job/james-server-trunk/ws/trunk/smtpserver/target/james-server-smtpserver-3.0-M3-SNAPSHOT-tests.jar> to /home/hudson/.m2/repository/org/apache/james/james-server-smtpserver/3.0-M3-SNAPSHOT/james-server-smtpserver-3.0-M3-SNAPSHOT-tests.jar
[INFO] --- maven-install-plugin:2.3.1:install (default-install) @ james-server-smtpserver ---
[INFO] Downloading: https://repository.apache.org/content/repositories/snapshots/org/apache/james/james-server-smtpserver/3.0-M3-SNAPSHOT/maven-metadata.xml
[INFO] --- maven-deploy-plugin:2.4:deploy (default-deploy) @ james-server-smtpserver ---
Downloaded: https://repository.apache.org/content/repositories/snapshots/org/apache/james/james-server-smtpserver/3.0-M3-SNAPSHOT/maven-metadata.xml (1009 B at 4.2 KB/sec)
Uploading: https://repository.apache.org/content/repositories/snapshots/org/apache/james/james-server-smtpserver/3.0-M3-SNAPSHOT/james-server-smtpserver-3.0-M3-20110325.065528-79.jar
Uploaded: https://repository.apache.org/content/repositories/snapshots/org/apache/james/james-server-smtpserver/3.0-M3-SNAPSHOT/james-server-smtpserver-3.0-M3-20110325.065528-79.jar (94 KB at 285.2 KB/sec)
Uploading: https://repository.apache.org/content/repositories/snapshots/org/apache/james/james-server-smtpserver/3.0-M3-SNAPSHOT/james-server-smtpserver-3.0-M3-20110325.065528-79.pom
Uploaded: https://repository.apache.org/content/repositories/snapshots/org/apache/james/james-server-smtpserver/3.0-M3-SNAPSHOT/james-server-smtpserver-3.0-M3-20110325.065528-79.pom (7 KB at 36.7 KB/sec)
Downloading: https://repository.apache.org/content/repositories/snapshots/org/apache/james/james-server-smtpserver/maven-metadata.xml
Downloaded: https://repository.apache.org/content/repositories/snapshots/org/apache/james/james-server-smtpserver/maven-metadata.xml (300 B at 2.2 KB/sec)
Uploading: https://repository.apache.org/content/repositories/snapshots/org/apache/james/james-server-smtpserver/3.0-M3-SNAPSHOT/maven-metadata.xml
Uploaded: https://repository.apache.org/content/repositories/snapshots/org/apache/james/james-server-smtpserver/3.0-M3-SNAPSHOT/maven-metadata.xml (1009 B at 6.7 KB/sec)
Uploading: https://repository.apache.org/content/repositories/snapshots/org/apache/james/james-server-smtpserver/maven-metadata.xml
Uploaded: https://repository.apache.org/content/repositories/snapshots/org/apache/james/james-server-smtpserver/maven-metadata.xml (300 B at 1.7 KB/sec)
Uploading: https://repository.apache.org/content/repositories/snapshots/org/apache/james/james-server-smtpserver/3.0-M3-SNAPSHOT/james-server-smtpserver-3.0-M3-20110325.065528-79-tests.jar
Uploaded: https://repository.apache.org/content/repositories/snapshots/org/apache/james/james-server-smtpserver/3.0-M3-SNAPSHOT/james-server-smtpserver-3.0-M3-20110325.065528-79-tests.jar (66 KB at 327.7 KB/sec)
Uploading: https://repository.apache.org/content/repositories/snapshots/org/apache/james/james-server-smtpserver/3.0-M3-SNAPSHOT/maven-metadata.xml
Uploaded: https://repository.apache.org/content/repositories/snapshots/org/apache/james/james-server-smtpserver/3.0-M3-SNAPSHOT/maven-metadata.xml (1009 B at 6.5 KB/sec)
projectSucceeded org.apache.james:james-server-smtpserver:3.0-M3-SNAPSHOT
[JENKINS] Archiving <https://hudson.apache.org/hudson/job/james-server-trunk/ws/trunk/smtpserver/pom.xml> to /home/hudson/hudson/jobs/james-server-trunk/modules/org.apache.james$james-server-smtpserver/builds/2011-03-25_06-52-48/archive/org.apache.james/james-server-smtpserver/3.0-M3-SNAPSHOT/pom.xml
[JENKINS] Archiving <https://hudson.apache.org/hudson/job/james-server-trunk/ws/trunk/smtpserver/target/james-server-smtpserver-3.0-M3-SNAPSHOT.jar> to /home/hudson/hudson/jobs/james-server-trunk/modules/org.apache.james$james-server-smtpserver/builds/2011-03-25_06-52-48/archive/org.apache.james/james-server-smtpserver/3.0-M3-20110325.065528-79/james-server-smtpserver-3.0-M3-SNAPSHOT.jar
[JENKINS] Archiving <https://hudson.apache.org/hudson/job/james-server-trunk/ws/trunk/smtpserver/target/james-server-smtpserver-3.0-M3-SNAPSHOT-tests.jar> to /home/hudson/hudson/jobs/james-server-trunk/modules/org.apache.james$james-server-smtpserver/builds/2011-03-25_06-52-48/archive/org.apache.james/james-server-smtpserver/3.0-M3-20110325.065528-79/james-server-smtpserver-3.0-M3-SNAPSHOT-tests.jar
[INFO] Downloading: http://download.java.net/maven/2/org/apache/james/apache-james-imap-api/0.2-M2-SNAPSHOT/maven-metadata.xml
Downloading: http://repository.apache.org/snapshots/org/apache/james/apache-james-imap-api/0.2-M2-SNAPSHOT/maven-metadata.xml
[INFO] ------------------------------------------------------------------------
[INFO] Building Apache James Server IMAP 3.0-M3-SNAPSHOT
[INFO] ------------------------------------------------------------------------
Downloaded: http://repository.apache.org/snapshots/org/apache/james/apache-james-imap-api/0.2-M2-SNAPSHOT/maven-metadata.xml (1007 B at 9.2 KB/sec)
Downloading: http://download.java.net/maven/2/org/apache/james/apache-james-imap/0.2-M2-SNAPSHOT/maven-metadata.xml
Downloading: http://repository.apache.org/snapshots/org/apache/james/apache-james-imap/0.2-M2-SNAPSHOT/maven-metadata.xml
Downloaded: http://repository.apache.org/snapshots/org/apache/james/apache-james-imap/0.2-M2-SNAPSHOT/maven-metadata.xml (2 KB at 7.1 KB/sec)
Downloading: http://download.java.net/maven/2/org/apache/james/apache-james-imap-message/0.2-M2-SNAPSHOT/maven-metadata.xml
Downloading: http://repository.apache.org/snapshots/org/apache/james/apache-james-imap-message/0.2-M2-SNAPSHOT/maven-metadata.xml
Downloaded: http://repository.apache.org/snapshots/org/apache/james/apache-james-imap-message/0.2-M2-SNAPSHOT/maven-metadata.xml (1011 B at 5.3 KB/sec)
Downloading: http://download.java.net/maven/2/org/apache/james/apache-james-imap-processor/0.2-M2-SNAPSHOT/maven-metadata.xml
Downloading: http://repository.apache.org/snapshots/org/apache/james/apache-james-imap-processor/0.2-M2-SNAPSHOT/maven-metadata.xml
Downloaded: http://repository.apache.org/snapshots/org/apache/james/apache-james-imap-processor/0.2-M2-SNAPSHOT/maven-metadata.xml (1013 B at 8.2 KB/sec)
[INFO] Deleting <https://hudson.apache.org/hudson/job/james-server-trunk/ws/trunk/imapserver/target>
[INFO]
[INFO] --- maven-clean-plugin:2.4.1:clean (default-clean) @ james-server-imapserver ---
[INFO]
[INFO] --- maven-remote-resources-plugin:1.1:process (default) @ james-server-imapserver ---
Downloading: http://download.java.net/maven/2/org/apache/james/apache-james-imap-api/0.2-M2-SNAPSHOT/maven-metadata.xml
Downloading: http://repository.apache.org/snapshots/org/apache/james/apache-james-imap-api/0.2-M2-SNAPSHOT/maven-metadata.xml
Downloaded: http://repository.apache.org/snapshots/org/apache/james/apache-james-imap-api/0.2-M2-SNAPSHOT/maven-metadata.xml (1007 B at 10.7 KB/sec)
Downloading: http://download.java.net/maven/2/org/apache/james/apache-james-imap-message/0.2-M2-SNAPSHOT/maven-metadata.xml
Downloading: http://repository.apache.org/snapshots/org/apache/james/apache-james-imap-message/0.2-M2-SNAPSHOT/maven-metadata.xml
Downloaded: http://repository.apache.org/snapshots/org/apache/james/apache-james-imap-message/0.2-M2-SNAPSHOT/maven-metadata.xml (1011 B at 11.3 KB/sec)
Downloading: http://download.java.net/maven/2/org/apache/james/apache-james-imap-processor/0.2-M2-SNAPSHOT/maven-metadata.xml
Downloading: http://repository.apache.org/snapshots/org/apache/james/apache-james-imap-processor/0.2-M2-SNAPSHOT/maven-metadata.xml
Downloaded: http://repository.apache.org/snapshots/org/apache/james/apache-james-imap-processor/0.2-M2-SNAPSHOT/maven-metadata.xml (1013 B at 10.9 KB/sec)
[INFO] [INFO] Using 'UTF-8' encoding to copy filtered resources.
[INFO] Copying 0 resource
[INFO] Copying 3 resources
[INFO] --- maven-resources-plugin:2.4.3:resources (default-resources) @ james-server-imapserver ---
[INFO]
[INFO] --- maven-compiler-plugin:2.3.2:compile (default-compile) @ james-server-imapserver ---
[INFO] Compiling 16 source files to <https://hudson.apache.org/hudson/job/james-server-trunk/ws/trunk/imapserver/target/classes>
[INFO] -------------------------------------------------------------
[ERROR] COMPILATION ERROR :
[INFO] -------------------------------------------------------------
[ERROR] <https://hudson.apache.org/hudson/job/james-server-trunk/ws/trunk/imapserver/src/main/java/org/apache/james/imapserver/netty/ChannelImapResponseWriter.java>:[54,18] cannot find symbol
symbol : constructor IOException(java.lang.Throwable)
location: class java.io.IOException
[ERROR] <https://hudson.apache.org/hudson/job/james-server-trunk/ws/trunk/imapserver/src/main/java/org/apache/james/imapserver/netty/ChannelWritableByteChannel.java>:[62,18] cannot find symbol
symbol : constructor IOException(java.lang.Throwable)
location: class java.io.IOException
[INFO] 2 errors
[INFO] -------------------------------------------------------------
mojoFailed org.apache.maven.plugins:maven-compiler-plugin:2.3.2(default-compile)
projectFailed org.apache.james:james-server-imapserver:3.0-M3-SNAPSHOT
[JENKINS] Archiving <https://hudson.apache.org/hudson/job/james-server-trunk/ws/trunk/imapserver/pom.xml> to /home/hudson/hudson/jobs/james-server-trunk/modules/org.apache.james$james-server-imapserver/builds/2011-03-25_06-52-48/archive/org.apache.james/james-server-imapserver/3.0-M3-SNAPSHOT/pom.xml
sessionEnded
[INFO] ------------------------------------------------------------------------
[INFO] Reactor Summary:
[INFO]
[INFO] Apache James Server ............................... SUCCESS [12.109s]
[INFO] Apache James Server Data API ...................... SUCCESS [6.697s]
[INFO] Apache James Server Client ........................ SUCCESS [4.358s]
[INFO] Apache James Server Lifecycle API ................. SUCCESS [4.500s]
[INFO] Apache James Server Filesystem API ................ SUCCESS [4.403s]
[INFO] Apache James Server Core .......................... SUCCESS [19.704s]
[INFO] Apache James Server Queue API ..................... SUCCESS [5.925s]
[INFO] Apache James Server Mailetcontainer library ....... SUCCESS [5.526s]
[INFO] Apache James Server DNS Server API ................ SUCCESS [5.956s]
[INFO] Apache James Server DNSService Library ............ SUCCESS [5.055s]
[INFO] Apache James Server Mailetcontainer Camel implementation SUCCESS [8.421s]
[INFO] Apache James Server Mailbox Adapter ............... SUCCESS [5.437s]
[INFO] Apache James Server DNSService Implementation ..... SUCCESS [5.646s]
[INFO] Apache James Server Common Utilities .............. SUCCESS [4.983s]
[INFO] Apache James Server Protocols Library ............. SUCCESS [6.172s]
[INFO] Apache James Server Data Library .................. SUCCESS [5.712s]
[INFO] Apache James Server LDAP Data Implementation ...... SUCCESS [3.915s]
[INFO] Apache James Server SMTP .......................... SUCCESS [9.626s]
[INFO] Apache James Server IMAP .......................... FAILURE [2.663s]
[INFO] Apache James Server LMTP .......................... SKIPPED
[INFO] Apache James Server POP3 .......................... SKIPPED
[INFO] Apache James Server FetchMail ..................... SKIPPED
[INFO] Apache James Server JMS Mail Queue ................ SKIPPED
[INFO] Apache James Server ActiveMQ Queue ................ SKIPPED
[INFO] Apache James Server Mailets ....................... SKIPPED
[INFO] Apache James Server File Data Persistence ......... SKIPPED
[INFO] Apache James Server JPA Data Persistence .......... SKIPPED
[INFO] Apache James Server JDBC Data Persistence ......... SKIPPED
[INFO] Apache James Server JCR Data Persistence .......... SKIPPED
[INFO] Apache James Server Container Spring .............. SKIPPED
[INFO] Apache James Server OSGI Bindings ................. SKIPPED
[INFO] ------------------------------------------------------------------------
[INFO] BUILD FAILURE
[INFO] ------------------------------------------------------------------------
[INFO] Total time: 2:36.736s
[INFO] Finished at: Thu Mar 24 22:55:35 GMT-08:00 2011
[INFO] Final Memory: 44M/187M
[INFO] ------------------------------------------------------------------------
maven builder waiting
mavenExecutionResult exceptions not empty
org.apache.maven.lifecycle.LifecycleExecutionException: Failed to execute goal org.apache.maven.plugins:maven-compiler-plugin:2.3.2:compile (default-compile) on project james-server-imapserver: Compilation failure
at org.apache.maven.lifecycle.internal.MojoExecutor.execute(MojoExecutor.java:213)
at org.apache.maven.lifecycle.internal.MojoExecutor.execute(MojoExecutor.java:153)
at org.apache.maven.lifecycle.internal.MojoExecutor.execute(MojoExecutor.java:145)
at org.apache.maven.lifecycle.internal.LifecycleModuleBuilder.buildProject(LifecycleModuleBuilder.java:84)
at org.apache.maven.lifecycle.internal.LifecycleModuleBuilder.buildProject(LifecycleModuleBuilder.java:59)
at org.apache.maven.lifecycle.internal.LifecycleStarter.singleThreadedBuild(LifecycleStarter.java:183)
at org.apache.maven.lifecycle.internal.LifecycleStarter.execute(LifecycleStarter.java:161)
at org.apache.maven.DefaultMaven.doExecute(DefaultMaven.java:319)
at org.apache.maven.DefaultMaven.execute(DefaultMaven.java:156)
at org.jvnet.hudson.maven3.launcher.Maven3Launcher.main(Maven3Launcher.java:79)
at sun.reflect.NativeMethodAccessorImpl.invoke0(Native Method)
at sun.reflect.NativeMethodAccessorImpl.invoke(NativeMethodAccessorImpl.java:39)
at sun.reflect.DelegatingMethodAccessorImpl.invoke(DelegatingMethodAccessorImpl.java:25)
at java.lang.reflect.Method.invoke(Method.java:592)
at org.codehaus.plexus.classworlds.launcher.Launcher.launchStandard(Launcher.java:329)
at org.codehaus.plexus.classworlds.launcher.Launcher.launch(Launcher.java:239)
at org.jvnet.hudson.maven3.agent.Maven3Main.launch(Maven3Main.java:146)
at hudson.maven.Maven3Builder.call(Maven3Builder.java:124)
at hudson.maven.Maven3Builder.call(Maven3Builder.java:71)
at hudson.remoting.UserRequest.perform(UserRequest.java:114)
at hudson.remoting.UserRequest.perform(UserRequest.java:48)
at hudson.remoting.Request$2.run(Request.java:270)
at java.util.concurrent.Executors$RunnableAdapter.call(Executors.java:417)
at java.util.concurrent.FutureTask$Sync.innerRun(FutureTask.java:269)
at java.util.concurrent.FutureTask.run(FutureTask.java:123)
at java.util.concurrent.ThreadPoolExecutor$Worker.runTask(ThreadPoolExecutor.java:651)
at java.util.concurrent.ThreadPoolExecutor$Worker.run(ThreadPoolExecutor.java:676)
at java.lang.Thread.run(Thread.java:595)
Caused by: org.apache.maven.plugin.CompilationFailureException: Compilation failure
at org.apache.maven.plugin.AbstractCompilerMojo.execute(AbstractCompilerMojo.java:656)
at org.apache.maven.plugin.CompilerMojo.execute(CompilerMojo.java:128)
at org.apache.maven.plugin.DefaultBuildPluginManager.executeMojo(DefaultBuildPluginManager.java:101)
at org.apache.maven.lifecycle.internal.MojoExecutor.execute(MojoExecutor.java:209)
... 27 more
Sending e-mails to: server-dev@james.apache.org
channel stopped
---------------------------------------------------------------------
To unsubscribe, e-mail: server-dev-unsubscribe@james.apache.org
For additional commands, e-mail: server-dev-help@james.apache.org
Build failed in Jenkins: james-server-trunk #1318
Posted by Apache Hudson Server <hu...@hudson.apache.org>.
See <https://hudson.apache.org/hudson/job/james-server-trunk/1318/changes>
Changes:
[felixk] Compare the values not the references (see JAMES-1213)
[felixk] Make sure, the stream gets closed (see JAMES-1207)
------------------------------------------
[...truncated 1665 lines...]
Downloading: https://repository.apache.org/content/repositories/snapshots/org/apache/james/james-server-ldap/maven-metadata.xml
Downloaded: https://repository.apache.org/content/repositories/snapshots/org/apache/james/james-server-ldap/maven-metadata.xml (294 B at 3.3 KB/sec)
Uploading: https://repository.apache.org/content/repositories/snapshots/org/apache/james/james-server-ldap/3.0-M3-SNAPSHOT/maven-metadata.xml
Uploaded: https://repository.apache.org/content/repositories/snapshots/org/apache/james/james-server-ldap/3.0-M3-SNAPSHOT/maven-metadata.xml (1003 B at 6.1 KB/sec)
Uploading: https://repository.apache.org/content/repositories/snapshots/org/apache/james/james-server-ldap/maven-metadata.xml
Uploaded: https://repository.apache.org/content/repositories/snapshots/org/apache/james/james-server-ldap/maven-metadata.xml (294 B at 2.0 KB/sec)
Uploading: https://repository.apache.org/content/repositories/snapshots/org/apache/james/james-server-ldap/3.0-M3-SNAPSHOT/james-server-ldap-3.0-M3-20110325.055453-78-tests.jar
Uploaded: https://repository.apache.org/content/repositories/snapshots/org/apache/james/james-server-ldap/3.0-M3-SNAPSHOT/james-server-ldap-3.0-M3-20110325.055453-78-tests.jar (8 KB at 48.3 KB/sec)
Uploading: https://repository.apache.org/content/repositories/snapshots/org/apache/james/james-server-ldap/3.0-M3-SNAPSHOT/maven-metadata.xml
Uploaded: https://repository.apache.org/content/repositories/snapshots/org/apache/james/james-server-ldap/3.0-M3-SNAPSHOT/maven-metadata.xml (1003 B at 7.1 KB/sec)
projectSucceeded org.apache.james:james-server-ldap:3.0-M3-SNAPSHOT
[JENKINS] Archiving <https://hudson.apache.org/hudson/job/james-server-trunk/ws/trunk/ldap/pom.xml> to /home/hudson/hudson/jobs/james-server-trunk/modules/org.apache.james$james-server-ldap/builds/2011-03-25_05-52-27/archive/org.apache.james/james-server-ldap/3.0-M3-SNAPSHOT/pom.xml
[JENKINS] Archiving <https://hudson.apache.org/hudson/job/james-server-trunk/ws/trunk/ldap/target/james-server-ldap-3.0-M3-SNAPSHOT.jar> to /home/hudson/hudson/jobs/james-server-trunk/modules/org.apache.james$james-server-ldap/builds/2011-03-25_05-52-27/archive/org.apache.james/james-server-ldap/3.0-M3-20110325.055453-78/james-server-ldap-3.0-M3-SNAPSHOT.jar
[JENKINS] Archiving <https://hudson.apache.org/hudson/job/james-server-trunk/ws/trunk/ldap/target/james-server-ldap-3.0-M3-SNAPSHOT-tests.jar> to /home/hudson/hudson/jobs/james-server-trunk/modules/org.apache.james$james-server-ldap/builds/2011-03-25_05-52-27/archive/org.apache.james/james-server-ldap/3.0-M3-20110325.055453-78/james-server-ldap-3.0-M3-SNAPSHOT-tests.jar
[INFO] Downloading: http://repository.apache.org/snapshots/org/apache/james/protocols/protocols-smtp/1.4-SNAPSHOT/maven-metadata.xml
Downloading: http://download.java.net/maven/2/org/apache/james/protocols/protocols-smtp/1.4-SNAPSHOT/maven-metadata.xml
[INFO] ------------------------------------------------------------------------
[INFO] Building Apache James Server SMTP 3.0-M3-SNAPSHOT
[INFO] ------------------------------------------------------------------------
Downloaded: http://repository.apache.org/snapshots/org/apache/james/protocols/protocols-smtp/1.4-SNAPSHOT/maven-metadata.xml (998 B at 5.4 KB/sec)
Downloading: http://download.java.net/maven/2/org/apache/james/protocols/protocols-smtp/1.4-SNAPSHOT/maven-metadata.xml
Downloading: http://repository.apache.org/snapshots/org/apache/james/protocols/protocols-smtp/1.4-SNAPSHOT/maven-metadata.xml
Downloaded: http://repository.apache.org/snapshots/org/apache/james/protocols/protocols-smtp/1.4-SNAPSHOT/maven-metadata.xml (998 B at 12.3 KB/sec)
[INFO] Deleting <https://hudson.apache.org/hudson/job/james-server-trunk/ws/trunk/smtpserver/target>
[INFO]
[INFO] --- maven-clean-plugin:2.4.1:clean (default-clean) @ james-server-smtpserver ---
[INFO]
[INFO] --- maven-remote-resources-plugin:1.1:process (default) @ james-server-smtpserver ---
Downloading: http://download.java.net/maven/2/org/apache/james/protocols/protocols-smtp/1.4-SNAPSHOT/maven-metadata.xml
Downloading: http://repository.apache.org/snapshots/org/apache/james/protocols/protocols-smtp/1.4-SNAPSHOT/maven-metadata.xml
Downloaded: http://repository.apache.org/snapshots/org/apache/james/protocols/protocols-smtp/1.4-SNAPSHOT/maven-metadata.xml (998 B at 12.7 KB/sec)
[INFO] [INFO] Using 'UTF-8' encoding to copy filtered resources.
[INFO] Copying 0 resource
[INFO] Copying 3 resources
[INFO] --- maven-resources-plugin:2.4.3:resources (default-resources) @ james-server-smtpserver ---
[INFO]
[INFO] --- maven-compiler-plugin:2.3.2:compile (default-compile) @ james-server-smtpserver ---
[INFO] Compiling 48 source files to <https://hudson.apache.org/hudson/job/james-server-trunk/ws/trunk/smtpserver/target/classes>
[INFO]
[INFO] --- maven-bundle-plugin:2.1.0:manifest (bundle-manifest) @ james-server-smtpserver ---
[INFO] [INFO] Using 'UTF-8' encoding to copy filtered resources.
[INFO] Copying 1 resource
[INFO] Copying 3 resources
[INFO] --- maven-resources-plugin:2.4.3:testResources (default-testResources) @ james-server-smtpserver ---
[INFO]
[INFO] [INFO] Compiling 18 source files to <https://hudson.apache.org/hudson/job/james-server-trunk/ws/trunk/smtpserver/target/test-classes>
--- maven-compiler-plugin:2.3.2:testCompile (default-testCompile) @ james-server-smtpserver ---
[INFO] [INFO] Surefire report directory: <https://hudson.apache.org/hudson/job/james-server-trunk/ws/trunk/smtpserver/target/surefire-reports>
[INFO] --- maven-surefire-plugin:2.7.2:test (default-test) @ james-server-smtpserver ---
-------------------------------------------------------
T E S T S
-------------------------------------------------------
Running org.apache.james.smtpserver.SPFHandlerTest
Tests run: 8, Failures: 0, Errors: 0, Skipped: 0, Time elapsed: 0.191 sec
Running org.apache.james.smtpserver.OioSMTPServerTest
500 Line length exceeded. See RFC 2821 #4.5.3.1.
Tests run: 38, Failures: 0, Errors: 0, Skipped: 0, Time elapsed: 1.52 sec
Running org.apache.james.smtpserver.SetMimeHeaderHandlerTest
Tests run: 2, Failures: 0, Errors: 0, Skipped: 0, Time elapsed: 0.006 sec
Running org.apache.james.smtpserver.URIRBLHandlerTest
Tests run: 3, Failures: 0, Errors: 0, Skipped: 0, Time elapsed: 0.133 sec
Running org.apache.james.smtpserver.ValidRcptHandlerTest
Tests run: 5, Failures: 0, Errors: 0, Skipped: 0, Time elapsed: 0.004 sec
Running org.apache.james.smtpserver.POP3BeforeSMTPHandlerTest
Tests run: 4, Failures: 0, Errors: 0, Skipped: 0, Time elapsed: 0.103 sec
Running org.apache.james.smtpserver.ValidRcptMXTest
Tests run: 1, Failures: 0, Errors: 0, Skipped: 0, Time elapsed: 0.003 sec
Running org.apache.james.smtpserver.SpamAssassinHandlerTest
Tests run: 3, Failures: 0, Errors: 0, Skipped: 0, Time elapsed: 0.009 sec
Results :
Tests run: 64, Failures: 0, Errors: 0, Skipped: 0
[JENKINS] Recording test results
[INFO]
[INFO] --- maven-jar-plugin:2.3.1:jar (default-jar) @ james-server-smtpserver ---
[INFO] Building jar: <https://hudson.apache.org/hudson/job/james-server-trunk/ws/trunk/smtpserver/target/james-server-smtpserver-3.0-M3-SNAPSHOT.jar>
[INFO]
[INFO] --- maven-jar-plugin:2.3.1:test-jar (default) @ james-server-smtpserver ---
[INFO] Building jar: <https://hudson.apache.org/hudson/job/james-server-trunk/ws/trunk/smtpserver/target/james-server-smtpserver-3.0-M3-SNAPSHOT-tests.jar>
[INFO]
[INFO] --- maven-site-plugin:3.0-beta-3:attach-descriptor (attach-descriptor) @ james-server-smtpserver ---
[INFO] [INFO] Installing <https://hudson.apache.org/hudson/job/james-server-trunk/ws/trunk/smtpserver/target/james-server-smtpserver-3.0-M3-SNAPSHOT.jar> to /home/hudson/.m2/repository/org/apache/james/james-server-smtpserver/3.0-M3-SNAPSHOT/james-server-smtpserver-3.0-M3-SNAPSHOT.jar
[INFO] Installing <https://hudson.apache.org/hudson/job/james-server-trunk/ws/trunk/smtpserver/pom.xml> to /home/hudson/.m2/repository/org/apache/james/james-server-smtpserver/3.0-M3-SNAPSHOT/james-server-smtpserver-3.0-M3-SNAPSHOT.pom
[INFO] Installing <https://hudson.apache.org/hudson/job/james-server-trunk/ws/trunk/smtpserver/target/james-server-smtpserver-3.0-M3-SNAPSHOT-tests.jar> to /home/hudson/.m2/repository/org/apache/james/james-server-smtpserver/3.0-M3-SNAPSHOT/james-server-smtpserver-3.0-M3-SNAPSHOT-tests.jar
[INFO] --- maven-install-plugin:2.3.1:install (default-install) @ james-server-smtpserver ---
[INFO] Downloading: https://repository.apache.org/content/repositories/snapshots/org/apache/james/james-server-smtpserver/3.0-M3-SNAPSHOT/maven-metadata.xml
[INFO] --- maven-deploy-plugin:2.4:deploy (default-deploy) @ james-server-smtpserver ---
Downloaded: https://repository.apache.org/content/repositories/snapshots/org/apache/james/james-server-smtpserver/3.0-M3-SNAPSHOT/maven-metadata.xml (1009 B at 9.0 KB/sec)
Uploading: https://repository.apache.org/content/repositories/snapshots/org/apache/james/james-server-smtpserver/3.0-M3-SNAPSHOT/james-server-smtpserver-3.0-M3-20110325.055503-78.jar
Uploaded: https://repository.apache.org/content/repositories/snapshots/org/apache/james/james-server-smtpserver/3.0-M3-SNAPSHOT/james-server-smtpserver-3.0-M3-20110325.055503-78.jar (94 KB at 179.9 KB/sec)
Uploading: https://repository.apache.org/content/repositories/snapshots/org/apache/james/james-server-smtpserver/3.0-M3-SNAPSHOT/james-server-smtpserver-3.0-M3-20110325.055503-78.pom
Uploaded: https://repository.apache.org/content/repositories/snapshots/org/apache/james/james-server-smtpserver/3.0-M3-SNAPSHOT/james-server-smtpserver-3.0-M3-20110325.055503-78.pom (7 KB at 39.7 KB/sec)
Downloading: https://repository.apache.org/content/repositories/snapshots/org/apache/james/james-server-smtpserver/maven-metadata.xml
Downloaded: https://repository.apache.org/content/repositories/snapshots/org/apache/james/james-server-smtpserver/maven-metadata.xml (300 B at 0.9 KB/sec)
Uploading: https://repository.apache.org/content/repositories/snapshots/org/apache/james/james-server-smtpserver/3.0-M3-SNAPSHOT/maven-metadata.xml
Uploaded: https://repository.apache.org/content/repositories/snapshots/org/apache/james/james-server-smtpserver/3.0-M3-SNAPSHOT/maven-metadata.xml (1009 B at 6.7 KB/sec)
Uploading: https://repository.apache.org/content/repositories/snapshots/org/apache/james/james-server-smtpserver/maven-metadata.xml
Uploaded: https://repository.apache.org/content/repositories/snapshots/org/apache/james/james-server-smtpserver/maven-metadata.xml (300 B at 1.8 KB/sec)
Uploading: https://repository.apache.org/content/repositories/snapshots/org/apache/james/james-server-smtpserver/3.0-M3-SNAPSHOT/james-server-smtpserver-3.0-M3-20110325.055503-78-tests.jar
Uploaded: https://repository.apache.org/content/repositories/snapshots/org/apache/james/james-server-smtpserver/3.0-M3-SNAPSHOT/james-server-smtpserver-3.0-M3-20110325.055503-78-tests.jar (66 KB at 244.5 KB/sec)
Uploading: https://repository.apache.org/content/repositories/snapshots/org/apache/james/james-server-smtpserver/3.0-M3-SNAPSHOT/maven-metadata.xml
Uploaded: https://repository.apache.org/content/repositories/snapshots/org/apache/james/james-server-smtpserver/3.0-M3-SNAPSHOT/maven-metadata.xml (1009 B at 7.1 KB/sec)
projectSucceeded org.apache.james:james-server-smtpserver:3.0-M3-SNAPSHOT
[JENKINS] Archiving <https://hudson.apache.org/hudson/job/james-server-trunk/ws/trunk/smtpserver/pom.xml> to /home/hudson/hudson/jobs/james-server-trunk/modules/org.apache.james$james-server-smtpserver/builds/2011-03-25_05-52-27/archive/org.apache.james/james-server-smtpserver/3.0-M3-SNAPSHOT/pom.xml
[JENKINS] Archiving <https://hudson.apache.org/hudson/job/james-server-trunk/ws/trunk/smtpserver/target/james-server-smtpserver-3.0-M3-SNAPSHOT.jar> to /home/hudson/hudson/jobs/james-server-trunk/modules/org.apache.james$james-server-smtpserver/builds/2011-03-25_05-52-27/archive/org.apache.james/james-server-smtpserver/3.0-M3-20110325.055503-78/james-server-smtpserver-3.0-M3-SNAPSHOT.jar
[JENKINS] Archiving <https://hudson.apache.org/hudson/job/james-server-trunk/ws/trunk/smtpserver/target/james-server-smtpserver-3.0-M3-SNAPSHOT-tests.jar> to /home/hudson/hudson/jobs/james-server-trunk/modules/org.apache.james$james-server-smtpserver/builds/2011-03-25_05-52-27/archive/org.apache.james/james-server-smtpserver/3.0-M3-20110325.055503-78/james-server-smtpserver-3.0-M3-SNAPSHOT-tests.jar
[INFO] Downloading: http://download.java.net/maven/2/org/apache/james/apache-james-imap-api/0.2-M2-SNAPSHOT/maven-metadata.xml
Downloading: http://repository.apache.org/snapshots/org/apache/james/apache-james-imap-api/0.2-M2-SNAPSHOT/maven-metadata.xml
[INFO] ------------------------------------------------------------------------
[INFO] Building Apache James Server IMAP 3.0-M3-SNAPSHOT
[INFO] ------------------------------------------------------------------------
Downloaded: http://repository.apache.org/snapshots/org/apache/james/apache-james-imap-api/0.2-M2-SNAPSHOT/maven-metadata.xml (1007 B at 5.7 KB/sec)
Downloading: http://download.java.net/maven/2/org/apache/james/apache-james-imap/0.2-M2-SNAPSHOT/maven-metadata.xml
Downloading: http://repository.apache.org/snapshots/org/apache/james/apache-james-imap/0.2-M2-SNAPSHOT/maven-metadata.xml
Downloaded: http://repository.apache.org/snapshots/org/apache/james/apache-james-imap/0.2-M2-SNAPSHOT/maven-metadata.xml (2 KB at 8.0 KB/sec)
Downloading: http://download.java.net/maven/2/org/apache/james/apache-james-imap-message/0.2-M2-SNAPSHOT/maven-metadata.xml
Downloading: http://repository.apache.org/snapshots/org/apache/james/apache-james-imap-message/0.2-M2-SNAPSHOT/maven-metadata.xml
Downloaded: http://repository.apache.org/snapshots/org/apache/james/apache-james-imap-message/0.2-M2-SNAPSHOT/maven-metadata.xml (1011 B at 8.3 KB/sec)
Downloading: http://download.java.net/maven/2/org/apache/james/apache-james-imap-processor/0.2-M2-SNAPSHOT/maven-metadata.xml
Downloading: http://repository.apache.org/snapshots/org/apache/james/apache-james-imap-processor/0.2-M2-SNAPSHOT/maven-metadata.xml
Downloaded: http://repository.apache.org/snapshots/org/apache/james/apache-james-imap-processor/0.2-M2-SNAPSHOT/maven-metadata.xml (1013 B at 6.7 KB/sec)
[INFO] [INFO] Deleting <https://hudson.apache.org/hudson/job/james-server-trunk/ws/trunk/imapserver/target>
[INFO] --- maven-clean-plugin:2.4.1:clean (default-clean) @ james-server-imapserver ---
[INFO]
[INFO] --- maven-remote-resources-plugin:1.1:process (default) @ james-server-imapserver ---
Downloading: http://download.java.net/maven/2/org/apache/james/apache-james-imap-api/0.2-M2-SNAPSHOT/maven-metadata.xml
Downloading: http://repository.apache.org/snapshots/org/apache/james/apache-james-imap-api/0.2-M2-SNAPSHOT/maven-metadata.xml
Downloaded: http://repository.apache.org/snapshots/org/apache/james/apache-james-imap-api/0.2-M2-SNAPSHOT/maven-metadata.xml (1007 B at 12.3 KB/sec)
Downloading: http://repository.apache.org/snapshots/org/apache/james/apache-james-imap-message/0.2-M2-SNAPSHOT/maven-metadata.xml
Downloading: http://download.java.net/maven/2/org/apache/james/apache-james-imap-message/0.2-M2-SNAPSHOT/maven-metadata.xml
Downloaded: http://repository.apache.org/snapshots/org/apache/james/apache-james-imap-message/0.2-M2-SNAPSHOT/maven-metadata.xml (1011 B at 12.3 KB/sec)
Downloading: http://download.java.net/maven/2/org/apache/james/apache-james-imap-processor/0.2-M2-SNAPSHOT/maven-metadata.xml
Downloading: http://repository.apache.org/snapshots/org/apache/james/apache-james-imap-processor/0.2-M2-SNAPSHOT/maven-metadata.xml
Downloaded: http://repository.apache.org/snapshots/org/apache/james/apache-james-imap-processor/0.2-M2-SNAPSHOT/maven-metadata.xml (1013 B at 12.2 KB/sec)
[INFO] [INFO] Using 'UTF-8' encoding to copy filtered resources.
[INFO] Copying 0 resource
[INFO] Copying 3 resources
[INFO] --- maven-resources-plugin:2.4.3:resources (default-resources) @ james-server-imapserver ---
[INFO] [INFO] Compiling 16 source files to <https://hudson.apache.org/hudson/job/james-server-trunk/ws/trunk/imapserver/target/classes>
[INFO] --- maven-compiler-plugin:2.3.2:compile (default-compile) @ james-server-imapserver ---
[INFO] -------------------------------------------------------------
[ERROR] COMPILATION ERROR :
[INFO] -------------------------------------------------------------
[ERROR] <https://hudson.apache.org/hudson/job/james-server-trunk/ws/trunk/imapserver/src/main/java/org/apache/james/imapserver/netty/ChannelImapResponseWriter.java>:[54,18] cannot find symbol
symbol : constructor IOException(java.lang.Throwable)
location: class java.io.IOException
[ERROR] <https://hudson.apache.org/hudson/job/james-server-trunk/ws/trunk/imapserver/src/main/java/org/apache/james/imapserver/netty/ChannelWritableByteChannel.java>:[62,18] cannot find symbol
symbol : constructor IOException(java.lang.Throwable)
location: class java.io.IOException
[INFO] 2 errors
[INFO] -------------------------------------------------------------
mojoFailed org.apache.maven.plugins:maven-compiler-plugin:2.3.2(default-compile)
projectFailed org.apache.james:james-server-imapserver:3.0-M3-SNAPSHOT
[JENKINS] Archiving <https://hudson.apache.org/hudson/job/james-server-trunk/ws/trunk/imapserver/pom.xml> to /home/hudson/hudson/jobs/james-server-trunk/modules/org.apache.james$james-server-imapserver/builds/2011-03-25_05-52-27/archive/org.apache.james/james-server-imapserver/3.0-M3-SNAPSHOT/pom.xml
sessionEnded
[INFO] ------------------------------------------------------------------------
[INFO] Reactor Summary:
[INFO]
[INFO] Apache James Server ............................... SUCCESS [10.748s]
[INFO] Apache James Server Data API ...................... SUCCESS [6.300s]
[INFO] Apache James Server Client ........................ SUCCESS [4.348s]
[INFO] Apache James Server Lifecycle API ................. SUCCESS [4.190s]
[INFO] Apache James Server Filesystem API ................ SUCCESS [4.613s]
[INFO] Apache James Server Core .......................... SUCCESS [21.271s]
[INFO] Apache James Server Queue API ..................... SUCCESS [5.353s]
[INFO] Apache James Server Mailetcontainer library ....... SUCCESS [5.852s]
[INFO] Apache James Server DNS Server API ................ SUCCESS [4.915s]
[INFO] Apache James Server DNSService Library ............ SUCCESS [4.660s]
[INFO] Apache James Server Mailetcontainer Camel implementation SUCCESS [7.849s]
[INFO] Apache James Server Mailbox Adapter ............... SUCCESS [5.474s]
[INFO] Apache James Server DNSService Implementation ..... SUCCESS [5.983s]
[INFO] Apache James Server Common Utilities .............. SUCCESS [4.857s]
[INFO] Apache James Server Protocols Library ............. SUCCESS [6.373s]
[INFO] Apache James Server Data Library .................. SUCCESS [5.570s]
[INFO] Apache James Server LDAP Data Implementation ...... SUCCESS [4.344s]
[INFO] Apache James Server SMTP .......................... SUCCESS [9.592s]
[INFO] Apache James Server IMAP .......................... FAILURE [2.582s]
[INFO] Apache James Server LMTP .......................... SKIPPED
[INFO] Apache James Server POP3 .......................... SKIPPED
[INFO] Apache James Server FetchMail ..................... SKIPPED
[INFO] Apache James Server JMS Mail Queue ................ SKIPPED
[INFO] Apache James Server ActiveMQ Queue ................ SKIPPED
[INFO] Apache James Server Mailets ....................... SKIPPED
[INFO] Apache James Server File Data Persistence ......... SKIPPED
[INFO] Apache James Server JPA Data Persistence .......... SKIPPED
[INFO] Apache James Server JDBC Data Persistence ......... SKIPPED
[INFO] Apache James Server JCR Data Persistence .......... SKIPPED
[INFO] Apache James Server Container Spring .............. SKIPPED
[INFO] Apache James Server OSGI Bindings ................. SKIPPED
[INFO] ------------------------------------------------------------------------
[INFO] BUILD FAILURE
[INFO] ------------------------------------------------------------------------
[INFO] Total time: 2:35.182s
[INFO] Finished at: Thu Mar 24 21:55:11 GMT-08:00 2011
[INFO] Final Memory: 44M/186M
[INFO] ------------------------------------------------------------------------
maven builder waiting
mavenExecutionResult exceptions not empty
org.apache.maven.lifecycle.LifecycleExecutionException: Failed to execute goal org.apache.maven.plugins:maven-compiler-plugin:2.3.2:compile (default-compile) on project james-server-imapserver: Compilation failure
at org.apache.maven.lifecycle.internal.MojoExecutor.execute(MojoExecutor.java:213)
at org.apache.maven.lifecycle.internal.MojoExecutor.execute(MojoExecutor.java:153)
at org.apache.maven.lifecycle.internal.MojoExecutor.execute(MojoExecutor.java:145)
at org.apache.maven.lifecycle.internal.LifecycleModuleBuilder.buildProject(LifecycleModuleBuilder.java:84)
at org.apache.maven.lifecycle.internal.LifecycleModuleBuilder.buildProject(LifecycleModuleBuilder.java:59)
at org.apache.maven.lifecycle.internal.LifecycleStarter.singleThreadedBuild(LifecycleStarter.java:183)
at org.apache.maven.lifecycle.internal.LifecycleStarter.execute(LifecycleStarter.java:161)
at org.apache.maven.DefaultMaven.doExecute(DefaultMaven.java:319)
at org.apache.maven.DefaultMaven.execute(DefaultMaven.java:156)
at org.jvnet.hudson.maven3.launcher.Maven3Launcher.main(Maven3Launcher.java:79)
at sun.reflect.NativeMethodAccessorImpl.invoke0(Native Method)
at sun.reflect.NativeMethodAccessorImpl.invoke(NativeMethodAccessorImpl.java:39)
at sun.reflect.DelegatingMethodAccessorImpl.invoke(DelegatingMethodAccessorImpl.java:25)
at java.lang.reflect.Method.invoke(Method.java:592)
at org.codehaus.plexus.classworlds.launcher.Launcher.launchStandard(Launcher.java:329)
at org.codehaus.plexus.classworlds.launcher.Launcher.launch(Launcher.java:239)
at org.jvnet.hudson.maven3.agent.Maven3Main.launch(Maven3Main.java:146)
at hudson.maven.Maven3Builder.call(Maven3Builder.java:124)
at hudson.maven.Maven3Builder.call(Maven3Builder.java:71)
at hudson.remoting.UserRequest.perform(UserRequest.java:114)
at hudson.remoting.UserRequest.perform(UserRequest.java:48)
at hudson.remoting.Request$2.run(Request.java:270)
at java.util.concurrent.Executors$RunnableAdapter.call(Executors.java:417)
at java.util.concurrent.FutureTask$Sync.innerRun(FutureTask.java:269)
at java.util.concurrent.FutureTask.run(FutureTask.java:123)
at java.util.concurrent.ThreadPoolExecutor$Worker.runTask(ThreadPoolExecutor.java:651)
at java.util.concurrent.ThreadPoolExecutor$Worker.run(ThreadPoolExecutor.java:676)
at java.lang.Thread.run(Thread.java:595)
Caused by: org.apache.maven.plugin.CompilationFailureException: Compilation failure
at org.apache.maven.plugin.AbstractCompilerMojo.execute(AbstractCompilerMojo.java:656)
at org.apache.maven.plugin.CompilerMojo.execute(CompilerMojo.java:128)
at org.apache.maven.plugin.DefaultBuildPluginManager.executeMojo(DefaultBuildPluginManager.java:101)
at org.apache.maven.lifecycle.internal.MojoExecutor.execute(MojoExecutor.java:209)
... 27 more
Sending e-mails to: server-dev@james.apache.org
channel stopped
---------------------------------------------------------------------
To unsubscribe, e-mail: server-dev-unsubscribe@james.apache.org
For additional commands, e-mail: server-dev-help@james.apache.org
Build failed in Jenkins: james-server-trunk #1317
Posted by Apache Hudson Server <hu...@hudson.apache.org>.
See <https://hudson.apache.org/hudson/job/james-server-trunk/1317/>
------------------------------------------
[...truncated 1698 lines...]
[INFO] ------------------------------------------------------------------------
[INFO] Building Apache James Server SMTP 3.0-M3-SNAPSHOT
[INFO] ------------------------------------------------------------------------
Downloaded: http://repository.apache.org/snapshots/org/apache/james/protocols/protocols-smtp/1.4-SNAPSHOT/maven-metadata.xml (998 B at 8.9 KB/sec)
Downloading: http://download.java.net/maven/2/org/apache/james/protocols/protocols-smtp/1.4-SNAPSHOT/maven-metadata.xml
Downloading: http://repository.apache.org/snapshots/org/apache/james/protocols/protocols-smtp/1.4-SNAPSHOT/maven-metadata.xml
Downloaded: http://repository.apache.org/snapshots/org/apache/james/protocols/protocols-smtp/1.4-SNAPSHOT/maven-metadata.xml (998 B at 12.3 KB/sec)
[INFO] [INFO] Deleting <https://hudson.apache.org/hudson/job/james-server-trunk/ws/trunk/smtpserver/target>
[INFO] --- maven-clean-plugin:2.4.1:clean (default-clean) @ james-server-smtpserver ---
[INFO]
[INFO] --- maven-remote-resources-plugin:1.1:process (default) @ james-server-smtpserver ---
Downloading: http://download.java.net/maven/2/org/apache/james/protocols/protocols-smtp/1.4-SNAPSHOT/maven-metadata.xml
Downloading: http://repository.apache.org/snapshots/org/apache/james/protocols/protocols-smtp/1.4-SNAPSHOT/maven-metadata.xml
Downloaded: http://repository.apache.org/snapshots/org/apache/james/protocols/protocols-smtp/1.4-SNAPSHOT/maven-metadata.xml (998 B at 12.3 KB/sec)
[INFO] [INFO] Using 'UTF-8' encoding to copy filtered resources.
[INFO] Copying 0 resource
[INFO] Copying 3 resources
[INFO] --- maven-resources-plugin:2.4.3:resources (default-resources) @ james-server-smtpserver ---
[INFO] [INFO] Compiling 48 source files to <https://hudson.apache.org/hudson/job/james-server-trunk/ws/trunk/smtpserver/target/classes>
[INFO] --- maven-compiler-plugin:2.3.2:compile (default-compile) @ james-server-smtpserver ---
[INFO]
[INFO] --- maven-bundle-plugin:2.1.0:manifest (bundle-manifest) @ james-server-smtpserver ---
[INFO] [INFO] Using 'UTF-8' encoding to copy filtered resources.
[INFO] Copying 1 resource
[INFO] Copying 3 resources
[INFO] --- maven-resources-plugin:2.4.3:testResources (default-testResources) @ james-server-smtpserver ---
[INFO] [INFO] Compiling 18 source files to <https://hudson.apache.org/hudson/job/james-server-trunk/ws/trunk/smtpserver/target/test-classes>
[INFO] --- maven-compiler-plugin:2.3.2:testCompile (default-testCompile) @ james-server-smtpserver ---
[INFO] Surefire report directory: <https://hudson.apache.org/hudson/job/james-server-trunk/ws/trunk/smtpserver/target/surefire-reports>
[INFO]
[INFO] --- maven-surefire-plugin:2.7.2:test (default-test) @ james-server-smtpserver ---
-------------------------------------------------------
T E S T S
-------------------------------------------------------
Running org.apache.james.smtpserver.SPFHandlerTest
Tests run: 8, Failures: 0, Errors: 0, Skipped: 0, Time elapsed: 0.176 sec
Running org.apache.james.smtpserver.OioSMTPServerTest
500 Line length exceeded. See RFC 2821 #4.5.3.1.
Tests run: 38, Failures: 0, Errors: 0, Skipped: 0, Time elapsed: 1.602 sec
Running org.apache.james.smtpserver.SetMimeHeaderHandlerTest
Tests run: 2, Failures: 0, Errors: 0, Skipped: 0, Time elapsed: 0.007 sec
Running org.apache.james.smtpserver.URIRBLHandlerTest
Tests run: 3, Failures: 0, Errors: 0, Skipped: 0, Time elapsed: 0.108 sec
Running org.apache.james.smtpserver.ValidRcptHandlerTest
Tests run: 5, Failures: 0, Errors: 0, Skipped: 0, Time elapsed: 0.004 sec
Running org.apache.james.smtpserver.POP3BeforeSMTPHandlerTest
Tests run: 4, Failures: 0, Errors: 0, Skipped: 0, Time elapsed: 0.103 sec
Running org.apache.james.smtpserver.ValidRcptMXTest
Tests run: 1, Failures: 0, Errors: 0, Skipped: 0, Time elapsed: 0.002 sec
Running org.apache.james.smtpserver.SpamAssassinHandlerTest
Tests run: 3, Failures: 0, Errors: 0, Skipped: 0, Time elapsed: 0.009 sec
Results :
Tests run: 64, Failures: 0, Errors: 0, Skipped: 0
[JENKINS] Recording test results
[INFO]
[INFO] --- maven-jar-plugin:2.3.1:jar (default-jar) @ james-server-smtpserver ---
[INFO] Building jar: <https://hudson.apache.org/hudson/job/james-server-trunk/ws/trunk/smtpserver/target/james-server-smtpserver-3.0-M3-SNAPSHOT.jar>
[INFO]
[INFO] --- maven-jar-plugin:2.3.1:test-jar (default) @ james-server-smtpserver ---
[INFO] Building jar: <https://hudson.apache.org/hudson/job/james-server-trunk/ws/trunk/smtpserver/target/james-server-smtpserver-3.0-M3-SNAPSHOT-tests.jar>
[INFO]
[INFO] --- maven-site-plugin:3.0-beta-3:attach-descriptor (attach-descriptor) @ james-server-smtpserver ---
[INFO] [INFO] Installing <https://hudson.apache.org/hudson/job/james-server-trunk/ws/trunk/smtpserver/target/james-server-smtpserver-3.0-M3-SNAPSHOT.jar> to /home/hudson/.m2/repository/org/apache/james/james-server-smtpserver/3.0-M3-SNAPSHOT/james-server-smtpserver-3.0-M3-SNAPSHOT.jar
[INFO] Installing <https://hudson.apache.org/hudson/job/james-server-trunk/ws/trunk/smtpserver/pom.xml> to /home/hudson/.m2/repository/org/apache/james/james-server-smtpserver/3.0-M3-SNAPSHOT/james-server-smtpserver-3.0-M3-SNAPSHOT.pom
[INFO] Installing <https://hudson.apache.org/hudson/job/james-server-trunk/ws/trunk/smtpserver/target/james-server-smtpserver-3.0-M3-SNAPSHOT-tests.jar> to /home/hudson/.m2/repository/org/apache/james/james-server-smtpserver/3.0-M3-SNAPSHOT/james-server-smtpserver-3.0-M3-SNAPSHOT-tests.jar
[INFO] --- maven-install-plugin:2.3.1:install (default-install) @ james-server-smtpserver ---
[INFO] Downloading: https://repository.apache.org/content/repositories/snapshots/org/apache/james/james-server-smtpserver/3.0-M3-SNAPSHOT/maven-metadata.xml
[INFO] --- maven-deploy-plugin:2.4:deploy (default-deploy) @ james-server-smtpserver ---
Downloaded: https://repository.apache.org/content/repositories/snapshots/org/apache/james/james-server-smtpserver/3.0-M3-SNAPSHOT/maven-metadata.xml (1009 B at 5.5 KB/sec)
Uploading: https://repository.apache.org/content/repositories/snapshots/org/apache/james/james-server-smtpserver/3.0-M3-SNAPSHOT/james-server-smtpserver-3.0-M3-20110325.042413-77.jar
Uploaded: https://repository.apache.org/content/repositories/snapshots/org/apache/james/james-server-smtpserver/3.0-M3-SNAPSHOT/james-server-smtpserver-3.0-M3-20110325.042413-77.jar (94 KB at 280.9 KB/sec)
Uploading: https://repository.apache.org/content/repositories/snapshots/org/apache/james/james-server-smtpserver/3.0-M3-SNAPSHOT/james-server-smtpserver-3.0-M3-20110325.042413-77.pom
Uploaded: https://repository.apache.org/content/repositories/snapshots/org/apache/james/james-server-smtpserver/3.0-M3-SNAPSHOT/james-server-smtpserver-3.0-M3-20110325.042413-77.pom (7 KB at 33.3 KB/sec)
Downloading: https://repository.apache.org/content/repositories/snapshots/org/apache/james/james-server-smtpserver/maven-metadata.xml
Downloaded: https://repository.apache.org/content/repositories/snapshots/org/apache/james/james-server-smtpserver/maven-metadata.xml (300 B at 3.2 KB/sec)
Uploading: https://repository.apache.org/content/repositories/snapshots/org/apache/james/james-server-smtpserver/3.0-M3-SNAPSHOT/maven-metadata.xml
Uploaded: https://repository.apache.org/content/repositories/snapshots/org/apache/james/james-server-smtpserver/3.0-M3-SNAPSHOT/maven-metadata.xml (1009 B at 7.1 KB/sec)
Uploading: https://repository.apache.org/content/repositories/snapshots/org/apache/james/james-server-smtpserver/maven-metadata.xml
Uploaded: https://repository.apache.org/content/repositories/snapshots/org/apache/james/james-server-smtpserver/maven-metadata.xml (300 B at 2.1 KB/sec)
Uploading: https://repository.apache.org/content/repositories/snapshots/org/apache/james/james-server-smtpserver/3.0-M3-SNAPSHOT/james-server-smtpserver-3.0-M3-20110325.042413-77-tests.jar
Uploaded: https://repository.apache.org/content/repositories/snapshots/org/apache/james/james-server-smtpserver/3.0-M3-SNAPSHOT/james-server-smtpserver-3.0-M3-20110325.042413-77-tests.jar (66 KB at 247.3 KB/sec)
Uploading: https://repository.apache.org/content/repositories/snapshots/org/apache/james/james-server-smtpserver/3.0-M3-SNAPSHOT/maven-metadata.xml
Uploaded: https://repository.apache.org/content/repositories/snapshots/org/apache/james/james-server-smtpserver/3.0-M3-SNAPSHOT/maven-metadata.xml (1009 B at 6.9 KB/sec)
projectSucceeded org.apache.james:james-server-smtpserver:3.0-M3-SNAPSHOT
[JENKINS] Archiving <https://hudson.apache.org/hudson/job/james-server-trunk/ws/trunk/smtpserver/pom.xml> to /home/hudson/hudson/jobs/james-server-trunk/modules/org.apache.james$james-server-smtpserver/builds/2011-03-25_04-21-44/archive/org.apache.james/james-server-smtpserver/3.0-M3-SNAPSHOT/pom.xml
[JENKINS] Archiving <https://hudson.apache.org/hudson/job/james-server-trunk/ws/trunk/smtpserver/target/james-server-smtpserver-3.0-M3-SNAPSHOT.jar> to /home/hudson/hudson/jobs/james-server-trunk/modules/org.apache.james$james-server-smtpserver/builds/2011-03-25_04-21-44/archive/org.apache.james/james-server-smtpserver/3.0-M3-20110325.042413-77/james-server-smtpserver-3.0-M3-SNAPSHOT.jar
[JENKINS] Archiving <https://hudson.apache.org/hudson/job/james-server-trunk/ws/trunk/smtpserver/target/james-server-smtpserver-3.0-M3-SNAPSHOT-tests.jar> to /home/hudson/hudson/jobs/james-server-trunk/modules/org.apache.james$james-server-smtpserver/builds/2011-03-25_04-21-44/archive/org.apache.james/james-server-smtpserver/3.0-M3-20110325.042413-77/james-server-smtpserver-3.0-M3-SNAPSHOT-tests.jar
[INFO] Downloading: http://download.java.net/maven/2/org/apache/james/apache-james-imap-api/0.2-M2-SNAPSHOT/maven-metadata.xml
Downloading: http://repository.apache.org/snapshots/org/apache/james/apache-james-imap-api/0.2-M2-SNAPSHOT/maven-metadata.xml
[INFO] ------------------------------------------------------------------------
[INFO] Building Apache James Server IMAP 3.0-M3-SNAPSHOT
[INFO] ------------------------------------------------------------------------
Downloaded: http://repository.apache.org/snapshots/org/apache/james/apache-james-imap-api/0.2-M2-SNAPSHOT/maven-metadata.xml (1007 B at 10.2 KB/sec)
Downloading: http://download.java.net/maven/2/org/apache/james/apache-james-imap-api/0.2-M2-SNAPSHOT/apache-james-imap-api-0.2-M2-20110325.040728-60.pom
Downloading: http://repository.apache.org/snapshots/org/apache/james/apache-james-imap-api/0.2-M2-SNAPSHOT/apache-james-imap-api-0.2-M2-20110325.040728-60.pom
Downloaded: http://repository.apache.org/snapshots/org/apache/james/apache-james-imap-api/0.2-M2-SNAPSHOT/apache-james-imap-api-0.2-M2-20110325.040728-60.pom (2 KB at 23.2 KB/sec)
Downloading: http://download.java.net/maven/2/org/apache/james/apache-james-imap/0.2-M2-SNAPSHOT/maven-metadata.xml
Downloading: http://repository.apache.org/snapshots/org/apache/james/apache-james-imap/0.2-M2-SNAPSHOT/maven-metadata.xml
Downloaded: http://repository.apache.org/snapshots/org/apache/james/apache-james-imap/0.2-M2-SNAPSHOT/maven-metadata.xml (2 KB at 12.7 KB/sec)
Downloading: http://repository.apache.org/snapshots/org/apache/james/apache-james-imap/0.2-M2-SNAPSHOT/apache-james-imap-0.2-M2-20110325.040714-60.pom
Downloaded: http://repository.apache.org/snapshots/org/apache/james/apache-james-imap/0.2-M2-SNAPSHOT/apache-james-imap-0.2-M2-20110325.040714-60.pom (21 KB at 111.5 KB/sec)
Downloading: http://repository.apache.org/snapshots/org/apache/james/apache-james-imap-message/0.2-M2-SNAPSHOT/maven-metadata.xml
Downloading: http://download.java.net/maven/2/org/apache/james/apache-james-imap-message/0.2-M2-SNAPSHOT/maven-metadata.xml
Downloaded: http://repository.apache.org/snapshots/org/apache/james/apache-james-imap-message/0.2-M2-SNAPSHOT/maven-metadata.xml (1011 B at 11.3 KB/sec)
Downloading: http://download.java.net/maven/2/org/apache/james/apache-james-imap-message/0.2-M2-SNAPSHOT/apache-james-imap-message-0.2-M2-20110325.040802-59.pom
Downloading: http://repository.apache.org/snapshots/org/apache/james/apache-james-imap-message/0.2-M2-SNAPSHOT/apache-james-imap-message-0.2-M2-20110325.040802-59.pom
Downloaded: http://repository.apache.org/snapshots/org/apache/james/apache-james-imap-message/0.2-M2-SNAPSHOT/apache-james-imap-message-0.2-M2-20110325.040802-59.pom (3 KB at 22.4 KB/sec)
Downloading: http://download.java.net/maven/2/org/apache/james/apache-james-imap-processor/0.2-M2-SNAPSHOT/maven-metadata.xml
Downloading: http://repository.apache.org/snapshots/org/apache/james/apache-james-imap-processor/0.2-M2-SNAPSHOT/maven-metadata.xml
Downloaded: http://repository.apache.org/snapshots/org/apache/james/apache-james-imap-processor/0.2-M2-SNAPSHOT/maven-metadata.xml (1013 B at 12.5 KB/sec)
Downloading: http://download.java.net/maven/2/org/apache/james/apache-james-imap-processor/0.2-M2-SNAPSHOT/apache-james-imap-processor-0.2-M2-20110325.040818-59.pom
Downloading: http://repository.apache.org/snapshots/org/apache/james/apache-james-imap-processor/0.2-M2-SNAPSHOT/apache-james-imap-processor-0.2-M2-20110325.040818-59.pom
Downloaded: http://repository.apache.org/snapshots/org/apache/james/apache-james-imap-processor/0.2-M2-SNAPSHOT/apache-james-imap-processor-0.2-M2-20110325.040818-59.pom (2 KB at 24.8 KB/sec)
Downloading: http://repository.apache.org/snapshots/org/apache/james/apache-james-imap-api/0.2-M2-SNAPSHOT/apache-james-imap-api-0.2-M2-20110325.040728-60.jar
Downloading: http://repository.apache.org/snapshots/org/apache/james/apache-james-imap-message/0.2-M2-SNAPSHOT/apache-james-imap-message-0.2-M2-20110325.040802-59.jar
Downloading: http://repository.apache.org/snapshots/org/apache/james/apache-james-imap-processor/0.2-M2-SNAPSHOT/apache-james-imap-processor-0.2-M2-20110325.040818-59.jar
Downloaded: http://repository.apache.org/snapshots/org/apache/james/apache-james-imap-api/0.2-M2-SNAPSHOT/apache-james-imap-api-0.2-M2-20110325.040728-60.jar (41 KB at 298.6 KB/sec)
Downloaded: http://repository.apache.org/snapshots/org/apache/james/apache-james-imap-processor/0.2-M2-SNAPSHOT/apache-james-imap-processor-0.2-M2-20110325.040818-59.jar (117 KB at 434.3 KB/sec)
Downloaded: http://repository.apache.org/snapshots/org/apache/james/apache-james-imap-message/0.2-M2-SNAPSHOT/apache-james-imap-message-0.2-M2-20110325.040802-59.jar (160 KB at 556.1 KB/sec)
[INFO] [INFO] Deleting <https://hudson.apache.org/hudson/job/james-server-trunk/ws/trunk/imapserver/target>
[INFO] --- maven-clean-plugin:2.4.1:clean (default-clean) @ james-server-imapserver ---
[INFO]
[INFO] --- maven-remote-resources-plugin:1.1:process (default) @ james-server-imapserver ---
Downloading: http://download.java.net/maven/2/org/apache/james/apache-james-imap-api/0.2-M2-SNAPSHOT/maven-metadata.xml
Downloading: http://repository.apache.org/snapshots/org/apache/james/apache-james-imap-api/0.2-M2-SNAPSHOT/maven-metadata.xml
Downloaded: http://repository.apache.org/snapshots/org/apache/james/apache-james-imap-api/0.2-M2-SNAPSHOT/maven-metadata.xml (1007 B at 11.8 KB/sec)
Downloading: http://download.java.net/maven/2/org/apache/james/apache-james-imap-message/0.2-M2-SNAPSHOT/maven-metadata.xml
Downloading: http://repository.apache.org/snapshots/org/apache/james/apache-james-imap-message/0.2-M2-SNAPSHOT/maven-metadata.xml
Downloaded: http://repository.apache.org/snapshots/org/apache/james/apache-james-imap-message/0.2-M2-SNAPSHOT/maven-metadata.xml (1011 B at 12.3 KB/sec)
Downloading: http://repository.apache.org/snapshots/org/apache/james/apache-james-imap-processor/0.2-M2-SNAPSHOT/maven-metadata.xml
Downloading: http://download.java.net/maven/2/org/apache/james/apache-james-imap-processor/0.2-M2-SNAPSHOT/maven-metadata.xml
Downloaded: http://repository.apache.org/snapshots/org/apache/james/apache-james-imap-processor/0.2-M2-SNAPSHOT/maven-metadata.xml (1013 B at 12.2 KB/sec)
[INFO] [INFO] Using 'UTF-8' encoding to copy filtered resources.
[INFO] Copying 0 resource
[INFO] Copying 3 resources
[INFO] --- maven-resources-plugin:2.4.3:resources (default-resources) @ james-server-imapserver ---
[INFO] [INFO] Compiling 16 source files to <https://hudson.apache.org/hudson/job/james-server-trunk/ws/trunk/imapserver/target/classes>
[INFO] --- maven-compiler-plugin:2.3.2:compile (default-compile) @ james-server-imapserver ---
[INFO] -------------------------------------------------------------
[ERROR] COMPILATION ERROR :
[INFO] -------------------------------------------------------------
[ERROR] <https://hudson.apache.org/hudson/job/james-server-trunk/ws/trunk/imapserver/src/main/java/org/apache/james/imapserver/netty/ChannelImapResponseWriter.java>:[54,18] cannot find symbol
symbol : constructor IOException(java.lang.Throwable)
location: class java.io.IOException
[ERROR] <https://hudson.apache.org/hudson/job/james-server-trunk/ws/trunk/imapserver/src/main/java/org/apache/james/imapserver/netty/ChannelWritableByteChannel.java>:[62,18] cannot find symbol
symbol : constructor IOException(java.lang.Throwable)
location: class java.io.IOException
[INFO] 2 errors
[INFO] -------------------------------------------------------------
mojoFailed org.apache.maven.plugins:maven-compiler-plugin:2.3.2(default-compile)
projectFailed org.apache.james:james-server-imapserver:3.0-M3-SNAPSHOT
[JENKINS] Archiving <https://hudson.apache.org/hudson/job/james-server-trunk/ws/trunk/imapserver/pom.xml> to /home/hudson/hudson/jobs/james-server-trunk/modules/org.apache.james$james-server-imapserver/builds/2011-03-25_04-21-44/archive/org.apache.james/james-server-imapserver/3.0-M3-SNAPSHOT/pom.xml
sessionEnded
[INFO] ------------------------------------------------------------------------
[INFO] Reactor Summary:
[INFO]
[INFO] Apache James Server ............................... SUCCESS [10.336s]
[INFO] Apache James Server Data API ...................... SUCCESS [6.177s]
[INFO] Apache James Server Client ........................ SUCCESS [4.034s]
[INFO] Apache James Server Lifecycle API ................. SUCCESS [4.048s]
[INFO] Apache James Server Filesystem API ................ SUCCESS [4.396s]
[INFO] Apache James Server Core .......................... SUCCESS [20.035s]
[INFO] Apache James Server Queue API ..................... SUCCESS [4.247s]
[INFO] Apache James Server Mailetcontainer library ....... SUCCESS [5.083s]
[INFO] Apache James Server DNS Server API ................ SUCCESS [4.663s]
[INFO] Apache James Server DNSService Library ............ SUCCESS [4.663s]
[INFO] Apache James Server Mailetcontainer Camel implementation SUCCESS [7.723s]
[INFO] Apache James Server Mailbox Adapter ............... SUCCESS [6.381s]
[INFO] Apache James Server DNSService Implementation ..... SUCCESS [4.902s]
[INFO] Apache James Server Common Utilities .............. SUCCESS [4.765s]
[INFO] Apache James Server Protocols Library ............. SUCCESS [5.509s]
[INFO] Apache James Server Data Library .................. SUCCESS [5.381s]
[INFO] Apache James Server LDAP Data Implementation ...... SUCCESS [4.007s]
[INFO] Apache James Server SMTP .......................... SUCCESS [8.867s]
[INFO] Apache James Server IMAP .......................... FAILURE [3.407s]
[INFO] Apache James Server LMTP .......................... SKIPPED
[INFO] Apache James Server POP3 .......................... SKIPPED
[INFO] Apache James Server FetchMail ..................... SKIPPED
[INFO] Apache James Server JMS Mail Queue ................ SKIPPED
[INFO] Apache James Server ActiveMQ Queue ................ SKIPPED
[INFO] Apache James Server Mailets ....................... SKIPPED
[INFO] Apache James Server File Data Persistence ......... SKIPPED
[INFO] Apache James Server JPA Data Persistence .......... SKIPPED
[INFO] Apache James Server JDBC Data Persistence ......... SKIPPED
[INFO] Apache James Server JCR Data Persistence .......... SKIPPED
[INFO] Apache James Server Container Spring .............. SKIPPED
[INFO] Apache James Server OSGI Bindings ................. SKIPPED
[INFO] ------------------------------------------------------------------------
[INFO] BUILD FAILURE
[INFO] ------------------------------------------------------------------------
[INFO] Total time: 2:27.790s
[INFO] Finished at: Thu Mar 24 20:24:21 GMT-08:00 2011
[INFO] Final Memory: 44M/177M
[INFO] ------------------------------------------------------------------------
maven builder waiting
mavenExecutionResult exceptions not empty
org.apache.maven.lifecycle.LifecycleExecutionException: Failed to execute goal org.apache.maven.plugins:maven-compiler-plugin:2.3.2:compile (default-compile) on project james-server-imapserver: Compilation failure
at org.apache.maven.lifecycle.internal.MojoExecutor.execute(MojoExecutor.java:213)
at org.apache.maven.lifecycle.internal.MojoExecutor.execute(MojoExecutor.java:153)
at org.apache.maven.lifecycle.internal.MojoExecutor.execute(MojoExecutor.java:145)
at org.apache.maven.lifecycle.internal.LifecycleModuleBuilder.buildProject(LifecycleModuleBuilder.java:84)
at org.apache.maven.lifecycle.internal.LifecycleModuleBuilder.buildProject(LifecycleModuleBuilder.java:59)
at org.apache.maven.lifecycle.internal.LifecycleStarter.singleThreadedBuild(LifecycleStarter.java:183)
at org.apache.maven.lifecycle.internal.LifecycleStarter.execute(LifecycleStarter.java:161)
at org.apache.maven.DefaultMaven.doExecute(DefaultMaven.java:319)
at org.apache.maven.DefaultMaven.execute(DefaultMaven.java:156)
at org.jvnet.hudson.maven3.launcher.Maven3Launcher.main(Maven3Launcher.java:79)
at sun.reflect.NativeMethodAccessorImpl.invoke0(Native Method)
at sun.reflect.NativeMethodAccessorImpl.invoke(NativeMethodAccessorImpl.java:39)
at sun.reflect.DelegatingMethodAccessorImpl.invoke(DelegatingMethodAccessorImpl.java:25)
at java.lang.reflect.Method.invoke(Method.java:592)
at org.codehaus.plexus.classworlds.launcher.Launcher.launchStandard(Launcher.java:329)
at org.codehaus.plexus.classworlds.launcher.Launcher.launch(Launcher.java:239)
at org.jvnet.hudson.maven3.agent.Maven3Main.launch(Maven3Main.java:146)
at hudson.maven.Maven3Builder.call(Maven3Builder.java:124)
at hudson.maven.Maven3Builder.call(Maven3Builder.java:71)
at hudson.remoting.UserRequest.perform(UserRequest.java:114)
at hudson.remoting.UserRequest.perform(UserRequest.java:48)
at hudson.remoting.Request$2.run(Request.java:270)
at java.util.concurrent.Executors$RunnableAdapter.call(Executors.java:417)
at java.util.concurrent.FutureTask$Sync.innerRun(FutureTask.java:269)
at java.util.concurrent.FutureTask.run(FutureTask.java:123)
at java.util.concurrent.ThreadPoolExecutor$Worker.runTask(ThreadPoolExecutor.java:651)
at java.util.concurrent.ThreadPoolExecutor$Worker.run(ThreadPoolExecutor.java:676)
at java.lang.Thread.run(Thread.java:595)
Caused by: org.apache.maven.plugin.CompilationFailureException: Compilation failure
at org.apache.maven.plugin.AbstractCompilerMojo.execute(AbstractCompilerMojo.java:656)
at org.apache.maven.plugin.CompilerMojo.execute(CompilerMojo.java:128)
at org.apache.maven.plugin.DefaultBuildPluginManager.executeMojo(DefaultBuildPluginManager.java:101)
at org.apache.maven.lifecycle.internal.MojoExecutor.execute(MojoExecutor.java:209)
... 27 more
Sending e-mails to: server-dev@james.apache.org
channel stopped
---------------------------------------------------------------------
To unsubscribe, e-mail: server-dev-unsubscribe@james.apache.org
For additional commands, e-mail: server-dev-help@james.apache.org
Build failed in Jenkins: james-server-trunk #1316
Posted by Apache Hudson Server <hu...@hudson.apache.org>.
See <https://hudson.apache.org/hudson/job/james-server-trunk/1316/>
------------------------------------------
[...truncated 1683 lines...]
Uploaded: https://repository.apache.org/content/repositories/snapshots/org/apache/james/james-server-ldap/3.0-M3-SNAPSHOT/james-server-ldap-3.0-M3-20110325.014118-76-tests.jar (8 KB at 45.0 KB/sec)
Uploading: https://repository.apache.org/content/repositories/snapshots/org/apache/james/james-server-ldap/3.0-M3-SNAPSHOT/maven-metadata.xml
Uploaded: https://repository.apache.org/content/repositories/snapshots/org/apache/james/james-server-ldap/3.0-M3-SNAPSHOT/maven-metadata.xml (1003 B at 6.6 KB/sec)
projectSucceeded org.apache.james:james-server-ldap:3.0-M3-SNAPSHOT
[JENKINS] Archiving <https://hudson.apache.org/hudson/job/james-server-trunk/ws/trunk/ldap/pom.xml> to /home/hudson/hudson/jobs/james-server-trunk/modules/org.apache.james$james-server-ldap/builds/2011-03-25_01-38-53/archive/org.apache.james/james-server-ldap/3.0-M3-SNAPSHOT/pom.xml
[JENKINS] Archiving <https://hudson.apache.org/hudson/job/james-server-trunk/ws/trunk/ldap/target/james-server-ldap-3.0-M3-SNAPSHOT.jar> to /home/hudson/hudson/jobs/james-server-trunk/modules/org.apache.james$james-server-ldap/builds/2011-03-25_01-38-53/archive/org.apache.james/james-server-ldap/3.0-M3-20110325.014118-76/james-server-ldap-3.0-M3-SNAPSHOT.jar
[JENKINS] Archiving <https://hudson.apache.org/hudson/job/james-server-trunk/ws/trunk/ldap/target/james-server-ldap-3.0-M3-SNAPSHOT-tests.jar> to /home/hudson/hudson/jobs/james-server-trunk/modules/org.apache.james$james-server-ldap/builds/2011-03-25_01-38-53/archive/org.apache.james/james-server-ldap/3.0-M3-20110325.014118-76/james-server-ldap-3.0-M3-SNAPSHOT-tests.jar
Downloading: http://download.java.net/maven/2/org/apache/james/protocols/protocols-smtp/1.4-SNAPSHOT/maven-metadata.xml
Downloading: http://repository.apache.org/snapshots/org/apache/james/protocols/protocols-smtp/1.4-SNAPSHOT/maven-metadata.xml
[INFO]
[INFO] ------------------------------------------------------------------------
[INFO] Building Apache James Server SMTP 3.0-M3-SNAPSHOT
[INFO] ------------------------------------------------------------------------
Downloaded: http://repository.apache.org/snapshots/org/apache/james/protocols/protocols-smtp/1.4-SNAPSHOT/maven-metadata.xml (998 B at 7.6 KB/sec)
Downloading: http://download.java.net/maven/2/org/apache/james/protocols/protocols-smtp/1.4-SNAPSHOT/protocols-smtp-1.4-20110325.013310-47.pom
Downloading: http://repository.apache.org/snapshots/org/apache/james/protocols/protocols-smtp/1.4-SNAPSHOT/protocols-smtp-1.4-20110325.013310-47.pom
Downloaded: http://repository.apache.org/snapshots/org/apache/james/protocols/protocols-smtp/1.4-SNAPSHOT/protocols-smtp-1.4-20110325.013310-47.pom (4 KB at 45.3 KB/sec)
Downloading: http://download.java.net/maven/2/org/apache/james/protocols/protocols-smtp/1.4-SNAPSHOT/maven-metadata.xml
Downloading: http://repository.apache.org/snapshots/org/apache/james/protocols/protocols-smtp/1.4-SNAPSHOT/maven-metadata.xml
Downloaded: http://repository.apache.org/snapshots/org/apache/james/protocols/protocols-smtp/1.4-SNAPSHOT/maven-metadata.xml (998 B at 11.5 KB/sec)
Downloading: http://repository.apache.org/snapshots/org/apache/james/protocols/protocols-smtp/1.4-SNAPSHOT/protocols-smtp-1.4-20110325.013310-47.jar
Downloading: http://repository.apache.org/snapshots/org/apache/james/protocols/protocols-smtp/1.4-SNAPSHOT/protocols-smtp-1.4-20110325.013310-47-tests.jar
Downloaded: http://repository.apache.org/snapshots/org/apache/james/protocols/protocols-smtp/1.4-SNAPSHOT/protocols-smtp-1.4-20110325.013310-47-tests.jar (30 KB at 150.5 KB/sec)
Downloaded: http://repository.apache.org/snapshots/org/apache/james/protocols/protocols-smtp/1.4-SNAPSHOT/protocols-smtp-1.4-20110325.013310-47.jar (91 KB at 422.0 KB/sec)
[INFO] [INFO] Deleting <https://hudson.apache.org/hudson/job/james-server-trunk/ws/trunk/smtpserver/target>
[INFO] --- maven-clean-plugin:2.4.1:clean (default-clean) @ james-server-smtpserver ---
[INFO]
[INFO] --- maven-remote-resources-plugin:1.1:process (default) @ james-server-smtpserver ---
Downloading: http://download.java.net/maven/2/org/apache/james/protocols/protocols-smtp/1.4-SNAPSHOT/maven-metadata.xml
Downloading: http://repository.apache.org/snapshots/org/apache/james/protocols/protocols-smtp/1.4-SNAPSHOT/maven-metadata.xml
Downloaded: http://repository.apache.org/snapshots/org/apache/james/protocols/protocols-smtp/1.4-SNAPSHOT/maven-metadata.xml (998 B at 11.5 KB/sec)
[INFO] [INFO] Using 'UTF-8' encoding to copy filtered resources.
[INFO] Copying 0 resource
[INFO] Copying 3 resources
[INFO] --- maven-resources-plugin:2.4.3:resources (default-resources) @ james-server-smtpserver ---
[INFO] [INFO] Compiling 48 source files to <https://hudson.apache.org/hudson/job/james-server-trunk/ws/trunk/smtpserver/target/classes>
[INFO] --- maven-compiler-plugin:2.3.2:compile (default-compile) @ james-server-smtpserver ---
[INFO]
[INFO] --- maven-bundle-plugin:2.1.0:manifest (bundle-manifest) @ james-server-smtpserver ---
[INFO] [INFO] Using 'UTF-8' encoding to copy filtered resources.
[INFO] Copying 1 resource
[INFO] Copying 3 resources
[INFO] --- maven-resources-plugin:2.4.3:testResources (default-testResources) @ james-server-smtpserver ---
[INFO] [INFO] Compiling 18 source files to <https://hudson.apache.org/hudson/job/james-server-trunk/ws/trunk/smtpserver/target/test-classes>
[INFO] --- maven-compiler-plugin:2.3.2:testCompile (default-testCompile) @ james-server-smtpserver ---
[INFO] Surefire report directory: <https://hudson.apache.org/hudson/job/james-server-trunk/ws/trunk/smtpserver/target/surefire-reports>
[INFO]
[INFO] --- maven-surefire-plugin:2.7.2:test (default-test) @ james-server-smtpserver ---
-------------------------------------------------------
T E S T S
-------------------------------------------------------
Running org.apache.james.smtpserver.SPFHandlerTest
Tests run: 8, Failures: 0, Errors: 0, Skipped: 0, Time elapsed: 0.181 sec
Running org.apache.james.smtpserver.OioSMTPServerTest
500 Line length exceeded. See RFC 2821 #4.5.3.1.
Tests run: 38, Failures: 0, Errors: 0, Skipped: 0, Time elapsed: 1.652 sec
Running org.apache.james.smtpserver.SetMimeHeaderHandlerTest
Tests run: 2, Failures: 0, Errors: 0, Skipped: 0, Time elapsed: 0.006 sec
Running org.apache.james.smtpserver.URIRBLHandlerTest
Tests run: 3, Failures: 0, Errors: 0, Skipped: 0, Time elapsed: 0.117 sec
Running org.apache.james.smtpserver.ValidRcptHandlerTest
Tests run: 5, Failures: 0, Errors: 0, Skipped: 0, Time elapsed: 0.005 sec
Running org.apache.james.smtpserver.POP3BeforeSMTPHandlerTest
Tests run: 4, Failures: 0, Errors: 0, Skipped: 0, Time elapsed: 0.104 sec
Running org.apache.james.smtpserver.ValidRcptMXTest
Tests run: 1, Failures: 0, Errors: 0, Skipped: 0, Time elapsed: 0.003 sec
Running org.apache.james.smtpserver.SpamAssassinHandlerTest
Tests run: 3, Failures: 0, Errors: 0, Skipped: 0, Time elapsed: 0.009 sec
Results :
Tests run: 64, Failures: 0, Errors: 0, Skipped: 0
[JENKINS] Recording test results
[INFO]
[INFO] --- maven-jar-plugin:2.3.1:jar (default-jar) @ james-server-smtpserver ---
[INFO] Building jar: <https://hudson.apache.org/hudson/job/james-server-trunk/ws/trunk/smtpserver/target/james-server-smtpserver-3.0-M3-SNAPSHOT.jar>
[INFO]
[INFO] --- maven-jar-plugin:2.3.1:test-jar (default) @ james-server-smtpserver ---
[INFO] Building jar: <https://hudson.apache.org/hudson/job/james-server-trunk/ws/trunk/smtpserver/target/james-server-smtpserver-3.0-M3-SNAPSHOT-tests.jar>
[INFO]
[INFO] --- maven-site-plugin:3.0-beta-3:attach-descriptor (attach-descriptor) @ james-server-smtpserver ---
[INFO] [INFO] Installing <https://hudson.apache.org/hudson/job/james-server-trunk/ws/trunk/smtpserver/target/james-server-smtpserver-3.0-M3-SNAPSHOT.jar> to /home/hudson/.m2/repository/org/apache/james/james-server-smtpserver/3.0-M3-SNAPSHOT/james-server-smtpserver-3.0-M3-SNAPSHOT.jar
[INFO] Installing <https://hudson.apache.org/hudson/job/james-server-trunk/ws/trunk/smtpserver/pom.xml> to /home/hudson/.m2/repository/org/apache/james/james-server-smtpserver/3.0-M3-SNAPSHOT/james-server-smtpserver-3.0-M3-SNAPSHOT.pom
[INFO] Installing <https://hudson.apache.org/hudson/job/james-server-trunk/ws/trunk/smtpserver/target/james-server-smtpserver-3.0-M3-SNAPSHOT-tests.jar> to /home/hudson/.m2/repository/org/apache/james/james-server-smtpserver/3.0-M3-SNAPSHOT/james-server-smtpserver-3.0-M3-SNAPSHOT-tests.jar
[INFO] --- maven-install-plugin:2.3.1:install (default-install) @ james-server-smtpserver ---
[INFO] Downloading: https://repository.apache.org/content/repositories/snapshots/org/apache/james/james-server-smtpserver/3.0-M3-SNAPSHOT/maven-metadata.xml
[INFO] --- maven-deploy-plugin:2.4:deploy (default-deploy) @ james-server-smtpserver ---
Downloaded: https://repository.apache.org/content/repositories/snapshots/org/apache/james/james-server-smtpserver/3.0-M3-SNAPSHOT/maven-metadata.xml (1009 B at 9.0 KB/sec)
Uploading: https://repository.apache.org/content/repositories/snapshots/org/apache/james/james-server-smtpserver/3.0-M3-SNAPSHOT/james-server-smtpserver-3.0-M3-20110325.014128-76.jar
Uploaded: https://repository.apache.org/content/repositories/snapshots/org/apache/james/james-server-smtpserver/3.0-M3-SNAPSHOT/james-server-smtpserver-3.0-M3-20110325.014128-76.jar (94 KB at 286.1 KB/sec)
Uploading: https://repository.apache.org/content/repositories/snapshots/org/apache/james/james-server-smtpserver/3.0-M3-SNAPSHOT/james-server-smtpserver-3.0-M3-20110325.014128-76.pom
Uploaded: https://repository.apache.org/content/repositories/snapshots/org/apache/james/james-server-smtpserver/3.0-M3-SNAPSHOT/james-server-smtpserver-3.0-M3-20110325.014128-76.pom (7 KB at 38.0 KB/sec)
Downloading: https://repository.apache.org/content/repositories/snapshots/org/apache/james/james-server-smtpserver/maven-metadata.xml
Downloaded: https://repository.apache.org/content/repositories/snapshots/org/apache/james/james-server-smtpserver/maven-metadata.xml (300 B at 2.9 KB/sec)
Uploading: https://repository.apache.org/content/repositories/snapshots/org/apache/james/james-server-smtpserver/3.0-M3-SNAPSHOT/maven-metadata.xml
Uploaded: https://repository.apache.org/content/repositories/snapshots/org/apache/james/james-server-smtpserver/3.0-M3-SNAPSHOT/maven-metadata.xml (1009 B at 6.7 KB/sec)
Uploading: https://repository.apache.org/content/repositories/snapshots/org/apache/james/james-server-smtpserver/maven-metadata.xml
Uploaded: https://repository.apache.org/content/repositories/snapshots/org/apache/james/james-server-smtpserver/maven-metadata.xml (300 B at 2.0 KB/sec)
Uploading: https://repository.apache.org/content/repositories/snapshots/org/apache/james/james-server-smtpserver/3.0-M3-SNAPSHOT/james-server-smtpserver-3.0-M3-20110325.014128-76-tests.jar
Uploaded: https://repository.apache.org/content/repositories/snapshots/org/apache/james/james-server-smtpserver/3.0-M3-SNAPSHOT/james-server-smtpserver-3.0-M3-20110325.014128-76-tests.jar (66 KB at 145.6 KB/sec)
Uploading: https://repository.apache.org/content/repositories/snapshots/org/apache/james/james-server-smtpserver/3.0-M3-SNAPSHOT/maven-metadata.xml
Uploaded: https://repository.apache.org/content/repositories/snapshots/org/apache/james/james-server-smtpserver/3.0-M3-SNAPSHOT/maven-metadata.xml (1009 B at 7.2 KB/sec)
projectSucceeded org.apache.james:james-server-smtpserver:3.0-M3-SNAPSHOT
[JENKINS] Archiving <https://hudson.apache.org/hudson/job/james-server-trunk/ws/trunk/smtpserver/pom.xml> to /home/hudson/hudson/jobs/james-server-trunk/modules/org.apache.james$james-server-smtpserver/builds/2011-03-25_01-38-53/archive/org.apache.james/james-server-smtpserver/3.0-M3-SNAPSHOT/pom.xml
[JENKINS] Archiving <https://hudson.apache.org/hudson/job/james-server-trunk/ws/trunk/smtpserver/target/james-server-smtpserver-3.0-M3-SNAPSHOT.jar> to /home/hudson/hudson/jobs/james-server-trunk/modules/org.apache.james$james-server-smtpserver/builds/2011-03-25_01-38-53/archive/org.apache.james/james-server-smtpserver/3.0-M3-20110325.014128-76/james-server-smtpserver-3.0-M3-SNAPSHOT.jar
[JENKINS] Archiving <https://hudson.apache.org/hudson/job/james-server-trunk/ws/trunk/smtpserver/target/james-server-smtpserver-3.0-M3-SNAPSHOT-tests.jar> to /home/hudson/hudson/jobs/james-server-trunk/modules/org.apache.james$james-server-smtpserver/builds/2011-03-25_01-38-53/archive/org.apache.james/james-server-smtpserver/3.0-M3-20110325.014128-76/james-server-smtpserver-3.0-M3-SNAPSHOT-tests.jar
[INFO] Downloading: http://download.java.net/maven/2/org/apache/james/apache-james-imap-api/0.2-M2-SNAPSHOT/maven-metadata.xml
Downloading: http://repository.apache.org/snapshots/org/apache/james/apache-james-imap-api/0.2-M2-SNAPSHOT/maven-metadata.xml
[INFO] ------------------------------------------------------------------------
[INFO] Building Apache James Server IMAP 3.0-M3-SNAPSHOT
[INFO] ------------------------------------------------------------------------
Downloaded: http://repository.apache.org/snapshots/org/apache/james/apache-james-imap-api/0.2-M2-SNAPSHOT/maven-metadata.xml (1007 B at 11.3 KB/sec)
Downloading: http://download.java.net/maven/2/org/apache/james/apache-james-imap/0.2-M2-SNAPSHOT/maven-metadata.xml
Downloading: http://repository.apache.org/snapshots/org/apache/james/apache-james-imap/0.2-M2-SNAPSHOT/maven-metadata.xml
Downloaded: http://repository.apache.org/snapshots/org/apache/james/apache-james-imap/0.2-M2-SNAPSHOT/maven-metadata.xml (2 KB at 10.9 KB/sec)
Downloading: http://download.java.net/maven/2/org/apache/james/apache-james-imap-message/0.2-M2-SNAPSHOT/maven-metadata.xml
Downloading: http://repository.apache.org/snapshots/org/apache/james/apache-james-imap-message/0.2-M2-SNAPSHOT/maven-metadata.xml
Downloaded: http://repository.apache.org/snapshots/org/apache/james/apache-james-imap-message/0.2-M2-SNAPSHOT/maven-metadata.xml (1011 B at 11.2 KB/sec)
Downloading: http://download.java.net/maven/2/org/apache/james/apache-james-imap-processor/0.2-M2-SNAPSHOT/maven-metadata.xml
Downloading: http://repository.apache.org/snapshots/org/apache/james/apache-james-imap-processor/0.2-M2-SNAPSHOT/maven-metadata.xml
Downloaded: http://repository.apache.org/snapshots/org/apache/james/apache-james-imap-processor/0.2-M2-SNAPSHOT/maven-metadata.xml (1013 B at 10.9 KB/sec)
[INFO] Deleting <https://hudson.apache.org/hudson/job/james-server-trunk/ws/trunk/imapserver/target>
[INFO]
[INFO] --- maven-clean-plugin:2.4.1:clean (default-clean) @ james-server-imapserver ---
[INFO]
[INFO] --- maven-remote-resources-plugin:1.1:process (default) @ james-server-imapserver ---
Downloading: http://repository.apache.org/snapshots/org/apache/james/apache-james-imap-api/0.2-M2-SNAPSHOT/maven-metadata.xml
Downloading: http://download.java.net/maven/2/org/apache/james/apache-james-imap-api/0.2-M2-SNAPSHOT/maven-metadata.xml
Downloaded: http://repository.apache.org/snapshots/org/apache/james/apache-james-imap-api/0.2-M2-SNAPSHOT/maven-metadata.xml (1007 B at 11.8 KB/sec)
Downloading: http://download.java.net/maven/2/org/apache/james/apache-james-imap-message/0.2-M2-SNAPSHOT/maven-metadata.xml
Downloading: http://repository.apache.org/snapshots/org/apache/james/apache-james-imap-message/0.2-M2-SNAPSHOT/maven-metadata.xml
Downloaded: http://repository.apache.org/snapshots/org/apache/james/apache-james-imap-message/0.2-M2-SNAPSHOT/maven-metadata.xml (1011 B at 12.0 KB/sec)
Downloading: http://download.java.net/maven/2/org/apache/james/apache-james-imap-processor/0.2-M2-SNAPSHOT/maven-metadata.xml
Downloading: http://repository.apache.org/snapshots/org/apache/james/apache-james-imap-processor/0.2-M2-SNAPSHOT/maven-metadata.xml
Downloaded: http://repository.apache.org/snapshots/org/apache/james/apache-james-imap-processor/0.2-M2-SNAPSHOT/maven-metadata.xml (1013 B at 12.2 KB/sec)
[INFO] [INFO] Using 'UTF-8' encoding to copy filtered resources.
[INFO] Copying 0 resource
[INFO] Copying 3 resources
[INFO] --- maven-resources-plugin:2.4.3:resources (default-resources) @ james-server-imapserver ---
[INFO] [INFO] Compiling 16 source files to <https://hudson.apache.org/hudson/job/james-server-trunk/ws/trunk/imapserver/target/classes>
[INFO] --- maven-compiler-plugin:2.3.2:compile (default-compile) @ james-server-imapserver ---
[INFO] -------------------------------------------------------------
[ERROR] COMPILATION ERROR :
[INFO] -------------------------------------------------------------
[ERROR] <https://hudson.apache.org/hudson/job/james-server-trunk/ws/trunk/imapserver/src/main/java/org/apache/james/imapserver/netty/ChannelImapResponseWriter.java>:[54,18] cannot find symbol
symbol : constructor IOException(java.lang.Throwable)
location: class java.io.IOException
[ERROR] <https://hudson.apache.org/hudson/job/james-server-trunk/ws/trunk/imapserver/src/main/java/org/apache/james/imapserver/netty/ChannelWritableByteChannel.java>:[62,18] cannot find symbol
symbol : constructor IOException(java.lang.Throwable)
location: class java.io.IOException
[INFO] 2 errors
[INFO] -------------------------------------------------------------
mojoFailed org.apache.maven.plugins:maven-compiler-plugin:2.3.2(default-compile)
projectFailed org.apache.james:james-server-imapserver:3.0-M3-SNAPSHOT
[JENKINS] Archiving <https://hudson.apache.org/hudson/job/james-server-trunk/ws/trunk/imapserver/pom.xml> to /home/hudson/hudson/jobs/james-server-trunk/modules/org.apache.james$james-server-imapserver/builds/2011-03-25_01-38-53/archive/org.apache.james/james-server-imapserver/3.0-M3-SNAPSHOT/pom.xml
sessionEnded
[INFO] ------------------------------------------------------------------------
[INFO] Reactor Summary:
[INFO]
[INFO] Apache James Server ............................... SUCCESS [11.673s]
[INFO] Apache James Server Data API ...................... SUCCESS [6.345s]
[INFO] Apache James Server Client ........................ SUCCESS [4.121s]
[INFO] Apache James Server Lifecycle API ................. SUCCESS [4.343s]
[INFO] Apache James Server Filesystem API ................ SUCCESS [4.523s]
[INFO] Apache James Server Core .......................... SUCCESS [20.686s]
[INFO] Apache James Server Queue API ..................... SUCCESS [4.193s]
[INFO] Apache James Server Mailetcontainer library ....... SUCCESS [5.513s]
[INFO] Apache James Server DNS Server API ................ SUCCESS [4.762s]
[INFO] Apache James Server DNSService Library ............ SUCCESS [4.894s]
[INFO] Apache James Server Mailetcontainer Camel implementation SUCCESS [8.392s]
[INFO] Apache James Server Mailbox Adapter ............... SUCCESS [5.376s]
[INFO] Apache James Server DNSService Implementation ..... SUCCESS [5.357s]
[INFO] Apache James Server Common Utilities .............. SUCCESS [5.116s]
[INFO] Apache James Server Protocols Library ............. SUCCESS [6.280s]
[INFO] Apache James Server Data Library .................. SUCCESS [5.360s]
[INFO] Apache James Server LDAP Data Implementation ...... SUCCESS [4.101s]
[INFO] Apache James Server SMTP .......................... SUCCESS [9.566s]
[INFO] Apache James Server IMAP .......................... FAILURE [2.462s]
[INFO] Apache James Server LMTP .......................... SKIPPED
[INFO] Apache James Server POP3 .......................... SKIPPED
[INFO] Apache James Server FetchMail ..................... SKIPPED
[INFO] Apache James Server JMS Mail Queue ................ SKIPPED
[INFO] Apache James Server ActiveMQ Queue ................ SKIPPED
[INFO] Apache James Server Mailets ....................... SKIPPED
[INFO] Apache James Server File Data Persistence ......... SKIPPED
[INFO] Apache James Server JPA Data Persistence .......... SKIPPED
[INFO] Apache James Server JDBC Data Persistence ......... SKIPPED
[INFO] Apache James Server JCR Data Persistence .......... SKIPPED
[INFO] Apache James Server Container Spring .............. SKIPPED
[INFO] Apache James Server OSGI Bindings ................. SKIPPED
[INFO] ------------------------------------------------------------------------
[INFO] BUILD FAILURE
[INFO] ------------------------------------------------------------------------
[INFO] Total time: 2:32.227s
[INFO] Finished at: Thu Mar 24 17:41:35 GMT-08:00 2011
[INFO] Final Memory: 44M/187M
[INFO] ------------------------------------------------------------------------
maven builder waiting
mavenExecutionResult exceptions not empty
org.apache.maven.lifecycle.LifecycleExecutionException: Failed to execute goal org.apache.maven.plugins:maven-compiler-plugin:2.3.2:compile (default-compile) on project james-server-imapserver: Compilation failure
at org.apache.maven.lifecycle.internal.MojoExecutor.execute(MojoExecutor.java:213)
at org.apache.maven.lifecycle.internal.MojoExecutor.execute(MojoExecutor.java:153)
at org.apache.maven.lifecycle.internal.MojoExecutor.execute(MojoExecutor.java:145)
at org.apache.maven.lifecycle.internal.LifecycleModuleBuilder.buildProject(LifecycleModuleBuilder.java:84)
at org.apache.maven.lifecycle.internal.LifecycleModuleBuilder.buildProject(LifecycleModuleBuilder.java:59)
at org.apache.maven.lifecycle.internal.LifecycleStarter.singleThreadedBuild(LifecycleStarter.java:183)
at org.apache.maven.lifecycle.internal.LifecycleStarter.execute(LifecycleStarter.java:161)
at org.apache.maven.DefaultMaven.doExecute(DefaultMaven.java:319)
at org.apache.maven.DefaultMaven.execute(DefaultMaven.java:156)
at org.jvnet.hudson.maven3.launcher.Maven3Launcher.main(Maven3Launcher.java:79)
at sun.reflect.NativeMethodAccessorImpl.invoke0(Native Method)
at sun.reflect.NativeMethodAccessorImpl.invoke(NativeMethodAccessorImpl.java:39)
at sun.reflect.DelegatingMethodAccessorImpl.invoke(DelegatingMethodAccessorImpl.java:25)
at java.lang.reflect.Method.invoke(Method.java:592)
at org.codehaus.plexus.classworlds.launcher.Launcher.launchStandard(Launcher.java:329)
at org.codehaus.plexus.classworlds.launcher.Launcher.launch(Launcher.java:239)
at org.jvnet.hudson.maven3.agent.Maven3Main.launch(Maven3Main.java:146)
at hudson.maven.Maven3Builder.call(Maven3Builder.java:124)
at hudson.maven.Maven3Builder.call(Maven3Builder.java:71)
at hudson.remoting.UserRequest.perform(UserRequest.java:114)
at hudson.remoting.UserRequest.perform(UserRequest.java:48)
at hudson.remoting.Request$2.run(Request.java:270)
at java.util.concurrent.Executors$RunnableAdapter.call(Executors.java:417)
at java.util.concurrent.FutureTask$Sync.innerRun(FutureTask.java:269)
at java.util.concurrent.FutureTask.run(FutureTask.java:123)
at java.util.concurrent.ThreadPoolExecutor$Worker.runTask(ThreadPoolExecutor.java:651)
at java.util.concurrent.ThreadPoolExecutor$Worker.run(ThreadPoolExecutor.java:676)
at java.lang.Thread.run(Thread.java:595)
Caused by: org.apache.maven.plugin.CompilationFailureException: Compilation failure
at org.apache.maven.plugin.AbstractCompilerMojo.execute(AbstractCompilerMojo.java:656)
at org.apache.maven.plugin.CompilerMojo.execute(CompilerMojo.java:128)
at org.apache.maven.plugin.DefaultBuildPluginManager.executeMojo(DefaultBuildPluginManager.java:101)
at org.apache.maven.lifecycle.internal.MojoExecutor.execute(MojoExecutor.java:209)
... 27 more
Sending e-mails to: server-dev@james.apache.org
channel stopped
---------------------------------------------------------------------
To unsubscribe, e-mail: server-dev-unsubscribe@james.apache.org
For additional commands, e-mail: server-dev-help@james.apache.org
Build failed in Jenkins: james-server-trunk #1315
Posted by Apache Hudson Server <hu...@hudson.apache.org>.
See <https://hudson.apache.org/hudson/job/james-server-trunk/1315/>
------------------------------------------
[...truncated 1667 lines...]
Downloading: https://repository.apache.org/content/repositories/snapshots/org/apache/james/james-server-ldap/maven-metadata.xml
Downloaded: https://repository.apache.org/content/repositories/snapshots/org/apache/james/james-server-ldap/maven-metadata.xml (294 B at 2.9 KB/sec)
Uploading: https://repository.apache.org/content/repositories/snapshots/org/apache/james/james-server-ldap/3.0-M3-SNAPSHOT/maven-metadata.xml
Uploaded: https://repository.apache.org/content/repositories/snapshots/org/apache/james/james-server-ldap/3.0-M3-SNAPSHOT/maven-metadata.xml (1003 B at 7.4 KB/sec)
Uploading: https://repository.apache.org/content/repositories/snapshots/org/apache/james/james-server-ldap/maven-metadata.xml
Uploaded: https://repository.apache.org/content/repositories/snapshots/org/apache/james/james-server-ldap/maven-metadata.xml (294 B at 1.8 KB/sec)
Uploading: https://repository.apache.org/content/repositories/snapshots/org/apache/james/james-server-ldap/3.0-M3-SNAPSHOT/james-server-ldap-3.0-M3-20110325.004018-75-tests.jar
Uploaded: https://repository.apache.org/content/repositories/snapshots/org/apache/james/james-server-ldap/3.0-M3-SNAPSHOT/james-server-ldap-3.0-M3-20110325.004018-75-tests.jar (8 KB at 37.7 KB/sec)
Uploading: https://repository.apache.org/content/repositories/snapshots/org/apache/james/james-server-ldap/3.0-M3-SNAPSHOT/maven-metadata.xml
Uploaded: https://repository.apache.org/content/repositories/snapshots/org/apache/james/james-server-ldap/3.0-M3-SNAPSHOT/maven-metadata.xml (1003 B at 6.1 KB/sec)
projectSucceeded org.apache.james:james-server-ldap:3.0-M3-SNAPSHOT
[JENKINS] Archiving <https://hudson.apache.org/hudson/job/james-server-trunk/ws/trunk/ldap/pom.xml> to /home/hudson/hudson/jobs/james-server-trunk/modules/org.apache.james$james-server-ldap/builds/2011-03-25_00-37-53/archive/org.apache.james/james-server-ldap/3.0-M3-SNAPSHOT/pom.xml
[JENKINS] Archiving <https://hudson.apache.org/hudson/job/james-server-trunk/ws/trunk/ldap/target/james-server-ldap-3.0-M3-SNAPSHOT.jar> to /home/hudson/hudson/jobs/james-server-trunk/modules/org.apache.james$james-server-ldap/builds/2011-03-25_00-37-53/archive/org.apache.james/james-server-ldap/3.0-M3-20110325.004018-75/james-server-ldap-3.0-M3-SNAPSHOT.jar
[JENKINS] Archiving <https://hudson.apache.org/hudson/job/james-server-trunk/ws/trunk/ldap/target/james-server-ldap-3.0-M3-SNAPSHOT-tests.jar> to /home/hudson/hudson/jobs/james-server-trunk/modules/org.apache.james$james-server-ldap/builds/2011-03-25_00-37-53/archive/org.apache.james/james-server-ldap/3.0-M3-20110325.004018-75/james-server-ldap-3.0-M3-SNAPSHOT-tests.jar
[INFO] Downloading: http://download.java.net/maven/2/org/apache/james/protocols/protocols-smtp/1.4-SNAPSHOT/maven-metadata.xml
Downloading: http://repository.apache.org/snapshots/org/apache/james/protocols/protocols-smtp/1.4-SNAPSHOT/maven-metadata.xml
[INFO] ------------------------------------------------------------------------
[INFO] Building Apache James Server SMTP 3.0-M3-SNAPSHOT
[INFO] ------------------------------------------------------------------------
Downloaded: http://repository.apache.org/snapshots/org/apache/james/protocols/protocols-smtp/1.4-SNAPSHOT/maven-metadata.xml (998 B at 8.9 KB/sec)
Downloading: http://download.java.net/maven/2/org/apache/james/protocols/protocols-smtp/1.4-SNAPSHOT/maven-metadata.xml
Downloading: http://repository.apache.org/snapshots/org/apache/james/protocols/protocols-smtp/1.4-SNAPSHOT/maven-metadata.xml
Downloaded: http://repository.apache.org/snapshots/org/apache/james/protocols/protocols-smtp/1.4-SNAPSHOT/maven-metadata.xml (998 B at 12.0 KB/sec)
[INFO] [INFO] Deleting <https://hudson.apache.org/hudson/job/james-server-trunk/ws/trunk/smtpserver/target>
[INFO] --- maven-clean-plugin:2.4.1:clean (default-clean) @ james-server-smtpserver ---
[INFO]
[INFO] --- maven-remote-resources-plugin:1.1:process (default) @ james-server-smtpserver ---
Downloading: http://download.java.net/maven/2/org/apache/james/protocols/protocols-smtp/1.4-SNAPSHOT/maven-metadata.xml
Downloading: http://repository.apache.org/snapshots/org/apache/james/protocols/protocols-smtp/1.4-SNAPSHOT/maven-metadata.xml
Downloaded: http://repository.apache.org/snapshots/org/apache/james/protocols/protocols-smtp/1.4-SNAPSHOT/maven-metadata.xml (998 B at 12.0 KB/sec)
[INFO] Using 'UTF-8' encoding to copy filtered resources.
[INFO] [INFO] Copying 0 resource
[INFO] Copying 3 resources
[INFO] --- maven-resources-plugin:2.4.3:resources (default-resources) @ james-server-smtpserver ---
[INFO]
[INFO] --- maven-compiler-plugin:2.3.2:compile (default-compile) @ james-server-smtpserver ---
[INFO] Compiling 48 source files to <https://hudson.apache.org/hudson/job/james-server-trunk/ws/trunk/smtpserver/target/classes>
[INFO]
[INFO] --- maven-bundle-plugin:2.1.0:manifest (bundle-manifest) @ james-server-smtpserver ---
[INFO] [INFO] Using 'UTF-8' encoding to copy filtered resources.
[INFO] Copying 1 resource
[INFO] Copying 3 resources
[INFO] --- maven-resources-plugin:2.4.3:testResources (default-testResources) @ james-server-smtpserver ---
[INFO]
[INFO] --- maven-compiler-plugin:2.3.2:testCompile (default-testCompile) @ james-server-smtpserver ---
[INFO] Compiling 18 source files to <https://hudson.apache.org/hudson/job/james-server-trunk/ws/trunk/smtpserver/target/test-classes>
[INFO] [INFO] Surefire report directory: <https://hudson.apache.org/hudson/job/james-server-trunk/ws/trunk/smtpserver/target/surefire-reports>
[INFO] --- maven-surefire-plugin:2.7.2:test (default-test) @ james-server-smtpserver ---
-------------------------------------------------------
T E S T S
-------------------------------------------------------
Running org.apache.james.smtpserver.SPFHandlerTest
Tests run: 8, Failures: 0, Errors: 0, Skipped: 0, Time elapsed: 0.193 sec
Running org.apache.james.smtpserver.OioSMTPServerTest
500 Line length exceeded. See RFC 2821 #4.5.3.1.
Tests run: 38, Failures: 0, Errors: 0, Skipped: 0, Time elapsed: 1.503 sec
Running org.apache.james.smtpserver.SetMimeHeaderHandlerTest
Tests run: 2, Failures: 0, Errors: 0, Skipped: 0, Time elapsed: 0.007 sec
Running org.apache.james.smtpserver.URIRBLHandlerTest
Tests run: 3, Failures: 0, Errors: 0, Skipped: 0, Time elapsed: 0.112 sec
Running org.apache.james.smtpserver.ValidRcptHandlerTest
Tests run: 5, Failures: 0, Errors: 0, Skipped: 0, Time elapsed: 0.005 sec
Running org.apache.james.smtpserver.POP3BeforeSMTPHandlerTest
Tests run: 4, Failures: 0, Errors: 0, Skipped: 0, Time elapsed: 0.104 sec
Running org.apache.james.smtpserver.ValidRcptMXTest
Tests run: 1, Failures: 0, Errors: 0, Skipped: 0, Time elapsed: 0.002 sec
Running org.apache.james.smtpserver.SpamAssassinHandlerTest
Tests run: 3, Failures: 0, Errors: 0, Skipped: 0, Time elapsed: 0.008 sec
Results :
Tests run: 64, Failures: 0, Errors: 0, Skipped: 0
[JENKINS] Recording test results
[INFO]
[INFO] --- maven-jar-plugin:2.3.1:jar (default-jar) @ james-server-smtpserver ---
[INFO] Building jar: <https://hudson.apache.org/hudson/job/james-server-trunk/ws/trunk/smtpserver/target/james-server-smtpserver-3.0-M3-SNAPSHOT.jar>
[INFO]
[INFO] --- maven-jar-plugin:2.3.1:test-jar (default) @ james-server-smtpserver ---
[INFO] Building jar: <https://hudson.apache.org/hudson/job/james-server-trunk/ws/trunk/smtpserver/target/james-server-smtpserver-3.0-M3-SNAPSHOT-tests.jar>
[INFO]
[INFO] --- maven-site-plugin:3.0-beta-3:attach-descriptor (attach-descriptor) @ james-server-smtpserver ---
[INFO] [INFO] Installing <https://hudson.apache.org/hudson/job/james-server-trunk/ws/trunk/smtpserver/target/james-server-smtpserver-3.0-M3-SNAPSHOT.jar> to /home/hudson/.m2/repository/org/apache/james/james-server-smtpserver/3.0-M3-SNAPSHOT/james-server-smtpserver-3.0-M3-SNAPSHOT.jar
[INFO] Installing <https://hudson.apache.org/hudson/job/james-server-trunk/ws/trunk/smtpserver/pom.xml> to /home/hudson/.m2/repository/org/apache/james/james-server-smtpserver/3.0-M3-SNAPSHOT/james-server-smtpserver-3.0-M3-SNAPSHOT.pom
[INFO] --- maven-install-plugin:2.3.1:install (default-install) @ james-server-smtpserver ---
[INFO] Installing <https://hudson.apache.org/hudson/job/james-server-trunk/ws/trunk/smtpserver/target/james-server-smtpserver-3.0-M3-SNAPSHOT-tests.jar> to /home/hudson/.m2/repository/org/apache/james/james-server-smtpserver/3.0-M3-SNAPSHOT/james-server-smtpserver-3.0-M3-SNAPSHOT-tests.jar
[INFO] Downloading: https://repository.apache.org/content/repositories/snapshots/org/apache/james/james-server-smtpserver/3.0-M3-SNAPSHOT/maven-metadata.xml
[INFO] --- maven-deploy-plugin:2.4:deploy (default-deploy) @ james-server-smtpserver ---
Downloaded: https://repository.apache.org/content/repositories/snapshots/org/apache/james/james-server-smtpserver/3.0-M3-SNAPSHOT/maven-metadata.xml (1009 B at 4.5 KB/sec)
Uploading: https://repository.apache.org/content/repositories/snapshots/org/apache/james/james-server-smtpserver/3.0-M3-SNAPSHOT/james-server-smtpserver-3.0-M3-20110325.004029-75.jar
Uploaded: https://repository.apache.org/content/repositories/snapshots/org/apache/james/james-server-smtpserver/3.0-M3-SNAPSHOT/james-server-smtpserver-3.0-M3-20110325.004029-75.jar (94 KB at 219.6 KB/sec)
Uploading: https://repository.apache.org/content/repositories/snapshots/org/apache/james/james-server-smtpserver/3.0-M3-SNAPSHOT/james-server-smtpserver-3.0-M3-20110325.004029-75.pom
Uploaded: https://repository.apache.org/content/repositories/snapshots/org/apache/james/james-server-smtpserver/3.0-M3-SNAPSHOT/james-server-smtpserver-3.0-M3-20110325.004029-75.pom (7 KB at 33.5 KB/sec)
Downloading: https://repository.apache.org/content/repositories/snapshots/org/apache/james/james-server-smtpserver/maven-metadata.xml
Downloaded: https://repository.apache.org/content/repositories/snapshots/org/apache/james/james-server-smtpserver/maven-metadata.xml (300 B at 3.1 KB/sec)
Uploading: https://repository.apache.org/content/repositories/snapshots/org/apache/james/james-server-smtpserver/3.0-M3-SNAPSHOT/maven-metadata.xml
Uploaded: https://repository.apache.org/content/repositories/snapshots/org/apache/james/james-server-smtpserver/3.0-M3-SNAPSHOT/maven-metadata.xml (1009 B at 4.4 KB/sec)
Uploading: https://repository.apache.org/content/repositories/snapshots/org/apache/james/james-server-smtpserver/maven-metadata.xml
Uploaded: https://repository.apache.org/content/repositories/snapshots/org/apache/james/james-server-smtpserver/maven-metadata.xml (300 B at 1.8 KB/sec)
Uploading: https://repository.apache.org/content/repositories/snapshots/org/apache/james/james-server-smtpserver/3.0-M3-SNAPSHOT/james-server-smtpserver-3.0-M3-20110325.004029-75-tests.jar
Uploaded: https://repository.apache.org/content/repositories/snapshots/org/apache/james/james-server-smtpserver/3.0-M3-SNAPSHOT/james-server-smtpserver-3.0-M3-20110325.004029-75-tests.jar (66 KB at 137.7 KB/sec)
Uploading: https://repository.apache.org/content/repositories/snapshots/org/apache/james/james-server-smtpserver/3.0-M3-SNAPSHOT/maven-metadata.xml
Uploaded: https://repository.apache.org/content/repositories/snapshots/org/apache/james/james-server-smtpserver/3.0-M3-SNAPSHOT/maven-metadata.xml (1009 B at 6.8 KB/sec)
projectSucceeded org.apache.james:james-server-smtpserver:3.0-M3-SNAPSHOT
[JENKINS] Archiving <https://hudson.apache.org/hudson/job/james-server-trunk/ws/trunk/smtpserver/pom.xml> to /home/hudson/hudson/jobs/james-server-trunk/modules/org.apache.james$james-server-smtpserver/builds/2011-03-25_00-37-53/archive/org.apache.james/james-server-smtpserver/3.0-M3-SNAPSHOT/pom.xml
[JENKINS] Archiving <https://hudson.apache.org/hudson/job/james-server-trunk/ws/trunk/smtpserver/target/james-server-smtpserver-3.0-M3-SNAPSHOT.jar> to /home/hudson/hudson/jobs/james-server-trunk/modules/org.apache.james$james-server-smtpserver/builds/2011-03-25_00-37-53/archive/org.apache.james/james-server-smtpserver/3.0-M3-20110325.004029-75/james-server-smtpserver-3.0-M3-SNAPSHOT.jar
[JENKINS] Archiving <https://hudson.apache.org/hudson/job/james-server-trunk/ws/trunk/smtpserver/target/james-server-smtpserver-3.0-M3-SNAPSHOT-tests.jar> to /home/hudson/hudson/jobs/james-server-trunk/modules/org.apache.james$james-server-smtpserver/builds/2011-03-25_00-37-53/archive/org.apache.james/james-server-smtpserver/3.0-M3-20110325.004029-75/james-server-smtpserver-3.0-M3-SNAPSHOT-tests.jar
[INFO] Downloading: http://download.java.net/maven/2/org/apache/james/apache-james-imap-api/0.2-M2-SNAPSHOT/maven-metadata.xml
Downloading: http://repository.apache.org/snapshots/org/apache/james/apache-james-imap-api/0.2-M2-SNAPSHOT/maven-metadata.xml
[INFO] ------------------------------------------------------------------------
[INFO] Building Apache James Server IMAP 3.0-M3-SNAPSHOT
[INFO] ------------------------------------------------------------------------
Downloaded: http://repository.apache.org/snapshots/org/apache/james/apache-james-imap-api/0.2-M2-SNAPSHOT/maven-metadata.xml (1007 B at 11.6 KB/sec)
Downloading: http://download.java.net/maven/2/org/apache/james/apache-james-imap/0.2-M2-SNAPSHOT/maven-metadata.xml
Downloading: http://repository.apache.org/snapshots/org/apache/james/apache-james-imap/0.2-M2-SNAPSHOT/maven-metadata.xml
Downloaded: http://repository.apache.org/snapshots/org/apache/james/apache-james-imap/0.2-M2-SNAPSHOT/maven-metadata.xml (2 KB at 12.7 KB/sec)
Downloading: http://repository.apache.org/snapshots/org/apache/james/apache-james-imap-message/0.2-M2-SNAPSHOT/maven-metadata.xml
Downloading: http://download.java.net/maven/2/org/apache/james/apache-james-imap-message/0.2-M2-SNAPSHOT/maven-metadata.xml
Downloaded: http://repository.apache.org/snapshots/org/apache/james/apache-james-imap-message/0.2-M2-SNAPSHOT/maven-metadata.xml (1011 B at 12.3 KB/sec)
Downloading: http://download.java.net/maven/2/org/apache/james/apache-james-imap-processor/0.2-M2-SNAPSHOT/maven-metadata.xml
Downloading: http://repository.apache.org/snapshots/org/apache/james/apache-james-imap-processor/0.2-M2-SNAPSHOT/maven-metadata.xml
Downloaded: http://repository.apache.org/snapshots/org/apache/james/apache-james-imap-processor/0.2-M2-SNAPSHOT/maven-metadata.xml (1013 B at 11.4 KB/sec)
[INFO] [INFO] Deleting <https://hudson.apache.org/hudson/job/james-server-trunk/ws/trunk/imapserver/target>
[INFO] --- maven-clean-plugin:2.4.1:clean (default-clean) @ james-server-imapserver ---
[INFO]
[INFO] --- maven-remote-resources-plugin:1.1:process (default) @ james-server-imapserver ---
Downloading: http://repository.apache.org/snapshots/org/apache/james/apache-james-imap-api/0.2-M2-SNAPSHOT/maven-metadata.xml
Downloading: http://download.java.net/maven/2/org/apache/james/apache-james-imap-api/0.2-M2-SNAPSHOT/maven-metadata.xml
Downloaded: http://repository.apache.org/snapshots/org/apache/james/apache-james-imap-api/0.2-M2-SNAPSHOT/maven-metadata.xml (1007 B at 11.8 KB/sec)
Downloading: http://download.java.net/maven/2/org/apache/james/apache-james-imap-message/0.2-M2-SNAPSHOT/maven-metadata.xml
Downloading: http://repository.apache.org/snapshots/org/apache/james/apache-james-imap-message/0.2-M2-SNAPSHOT/maven-metadata.xml
Downloaded: http://repository.apache.org/snapshots/org/apache/james/apache-james-imap-message/0.2-M2-SNAPSHOT/maven-metadata.xml (1011 B at 12.5 KB/sec)
Downloading: http://download.java.net/maven/2/org/apache/james/apache-james-imap-processor/0.2-M2-SNAPSHOT/maven-metadata.xml
Downloading: http://repository.apache.org/snapshots/org/apache/james/apache-james-imap-processor/0.2-M2-SNAPSHOT/maven-metadata.xml
Downloaded: http://repository.apache.org/snapshots/org/apache/james/apache-james-imap-processor/0.2-M2-SNAPSHOT/maven-metadata.xml (1013 B at 12.2 KB/sec)
[INFO] [INFO] Using 'UTF-8' encoding to copy filtered resources.
[INFO] Copying 0 resource
[INFO] Copying 3 resources
[INFO] --- maven-resources-plugin:2.4.3:resources (default-resources) @ james-server-imapserver ---
[INFO]
[INFO] --- maven-compiler-plugin:2.3.2:compile (default-compile) @ james-server-imapserver ---
[INFO] Compiling 16 source files to <https://hudson.apache.org/hudson/job/james-server-trunk/ws/trunk/imapserver/target/classes>
[INFO] -------------------------------------------------------------
[ERROR] COMPILATION ERROR :
[INFO] -------------------------------------------------------------
[ERROR] <https://hudson.apache.org/hudson/job/james-server-trunk/ws/trunk/imapserver/src/main/java/org/apache/james/imapserver/netty/ChannelImapResponseWriter.java>:[54,18] cannot find symbol
symbol : constructor IOException(java.lang.Throwable)
location: class java.io.IOException
[ERROR] <https://hudson.apache.org/hudson/job/james-server-trunk/ws/trunk/imapserver/src/main/java/org/apache/james/imapserver/netty/ChannelWritableByteChannel.java>:[62,18] cannot find symbol
symbol : constructor IOException(java.lang.Throwable)
location: class java.io.IOException
[INFO] 2 errors
[INFO] -------------------------------------------------------------
mojoFailed org.apache.maven.plugins:maven-compiler-plugin:2.3.2(default-compile)
projectFailed org.apache.james:james-server-imapserver:3.0-M3-SNAPSHOT
[JENKINS] Archiving <https://hudson.apache.org/hudson/job/james-server-trunk/ws/trunk/imapserver/pom.xml> to /home/hudson/hudson/jobs/james-server-trunk/modules/org.apache.james$james-server-imapserver/builds/2011-03-25_00-37-53/archive/org.apache.james/james-server-imapserver/3.0-M3-SNAPSHOT/pom.xml
sessionEnded
[INFO] ------------------------------------------------------------------------
[INFO] Reactor Summary:
[INFO]
[INFO] Apache James Server ............................... SUCCESS [10.625s]
[INFO] Apache James Server Data API ...................... SUCCESS [6.406s]
[INFO] Apache James Server Client ........................ SUCCESS [4.141s]
[INFO] Apache James Server Lifecycle API ................. SUCCESS [4.161s]
[INFO] Apache James Server Filesystem API ................ SUCCESS [4.479s]
[INFO] Apache James Server Core .......................... SUCCESS [21.171s]
[INFO] Apache James Server Queue API ..................... SUCCESS [4.748s]
[INFO] Apache James Server Mailetcontainer library ....... SUCCESS [5.437s]
[INFO] Apache James Server DNS Server API ................ SUCCESS [4.786s]
[INFO] Apache James Server DNSService Library ............ SUCCESS [5.133s]
[INFO] Apache James Server Mailetcontainer Camel implementation SUCCESS [8.251s]
[INFO] Apache James Server Mailbox Adapter ............... SUCCESS [5.047s]
[INFO] Apache James Server DNSService Implementation ..... SUCCESS [5.386s]
[INFO] Apache James Server Common Utilities .............. SUCCESS [5.389s]
[INFO] Apache James Server Protocols Library ............. SUCCESS [5.785s]
[INFO] Apache James Server Data Library .................. SUCCESS [6.074s]
[INFO] Apache James Server LDAP Data Implementation ...... SUCCESS [4.550s]
[INFO] Apache James Server SMTP .......................... SUCCESS [9.977s]
[INFO] Apache James Server IMAP .......................... FAILURE [2.497s]
[INFO] Apache James Server LMTP .......................... SKIPPED
[INFO] Apache James Server POP3 .......................... SKIPPED
[INFO] Apache James Server FetchMail ..................... SKIPPED
[INFO] Apache James Server JMS Mail Queue ................ SKIPPED
[INFO] Apache James Server ActiveMQ Queue ................ SKIPPED
[INFO] Apache James Server Mailets ....................... SKIPPED
[INFO] Apache James Server File Data Persistence ......... SKIPPED
[INFO] Apache James Server JPA Data Persistence .......... SKIPPED
[INFO] Apache James Server JDBC Data Persistence ......... SKIPPED
[INFO] Apache James Server JCR Data Persistence .......... SKIPPED
[INFO] Apache James Server Container Spring .............. SKIPPED
[INFO] Apache James Server OSGI Bindings ................. SKIPPED
[INFO] ------------------------------------------------------------------------
[INFO] BUILD FAILURE
[INFO] ------------------------------------------------------------------------
[INFO] Total time: 2:33.570s
[INFO] Finished at: Thu Mar 24 16:40:36 GMT-08:00 2011
[INFO] Final Memory: 44M/183M
[INFO] ------------------------------------------------------------------------
maven builder waiting
mavenExecutionResult exceptions not empty
org.apache.maven.lifecycle.LifecycleExecutionException: Failed to execute goal org.apache.maven.plugins:maven-compiler-plugin:2.3.2:compile (default-compile) on project james-server-imapserver: Compilation failure
at org.apache.maven.lifecycle.internal.MojoExecutor.execute(MojoExecutor.java:213)
at org.apache.maven.lifecycle.internal.MojoExecutor.execute(MojoExecutor.java:153)
at org.apache.maven.lifecycle.internal.MojoExecutor.execute(MojoExecutor.java:145)
at org.apache.maven.lifecycle.internal.LifecycleModuleBuilder.buildProject(LifecycleModuleBuilder.java:84)
at org.apache.maven.lifecycle.internal.LifecycleModuleBuilder.buildProject(LifecycleModuleBuilder.java:59)
at org.apache.maven.lifecycle.internal.LifecycleStarter.singleThreadedBuild(LifecycleStarter.java:183)
at org.apache.maven.lifecycle.internal.LifecycleStarter.execute(LifecycleStarter.java:161)
at org.apache.maven.DefaultMaven.doExecute(DefaultMaven.java:319)
at org.apache.maven.DefaultMaven.execute(DefaultMaven.java:156)
at org.jvnet.hudson.maven3.launcher.Maven3Launcher.main(Maven3Launcher.java:79)
at sun.reflect.NativeMethodAccessorImpl.invoke0(Native Method)
at sun.reflect.NativeMethodAccessorImpl.invoke(NativeMethodAccessorImpl.java:39)
at sun.reflect.DelegatingMethodAccessorImpl.invoke(DelegatingMethodAccessorImpl.java:25)
at java.lang.reflect.Method.invoke(Method.java:592)
at org.codehaus.plexus.classworlds.launcher.Launcher.launchStandard(Launcher.java:329)
at org.codehaus.plexus.classworlds.launcher.Launcher.launch(Launcher.java:239)
at org.jvnet.hudson.maven3.agent.Maven3Main.launch(Maven3Main.java:146)
at hudson.maven.Maven3Builder.call(Maven3Builder.java:124)
at hudson.maven.Maven3Builder.call(Maven3Builder.java:71)
at hudson.remoting.UserRequest.perform(UserRequest.java:114)
at hudson.remoting.UserRequest.perform(UserRequest.java:48)
at hudson.remoting.Request$2.run(Request.java:270)
at java.util.concurrent.Executors$RunnableAdapter.call(Executors.java:417)
at java.util.concurrent.FutureTask$Sync.innerRun(FutureTask.java:269)
at java.util.concurrent.FutureTask.run(FutureTask.java:123)
at java.util.concurrent.ThreadPoolExecutor$Worker.runTask(ThreadPoolExecutor.java:651)
at java.util.concurrent.ThreadPoolExecutor$Worker.run(ThreadPoolExecutor.java:676)
at java.lang.Thread.run(Thread.java:595)
Caused by: org.apache.maven.plugin.CompilationFailureException: Compilation failure
at org.apache.maven.plugin.AbstractCompilerMojo.execute(AbstractCompilerMojo.java:656)
at org.apache.maven.plugin.CompilerMojo.execute(CompilerMojo.java:128)
at org.apache.maven.plugin.DefaultBuildPluginManager.executeMojo(DefaultBuildPluginManager.java:101)
at org.apache.maven.lifecycle.internal.MojoExecutor.execute(MojoExecutor.java:209)
... 27 more
Sending e-mails to: server-dev@james.apache.org
channel stopped
---------------------------------------------------------------------
To unsubscribe, e-mail: server-dev-unsubscribe@james.apache.org
For additional commands, e-mail: server-dev-help@james.apache.org