You are viewing a plain text version of this content. The canonical link for it is here.
Posted to builds@solr.apache.org by Apache Jenkins Server <je...@builds.apache.org> on 2022/02/02 00:21:16 UTC

[JENKINS] Solr » Solr-Check-9.x - Build # 184 - Unstable!

Build: https://ci-builds.apache.org/job/Solr/job/Solr-Check-9.x/184/

4 tests failed.
FAILED:  org.apache.solr.schema.PreAnalyzedFieldManagedSchemaCloudTest.classMethod

Error Message:
com.carrotsearch.randomizedtesting.ResourceDisposalError: Resource in scope SUITE failed to close. Resource was registered from thread Thread[id=24929, name=qtp1982921733-24929, state=RUNNABLE, group=TGRP-PreAnalyzedFieldManagedSchemaCloudTest], registration stack trace below.

Stack Trace:
com.carrotsearch.randomizedtesting.ResourceDisposalError: Resource in scope SUITE failed to close. Resource was registered from thread Thread[id=24929, name=qtp1982921733-24929, state=RUNNABLE, group=TGRP-PreAnalyzedFieldManagedSchemaCloudTest], registration stack trace below.
	at java.base@11.0.12/java.lang.Thread.getStackTrace(Thread.java:1606)
	at app//com.carrotsearch.randomizedtesting.RandomizedContext.closeAtEnd(RandomizedContext.java:157)
	at app//org.apache.lucene.util.LuceneTestCase.closeAfterSuite(LuceneTestCase.java:798)
	at app//org.apache.lucene.util.LuceneTestCase.wrapDirectory(LuceneTestCase.java:1504)
	at app//org.apache.lucene.util.LuceneTestCase.newDirectory(LuceneTestCase.java:1368)
	at app//org.apache.lucene.util.LuceneTestCase.newDirectory(LuceneTestCase.java:1350)
	at app//org.apache.solr.core.MockDirectoryFactory.create(MockDirectoryFactory.java:49)
	at app//org.apache.solr.core.CachingDirectoryFactory.get(CachingDirectoryFactory.java:360)
	at app//org.apache.solr.core.SolrCore.initSnapshotMetaDataManager(SolrCore.java:582)
	at app//org.apache.solr.core.SolrCore.<init>(SolrCore.java:1026)
	at app//org.apache.solr.core.SolrCore.<init>(SolrCore.java:961)
	at app//org.apache.solr.core.CoreContainer.createFromDescriptor(CoreContainer.java:1429)
	at app//org.apache.solr.core.CoreContainer.create(CoreContainer.java:1303)
	at app//org.apache.solr.handler.admin.CoreAdminOperation.lambda$static$0(CoreAdminOperation.java:91)
	at app//org.apache.solr.handler.admin.CoreAdminOperation.execute(CoreAdminOperation.java:345)
	at app//org.apache.solr.handler.admin.CoreAdminHandler$CallInfo.call(CoreAdminHandler.java:423)
	at app//org.apache.solr.handler.admin.CoreAdminHandler.handleRequestBody(CoreAdminHandler.java:197)
	at app//org.apache.solr.handler.RequestHandlerBase.handleRequest(RequestHandlerBase.java:214)
	at app//org.apache.solr.servlet.HttpSolrCall.handleAdmin(HttpSolrCall.java:866)
	at app//org.apache.solr.servlet.HttpSolrCall.handleAdminRequest(HttpSolrCall.java:830)
	at app//org.apache.solr.servlet.HttpSolrCall.call(HttpSolrCall.java:542)
	at app//org.apache.solr.servlet.SolrDispatchFilter.dispatch(SolrDispatchFilter.java:218)
	at app//org.apache.solr.servlet.SolrDispatchFilter.lambda$doFilter$0(SolrDispatchFilter.java:189)
	at app//org.apache.solr.servlet.ServletUtils.traceHttpRequestExecution2(ServletUtils.java:232)
	at app//org.apache.solr.servlet.ServletUtils.rateLimitRequest(ServletUtils.java:208)
	at app//org.apache.solr.servlet.SolrDispatchFilter.doFilter(SolrDispatchFilter.java:187)
	at app//org.apache.solr.servlet.SolrDispatchFilter.doFilter(SolrDispatchFilter.java:171)
	at app//org.eclipse.jetty.servlet.FilterHolder.doFilter(FilterHolder.java:193)
	at app//org.eclipse.jetty.servlet.ServletHandler$Chain.doFilter(ServletHandler.java:1601)
	at app//org.apache.solr.client.solrj.embedded.JettySolrRunner$DebugFilter.doFilter(JettySolrRunner.java:189)
	at app//org.eclipse.jetty.servlet.FilterHolder.doFilter(FilterHolder.java:193)
	at app//org.eclipse.jetty.servlet.ServletHandler$Chain.doFilter(ServletHandler.java:1601)
	at app//org.eclipse.jetty.servlet.ServletHandler.doHandle(ServletHandler.java:548)
	at app//org.eclipse.jetty.server.handler.ScopedHandler.nextHandle(ScopedHandler.java:233)
	at app//org.eclipse.jetty.server.session.SessionHandler.doHandle(SessionHandler.java:1624)
	at app//org.eclipse.jetty.server.handler.ScopedHandler.nextHandle(ScopedHandler.java:233)
	at app//org.eclipse.jetty.server.handler.ContextHandler.doHandle(ContextHandler.java:1434)
	at app//org.eclipse.jetty.server.handler.ScopedHandler.nextScope(ScopedHandler.java:188)
	at app//org.eclipse.jetty.servlet.ServletHandler.doScope(ServletHandler.java:501)
	at app//org.eclipse.jetty.server.session.SessionHandler.doScope(SessionHandler.java:1594)
	at app//org.eclipse.jetty.server.handler.ScopedHandler.nextScope(ScopedHandler.java:186)
	at app//org.eclipse.jetty.server.handler.ContextHandler.doScope(ContextHandler.java:1349)
	at app//org.eclipse.jetty.server.handler.ScopedHandler.handle(ScopedHandler.java:141)
	at app//org.eclipse.jetty.server.handler.HandlerWrapper.handle(HandlerWrapper.java:127)
	at app//org.eclipse.jetty.rewrite.handler.RewriteHandler.handle(RewriteHandler.java:322)
	at app//org.eclipse.jetty.server.handler.gzip.GzipHandler.handle(GzipHandler.java:713)
	at app//org.eclipse.jetty.server.handler.HandlerWrapper.handle(HandlerWrapper.java:127)
	at app//org.eclipse.jetty.server.Server.handle(Server.java:516)
	at app//org.eclipse.jetty.server.HttpChannel.lambda$handle$1(HttpChannel.java:400)
	at app//org.eclipse.jetty.server.HttpChannel.dispatch(HttpChannel.java:645)
	at app//org.eclipse.jetty.server.HttpChannel.handle(HttpChannel.java:392)
	at app//org.eclipse.jetty.server.HttpChannel.run(HttpChannel.java:352)
	at app//org.eclipse.jetty.util.thread.QueuedThreadPool.runJob(QueuedThreadPool.java:883)
	at app//org.eclipse.jetty.util.thread.QueuedThreadPool$Runner.run(QueuedThreadPool.java:1034)
	at java.base@11.0.12/java.lang.Thread.run(Thread.java:834)
Caused by: java.lang.AssertionError: Directory not closed: MockDirectoryWrapper(ByteBuffersDirectory@80ee1f lockFactory=org.apache.lucene.store.SingleInstanceLockFactory@6f36966)
	at org.junit.Assert.fail(Assert.java:89)
	at org.apache.lucene.util.CloseableDirectory.close(CloseableDirectory.java:43)
	at com.carrotsearch.randomizedtesting.RandomizedRunner$4$1.apply(RandomizedRunner.java:788)
	at com.carrotsearch.randomizedtesting.RandomizedRunner$4$1.apply(RandomizedRunner.java:785)
	at com.carrotsearch.randomizedtesting.RandomizedContext.closeResources(RandomizedContext.java:225)
	at com.carrotsearch.randomizedtesting.RandomizedRunner$4.afterAlways(RandomizedRunner.java:801)
	at com.carrotsearch.randomizedtesting.rules.StatementAdapter.evaluate(StatementAdapter.java:43)
	at com.carrotsearch.randomizedtesting.ThreadLeakControl$StatementRunner.run(ThreadLeakControl.java:370)
	at com.carrotsearch.randomizedtesting.ThreadLeakControl.lambda$forkTimeoutingTask$0(ThreadLeakControl.java:826)
	... 1 more


FAILED:  org.apache.solr.schema.PreAnalyzedFieldManagedSchemaCloudTest.classMethod

Error Message:
com.carrotsearch.randomizedtesting.ResourceDisposalError: Resource in scope SUITE failed to close. Resource was registered from thread Thread[id=24929, name=qtp1982921733-24929, state=RUNNABLE, group=TGRP-PreAnalyzedFieldManagedSchemaCloudTest], registration stack trace below.

Stack Trace:
com.carrotsearch.randomizedtesting.ResourceDisposalError: Resource in scope SUITE failed to close. Resource was registered from thread Thread[id=24929, name=qtp1982921733-24929, state=RUNNABLE, group=TGRP-PreAnalyzedFieldManagedSchemaCloudTest], registration stack trace below.
	at java.base@11.0.12/java.lang.Thread.getStackTrace(Thread.java:1606)
	at app//com.carrotsearch.randomizedtesting.RandomizedContext.closeAtEnd(RandomizedContext.java:157)
	at app//org.apache.lucene.util.LuceneTestCase.closeAfterSuite(LuceneTestCase.java:798)
	at app//org.apache.lucene.util.LuceneTestCase.wrapDirectory(LuceneTestCase.java:1504)
	at app//org.apache.lucene.util.LuceneTestCase.newDirectory(LuceneTestCase.java:1368)
	at app//org.apache.lucene.util.LuceneTestCase.newDirectory(LuceneTestCase.java:1350)
	at app//org.apache.solr.core.MockDirectoryFactory.create(MockDirectoryFactory.java:49)
	at app//org.apache.solr.core.CachingDirectoryFactory.get(CachingDirectoryFactory.java:360)
	at app//org.apache.solr.core.SolrCore.getNewIndexDir(SolrCore.java:404)
	at app//org.apache.solr.core.SolrCore.initIndex(SolrCore.java:817)
	at app//org.apache.solr.core.SolrCore.<init>(SolrCore.java:1030)
	at app//org.apache.solr.core.SolrCore.<init>(SolrCore.java:961)
	at app//org.apache.solr.core.CoreContainer.createFromDescriptor(CoreContainer.java:1429)
	at app//org.apache.solr.core.CoreContainer.create(CoreContainer.java:1303)
	at app//org.apache.solr.handler.admin.CoreAdminOperation.lambda$static$0(CoreAdminOperation.java:91)
	at app//org.apache.solr.handler.admin.CoreAdminOperation.execute(CoreAdminOperation.java:345)
	at app//org.apache.solr.handler.admin.CoreAdminHandler$CallInfo.call(CoreAdminHandler.java:423)
	at app//org.apache.solr.handler.admin.CoreAdminHandler.handleRequestBody(CoreAdminHandler.java:197)
	at app//org.apache.solr.handler.RequestHandlerBase.handleRequest(RequestHandlerBase.java:214)
	at app//org.apache.solr.servlet.HttpSolrCall.handleAdmin(HttpSolrCall.java:866)
	at app//org.apache.solr.servlet.HttpSolrCall.handleAdminRequest(HttpSolrCall.java:830)
	at app//org.apache.solr.servlet.HttpSolrCall.call(HttpSolrCall.java:542)
	at app//org.apache.solr.servlet.SolrDispatchFilter.dispatch(SolrDispatchFilter.java:218)
	at app//org.apache.solr.servlet.SolrDispatchFilter.lambda$doFilter$0(SolrDispatchFilter.java:189)
	at app//org.apache.solr.servlet.ServletUtils.traceHttpRequestExecution2(ServletUtils.java:232)
	at app//org.apache.solr.servlet.ServletUtils.rateLimitRequest(ServletUtils.java:208)
	at app//org.apache.solr.servlet.SolrDispatchFilter.doFilter(SolrDispatchFilter.java:187)
	at app//org.apache.solr.servlet.SolrDispatchFilter.doFilter(SolrDispatchFilter.java:171)
	at app//org.eclipse.jetty.servlet.FilterHolder.doFilter(FilterHolder.java:193)
	at app//org.eclipse.jetty.servlet.ServletHandler$Chain.doFilter(ServletHandler.java:1601)
	at app//org.apache.solr.client.solrj.embedded.JettySolrRunner$DebugFilter.doFilter(JettySolrRunner.java:189)
	at app//org.eclipse.jetty.servlet.FilterHolder.doFilter(FilterHolder.java:193)
	at app//org.eclipse.jetty.servlet.ServletHandler$Chain.doFilter(ServletHandler.java:1601)
	at app//org.eclipse.jetty.servlet.ServletHandler.doHandle(ServletHandler.java:548)
	at app//org.eclipse.jetty.server.handler.ScopedHandler.nextHandle(ScopedHandler.java:233)
	at app//org.eclipse.jetty.server.session.SessionHandler.doHandle(SessionHandler.java:1624)
	at app//org.eclipse.jetty.server.handler.ScopedHandler.nextHandle(ScopedHandler.java:233)
	at app//org.eclipse.jetty.server.handler.ContextHandler.doHandle(ContextHandler.java:1434)
	at app//org.eclipse.jetty.server.handler.ScopedHandler.nextScope(ScopedHandler.java:188)
	at app//org.eclipse.jetty.servlet.ServletHandler.doScope(ServletHandler.java:501)
	at app//org.eclipse.jetty.server.session.SessionHandler.doScope(SessionHandler.java:1594)
	at app//org.eclipse.jetty.server.handler.ScopedHandler.nextScope(ScopedHandler.java:186)
	at app//org.eclipse.jetty.server.handler.ContextHandler.doScope(ContextHandler.java:1349)
	at app//org.eclipse.jetty.server.handler.ScopedHandler.handle(ScopedHandler.java:141)
	at app//org.eclipse.jetty.server.handler.HandlerWrapper.handle(HandlerWrapper.java:127)
	at app//org.eclipse.jetty.rewrite.handler.RewriteHandler.handle(RewriteHandler.java:322)
	at app//org.eclipse.jetty.server.handler.gzip.GzipHandler.handle(GzipHandler.java:713)
	at app//org.eclipse.jetty.server.handler.HandlerWrapper.handle(HandlerWrapper.java:127)
	at app//org.eclipse.jetty.server.Server.handle(Server.java:516)
	at app//org.eclipse.jetty.server.HttpChannel.lambda$handle$1(HttpChannel.java:400)
	at app//org.eclipse.jetty.server.HttpChannel.dispatch(HttpChannel.java:645)
	at app//org.eclipse.jetty.server.HttpChannel.handle(HttpChannel.java:392)
	at app//org.eclipse.jetty.server.HttpChannel.run(HttpChannel.java:352)
	at app//org.eclipse.jetty.util.thread.QueuedThreadPool.runJob(QueuedThreadPool.java:883)
	at app//org.eclipse.jetty.util.thread.QueuedThreadPool$Runner.run(QueuedThreadPool.java:1034)
	at java.base@11.0.12/java.lang.Thread.run(Thread.java:834)
Caused by: java.lang.AssertionError: Directory not closed: MockDirectoryWrapper(ByteBuffersDirectory@3520b114 lockFactory=org.apache.lucene.store.SingleInstanceLockFactory@e39f409)
	at org.junit.Assert.fail(Assert.java:89)
	at org.apache.lucene.util.CloseableDirectory.close(CloseableDirectory.java:43)
	at com.carrotsearch.randomizedtesting.RandomizedRunner$4$1.apply(RandomizedRunner.java:788)
	at com.carrotsearch.randomizedtesting.RandomizedRunner$4$1.apply(RandomizedRunner.java:785)
	at com.carrotsearch.randomizedtesting.RandomizedContext.closeResources(RandomizedContext.java:225)
	at com.carrotsearch.randomizedtesting.RandomizedRunner$4.afterAlways(RandomizedRunner.java:801)
	at com.carrotsearch.randomizedtesting.rules.StatementAdapter.evaluate(StatementAdapter.java:43)
	at com.carrotsearch.randomizedtesting.ThreadLeakControl$StatementRunner.run(ThreadLeakControl.java:370)
	at com.carrotsearch.randomizedtesting.ThreadLeakControl.lambda$forkTimeoutingTask$0(ThreadLeakControl.java:826)
	... 1 more


FAILED:  org.apache.solr.schema.PreAnalyzedFieldManagedSchemaCloudTest.classMethod

Error Message:
com.carrotsearch.randomizedtesting.ResourceDisposalError: Resource in scope SUITE failed to close. Resource was registered from thread Thread[id=24929, name=qtp1982921733-24929, state=RUNNABLE, group=TGRP-PreAnalyzedFieldManagedSchemaCloudTest], registration stack trace below.

Stack Trace:
com.carrotsearch.randomizedtesting.ResourceDisposalError: Resource in scope SUITE failed to close. Resource was registered from thread Thread[id=24929, name=qtp1982921733-24929, state=RUNNABLE, group=TGRP-PreAnalyzedFieldManagedSchemaCloudTest], registration stack trace below.
	at java.base@11.0.12/java.lang.Thread.getStackTrace(Thread.java:1606)
	at app//com.carrotsearch.randomizedtesting.RandomizedContext.closeAtEnd(RandomizedContext.java:157)
	at app//org.apache.lucene.util.LuceneTestCase.closeAfterSuite(LuceneTestCase.java:798)
	at app//org.apache.lucene.util.LuceneTestCase.wrapDirectory(LuceneTestCase.java:1504)
	at app//org.apache.lucene.util.LuceneTestCase.newDirectory(LuceneTestCase.java:1368)
	at app//org.apache.lucene.util.LuceneTestCase.newDirectory(LuceneTestCase.java:1350)
	at app//org.apache.solr.core.MockDirectoryFactory.create(MockDirectoryFactory.java:49)
	at app//org.apache.solr.core.CachingDirectoryFactory.get(CachingDirectoryFactory.java:360)
	at app//org.apache.solr.update.SolrIndexWriter.create(SolrIndexWriter.java:98)
	at app//org.apache.solr.core.SolrCore.initIndex(SolrCore.java:849)
	at app//org.apache.solr.core.SolrCore.<init>(SolrCore.java:1030)
	at app//org.apache.solr.core.SolrCore.<init>(SolrCore.java:961)
	at app//org.apache.solr.core.CoreContainer.createFromDescriptor(CoreContainer.java:1429)
	at app//org.apache.solr.core.CoreContainer.create(CoreContainer.java:1303)
	at app//org.apache.solr.handler.admin.CoreAdminOperation.lambda$static$0(CoreAdminOperation.java:91)
	at app//org.apache.solr.handler.admin.CoreAdminOperation.execute(CoreAdminOperation.java:345)
	at app//org.apache.solr.handler.admin.CoreAdminHandler$CallInfo.call(CoreAdminHandler.java:423)
	at app//org.apache.solr.handler.admin.CoreAdminHandler.handleRequestBody(CoreAdminHandler.java:197)
	at app//org.apache.solr.handler.RequestHandlerBase.handleRequest(RequestHandlerBase.java:214)
	at app//org.apache.solr.servlet.HttpSolrCall.handleAdmin(HttpSolrCall.java:866)
	at app//org.apache.solr.servlet.HttpSolrCall.handleAdminRequest(HttpSolrCall.java:830)
	at app//org.apache.solr.servlet.HttpSolrCall.call(HttpSolrCall.java:542)
	at app//org.apache.solr.servlet.SolrDispatchFilter.dispatch(SolrDispatchFilter.java:218)
	at app//org.apache.solr.servlet.SolrDispatchFilter.lambda$doFilter$0(SolrDispatchFilter.java:189)
	at app//org.apache.solr.servlet.ServletUtils.traceHttpRequestExecution2(ServletUtils.java:232)
	at app//org.apache.solr.servlet.ServletUtils.rateLimitRequest(ServletUtils.java:208)
	at app//org.apache.solr.servlet.SolrDispatchFilter.doFilter(SolrDispatchFilter.java:187)
	at app//org.apache.solr.servlet.SolrDispatchFilter.doFilter(SolrDispatchFilter.java:171)
	at app//org.eclipse.jetty.servlet.FilterHolder.doFilter(FilterHolder.java:193)
	at app//org.eclipse.jetty.servlet.ServletHandler$Chain.doFilter(ServletHandler.java:1601)
	at app//org.apache.solr.client.solrj.embedded.JettySolrRunner$DebugFilter.doFilter(JettySolrRunner.java:189)
	at app//org.eclipse.jetty.servlet.FilterHolder.doFilter(FilterHolder.java:193)
	at app//org.eclipse.jetty.servlet.ServletHandler$Chain.doFilter(ServletHandler.java:1601)
	at app//org.eclipse.jetty.servlet.ServletHandler.doHandle(ServletHandler.java:548)
	at app//org.eclipse.jetty.server.handler.ScopedHandler.nextHandle(ScopedHandler.java:233)
	at app//org.eclipse.jetty.server.session.SessionHandler.doHandle(SessionHandler.java:1624)
	at app//org.eclipse.jetty.server.handler.ScopedHandler.nextHandle(ScopedHandler.java:233)
	at app//org.eclipse.jetty.server.handler.ContextHandler.doHandle(ContextHandler.java:1434)
	at app//org.eclipse.jetty.server.handler.ScopedHandler.nextScope(ScopedHandler.java:188)
	at app//org.eclipse.jetty.servlet.ServletHandler.doScope(ServletHandler.java:501)
	at app//org.eclipse.jetty.server.session.SessionHandler.doScope(SessionHandler.java:1594)
	at app//org.eclipse.jetty.server.handler.ScopedHandler.nextScope(ScopedHandler.java:186)
	at app//org.eclipse.jetty.server.handler.ContextHandler.doScope(ContextHandler.java:1349)
	at app//org.eclipse.jetty.server.handler.ScopedHandler.handle(ScopedHandler.java:141)
	at app//org.eclipse.jetty.server.handler.HandlerWrapper.handle(HandlerWrapper.java:127)
	at app//org.eclipse.jetty.rewrite.handler.RewriteHandler.handle(RewriteHandler.java:322)
	at app//org.eclipse.jetty.server.handler.gzip.GzipHandler.handle(GzipHandler.java:713)
	at app//org.eclipse.jetty.server.handler.HandlerWrapper.handle(HandlerWrapper.java:127)
	at app//org.eclipse.jetty.server.Server.handle(Server.java:516)
	at app//org.eclipse.jetty.server.HttpChannel.lambda$handle$1(HttpChannel.java:400)
	at app//org.eclipse.jetty.server.HttpChannel.dispatch(HttpChannel.java:645)
	at app//org.eclipse.jetty.server.HttpChannel.handle(HttpChannel.java:392)
	at app//org.eclipse.jetty.server.HttpChannel.run(HttpChannel.java:352)
	at app//org.eclipse.jetty.util.thread.QueuedThreadPool.runJob(QueuedThreadPool.java:883)
	at app//org.eclipse.jetty.util.thread.QueuedThreadPool$Runner.run(QueuedThreadPool.java:1034)
	at java.base@11.0.12/java.lang.Thread.run(Thread.java:834)
Caused by: java.lang.AssertionError: Directory not closed: MockDirectoryWrapper(ByteBuffersDirectory@61e217d4 lockFactory=org.apache.lucene.store.SingleInstanceLockFactory@282dac99)
	at org.junit.Assert.fail(Assert.java:89)
	at org.apache.lucene.util.CloseableDirectory.close(CloseableDirectory.java:43)
	at com.carrotsearch.randomizedtesting.RandomizedRunner$4$1.apply(RandomizedRunner.java:788)
	at com.carrotsearch.randomizedtesting.RandomizedRunner$4$1.apply(RandomizedRunner.java:785)
	at com.carrotsearch.randomizedtesting.RandomizedContext.closeResources(RandomizedContext.java:225)
	at com.carrotsearch.randomizedtesting.RandomizedRunner$4.afterAlways(RandomizedRunner.java:801)
	at com.carrotsearch.randomizedtesting.rules.StatementAdapter.evaluate(StatementAdapter.java:43)
	at com.carrotsearch.randomizedtesting.ThreadLeakControl$StatementRunner.run(ThreadLeakControl.java:370)
	at com.carrotsearch.randomizedtesting.ThreadLeakControl.lambda$forkTimeoutingTask$0(ThreadLeakControl.java:826)
	... 1 more


FAILED:  org.apache.solr.schema.PreAnalyzedFieldManagedSchemaCloudTest.classMethod

Error Message:
com.carrotsearch.randomizedtesting.ThreadLeakError: 2 threads leaked from SUITE scope at org.apache.solr.schema.PreAnalyzedFieldManagedSchemaCloudTest: 
   1) Thread[id=25026, name=searcherExecutor-16436-thread-1-processing-127.0.0.1:44541_solr managed-preanalyzed_shard2_replica_n1 managed-preanalyzed shard2 core_node3, state=WAITING, group=TGRP-PreAnalyzedFieldManagedSchemaCloudTest]
        at java.base@11.0.12/jdk.internal.misc.Unsafe.park(Native Method)
        at java.base@11.0.12/java.util.concurrent.locks.LockSupport.park(LockSupport.java:194)
        at java.base@11.0.12/java.util.concurrent.locks.AbstractQueuedSynchronizer.parkAndCheckInterrupt(AbstractQueuedSynchronizer.java:885)
        at java.base@11.0.12/java.util.concurrent.locks.AbstractQueuedSynchronizer.doAcquireSharedInterruptibly(AbstractQueuedSynchronizer.java:1039)
        at java.base@11.0.12/java.util.concurrent.locks.AbstractQueuedSynchronizer.acquireSharedInterruptibly(AbstractQueuedSynchronizer.java:1345)
        at java.base@11.0.12/java.util.concurrent.CountDownLatch.await(CountDownLatch.java:232)
        at app//org.apache.solr.core.SolrCore.lambda$new$2(SolrCore.java:1048)
        at app//org.apache.solr.core.SolrCore$$Lambda$417/0x000000010065ec40.call(Unknown Source)
        at java.base@11.0.12/java.util.concurrent.FutureTask.run(FutureTask.java:264)
        at app//org.apache.solr.common.util.ExecutorUtil$MDCAwareThreadPoolExecutor.lambda$execute$0(ExecutorUtil.java:235)
        at app//org.apache.solr.common.util.ExecutorUtil$MDCAwareThreadPoolExecutor$$Lambda$279/0x000000010050c040.run(Unknown Source)
        at java.base@11.0.12/java.util.concurrent.ThreadPoolExecutor.runWorker(ThreadPoolExecutor.java:1128)
        at java.base@11.0.12/java.util.concurrent.ThreadPoolExecutor$Worker.run(ThreadPoolExecutor.java:628)
        at java.base@11.0.12/java.lang.Thread.run(Thread.java:834)
   2) Thread[id=25005, name=ZKEventListenerThread, state=TIMED_WAITING, group=TGRP-PreAnalyzedFieldManagedSchemaCloudTest]
        at java.base@11.0.12/java.lang.Thread.sleep(Native Method)
        at app//org.apache.solr.common.cloud.ZkCmdExecutor.retryDelay(ZkCmdExecutor.java:156)
        at app//org.apache.solr.common.cloud.ZkCmdExecutor.retryOperation(ZkCmdExecutor.java:89)
        at app//org.apache.solr.common.cloud.SolrZkClient.exists(SolrZkClient.java:306)
        at app//org.apache.solr.rest.ManagedResourceStorage$ZooKeeperStorageIO.configure(ManagedResourceStorage.java:232)
        at app//org.apache.solr.rest.ManagedResourceStorage.newStorageIO(ManagedResourceStorage.java:144)
        at app//org.apache.solr.core.SolrCore.initRestManager(SolrCore.java:2963)
        at app//org.apache.solr.core.SolrCore.<init>(SolrCore.java:1057)
        at app//org.apache.solr.core.SolrCore.reload(SolrCore.java:744)
        at app//org.apache.solr.core.CoreContainer.reload(CoreContainer.java:1696)
        at app//org.apache.solr.core.SolrCore.lambda$getConfListener$21(SolrCore.java:3129)
        at app//org.apache.solr.core.SolrCore$$Lambda$1071/0x0000000100b3d840.run(Unknown Source)
        at app//org.apache.solr.cloud.ZkController.lambda$fireEventListeners$18(ZkController.java:2491)
        at app//org.apache.solr.cloud.ZkController$$Lambda$2043/0x0000000101109440.run(Unknown Source)
        at java.base@11.0.12/java.lang.Thread.run(Thread.java:834)

Stack Trace:
com.carrotsearch.randomizedtesting.ThreadLeakError: 2 threads leaked from SUITE scope at org.apache.solr.schema.PreAnalyzedFieldManagedSchemaCloudTest: 
   1) Thread[id=25026, name=searcherExecutor-16436-thread-1-processing-127.0.0.1:44541_solr managed-preanalyzed_shard2_replica_n1 managed-preanalyzed shard2 core_node3, state=WAITING, group=TGRP-PreAnalyzedFieldManagedSchemaCloudTest]
        at java.base@11.0.12/jdk.internal.misc.Unsafe.park(Native Method)
        at java.base@11.0.12/java.util.concurrent.locks.LockSupport.park(LockSupport.java:194)
        at java.base@11.0.12/java.util.concurrent.locks.AbstractQueuedSynchronizer.parkAndCheckInterrupt(AbstractQueuedSynchronizer.java:885)
        at java.base@11.0.12/java.util.concurrent.locks.AbstractQueuedSynchronizer.doAcquireSharedInterruptibly(AbstractQueuedSynchronizer.java:1039)
        at java.base@11.0.12/java.util.concurrent.locks.AbstractQueuedSynchronizer.acquireSharedInterruptibly(AbstractQueuedSynchronizer.java:1345)
        at java.base@11.0.12/java.util.concurrent.CountDownLatch.await(CountDownLatch.java:232)
        at app//org.apache.solr.core.SolrCore.lambda$new$2(SolrCore.java:1048)
        at app//org.apache.solr.core.SolrCore$$Lambda$417/0x000000010065ec40.call(Unknown Source)
        at java.base@11.0.12/java.util.concurrent.FutureTask.run(FutureTask.java:264)
        at app//org.apache.solr.common.util.ExecutorUtil$MDCAwareThreadPoolExecutor.lambda$execute$0(ExecutorUtil.java:235)
        at app//org.apache.solr.common.util.ExecutorUtil$MDCAwareThreadPoolExecutor$$Lambda$279/0x000000010050c040.run(Unknown Source)
        at java.base@11.0.12/java.util.concurrent.ThreadPoolExecutor.runWorker(ThreadPoolExecutor.java:1128)
        at java.base@11.0.12/java.util.concurrent.ThreadPoolExecutor$Worker.run(ThreadPoolExecutor.java:628)
        at java.base@11.0.12/java.lang.Thread.run(Thread.java:834)
   2) Thread[id=25005, name=ZKEventListenerThread, state=TIMED_WAITING, group=TGRP-PreAnalyzedFieldManagedSchemaCloudTest]
        at java.base@11.0.12/java.lang.Thread.sleep(Native Method)
        at app//org.apache.solr.common.cloud.ZkCmdExecutor.retryDelay(ZkCmdExecutor.java:156)
        at app//org.apache.solr.common.cloud.ZkCmdExecutor.retryOperation(ZkCmdExecutor.java:89)
        at app//org.apache.solr.common.cloud.SolrZkClient.exists(SolrZkClient.java:306)
        at app//org.apache.solr.rest.ManagedResourceStorage$ZooKeeperStorageIO.configure(ManagedResourceStorage.java:232)
        at app//org.apache.solr.rest.ManagedResourceStorage.newStorageIO(ManagedResourceStorage.java:144)
        at app//org.apache.solr.core.SolrCore.initRestManager(SolrCore.java:2963)
        at app//org.apache.solr.core.SolrCore.<init>(SolrCore.java:1057)
        at app//org.apache.solr.core.SolrCore.reload(SolrCore.java:744)
        at app//org.apache.solr.core.CoreContainer.reload(CoreContainer.java:1696)
        at app//org.apache.solr.core.SolrCore.lambda$getConfListener$21(SolrCore.java:3129)
        at app//org.apache.solr.core.SolrCore$$Lambda$1071/0x0000000100b3d840.run(Unknown Source)
        at app//org.apache.solr.cloud.ZkController.lambda$fireEventListeners$18(ZkController.java:2491)
        at app//org.apache.solr.cloud.ZkController$$Lambda$2043/0x0000000101109440.run(Unknown Source)
        at java.base@11.0.12/java.lang.Thread.run(Thread.java:834)
	at __randomizedtesting.SeedInfo.seed([E1075726E8A0886B]:0)




Build Log:
[...truncated 1957 lines...]
ERROR: The following test(s) have failed:
  - org.apache.solr.schema.PreAnalyzedFieldManagedSchemaCloudTest.classMethod (:solr:core)
    Test output: /home/jenkins/jenkins-slave/workspace/Solr/Solr-Check-9.x/solr/core/build/test-results/test/outputs/OUTPUT-org.apache.solr.schema.PreAnalyzedFieldManagedSchemaCloudTest.txt
    Reproduce with: gradlew :solr:core:test --tests "org.apache.solr.schema.PreAnalyzedFieldManagedSchemaCloudTest.classMethod" -Ptests.jvms=4 -Ptests.haltonfailure=false -Ptests.jvmargs=-XX:TieredStopAtLevel=1 -Ptests.seed=E1075726E8A0886B -Ptests.multiplier=2 -Ptests.badapples=false -Ptests.file.encoding=ISO-8859-1

  - org.apache.solr.schema.PreAnalyzedFieldManagedSchemaCloudTest.classMethod (:solr:core)
    Test output: /home/jenkins/jenkins-slave/workspace/Solr/Solr-Check-9.x/solr/core/build/test-results/test/outputs/OUTPUT-org.apache.solr.schema.PreAnalyzedFieldManagedSchemaCloudTest.txt
    Reproduce with: gradlew :solr:core:test --tests "org.apache.solr.schema.PreAnalyzedFieldManagedSchemaCloudTest.classMethod" -Ptests.jvms=4 -Ptests.haltonfailure=false -Ptests.jvmargs=-XX:TieredStopAtLevel=1 -Ptests.seed=E1075726E8A0886B -Ptests.multiplier=2 -Ptests.badapples=false -Ptests.file.encoding=ISO-8859-1

  - org.apache.solr.schema.PreAnalyzedFieldManagedSchemaCloudTest.classMethod (:solr:core)
    Test output: /home/jenkins/jenkins-slave/workspace/Solr/Solr-Check-9.x/solr/core/build/test-results/test/outputs/OUTPUT-org.apache.solr.schema.PreAnalyzedFieldManagedSchemaCloudTest.txt
    Reproduce with: gradlew :solr:core:test --tests "org.apache.solr.schema.PreAnalyzedFieldManagedSchemaCloudTest.classMethod" -Ptests.jvms=4 -Ptests.haltonfailure=false -Ptests.jvmargs=-XX:TieredStopAtLevel=1 -Ptests.seed=E1075726E8A0886B -Ptests.multiplier=2 -Ptests.badapples=false -Ptests.file.encoding=ISO-8859-1

  - org.apache.solr.schema.PreAnalyzedFieldManagedSchemaCloudTest.classMethod (:solr:core)
    Test output: /home/jenkins/jenkins-slave/workspace/Solr/Solr-Check-9.x/solr/core/build/test-results/test/outputs/OUTPUT-org.apache.solr.schema.PreAnalyzedFieldManagedSchemaCloudTest.txt
    Reproduce with: gradlew :solr:core:test --tests "org.apache.solr.schema.PreAnalyzedFieldManagedSchemaCloudTest.classMethod" -Ptests.jvms=4 -Ptests.haltonfailure=false -Ptests.jvmargs=-XX:TieredStopAtLevel=1 -Ptests.seed=E1075726E8A0886B -Ptests.multiplier=2 -Ptests.badapples=false -Ptests.file.encoding=ISO-8859-1


Deprecated Gradle features were used in this build, making it incompatible with Gradle 8.0.

You can use '--warning-mode all' to show the individual deprecation warnings and determine if they come from your own scripts or plugins.

See https://docs.gradle.org/7.2/userguide/command_line_interface.html#sec:command_line_warnings

BUILD SUCCESSFUL in 53m 42s
433 actionable tasks: 433 executed
Build step 'Invoke Gradle script' changed build result to SUCCESS
Archiving artifacts
java.lang.InterruptedException: no matches found within 10000
	at hudson.FilePath$ValidateAntFileMask.hasMatch(FilePath.java:3069)
	at hudson.FilePath$ValidateAntFileMask.invoke(FilePath.java:2948)
	at hudson.FilePath$ValidateAntFileMask.invoke(FilePath.java:2929)
	at hudson.FilePath$FileCallableWrapper.call(FilePath.java:3317)
Also:   hudson.remoting.Channel$CallSiteStackTrace: Remote call to lucene-solr-2
		at hudson.remoting.Channel.attachCallSiteStackTrace(Channel.java:1800)
		at hudson.remoting.UserRequest$ExceptionResponse.retrieve(UserRequest.java:356)
		at hudson.remoting.Channel.call(Channel.java:1001)
		at hudson.FilePath.act(FilePath.java:1159)
		at hudson.FilePath.act(FilePath.java:1148)
		at hudson.FilePath.validateAntFileMask(FilePath.java:2927)
		at hudson.tasks.ArtifactArchiver.perform(ArtifactArchiver.java:270)
		at hudson.tasks.BuildStepCompatibilityLayer.perform(BuildStepCompatibilityLayer.java:80)
		at hudson.tasks.BuildStepMonitor$1.perform(BuildStepMonitor.java:20)
		at hudson.model.AbstractBuild$AbstractBuildExecution.perform(AbstractBuild.java:803)
		at hudson.model.AbstractBuild$AbstractBuildExecution.performAllBuildSteps(AbstractBuild.java:752)
		at hudson.model.Build$BuildExecution.post2(Build.java:177)
		at hudson.model.AbstractBuild$AbstractBuildExecution.post(AbstractBuild.java:697)
		at hudson.model.Run.execute(Run.java:1931)
		at hudson.model.FreeStyleBuild.run(FreeStyleBuild.java:43)
		at hudson.model.ResourceController.execute(ResourceController.java:97)
		at hudson.model.Executor.run(Executor.java:429)
Caused: hudson.FilePath$TunneledInterruptedException
	at hudson.FilePath$FileCallableWrapper.call(FilePath.java:3319)
	at hudson.remoting.UserRequest.perform(UserRequest.java:211)
	at hudson.remoting.UserRequest.perform(UserRequest.java:54)
	at hudson.remoting.Request$2.run(Request.java:376)
	at hudson.remoting.InterceptingExecutorService.lambda$wrap$0(InterceptingExecutorService.java:78)
	at java.util.concurrent.FutureTask.run(FutureTask.java:266)
	at java.util.concurrent.ThreadPoolExecutor.runWorker(ThreadPoolExecutor.java:1149)
	at java.util.concurrent.ThreadPoolExecutor$Worker.run(ThreadPoolExecutor.java:624)
	at java.lang.Thread.run(Thread.java:748)
Caused: java.lang.InterruptedException: java.lang.InterruptedException: no matches found within 10000
	at hudson.FilePath.act(FilePath.java:1161)
	at hudson.FilePath.act(FilePath.java:1148)
	at hudson.FilePath.validateAntFileMask(FilePath.java:2927)
	at hudson.tasks.ArtifactArchiver.perform(ArtifactArchiver.java:270)
	at hudson.tasks.BuildStepCompatibilityLayer.perform(BuildStepCompatibilityLayer.java:80)
	at hudson.tasks.BuildStepMonitor$1.perform(BuildStepMonitor.java:20)
	at hudson.model.AbstractBuild$AbstractBuildExecution.perform(AbstractBuild.java:803)
	at hudson.model.AbstractBuild$AbstractBuildExecution.performAllBuildSteps(AbstractBuild.java:752)
	at hudson.model.Build$BuildExecution.post2(Build.java:177)
	at hudson.model.AbstractBuild$AbstractBuildExecution.post(AbstractBuild.java:697)
	at hudson.model.Run.execute(Run.java:1931)
	at hudson.model.FreeStyleBuild.run(FreeStyleBuild.java:43)
	at hudson.model.ResourceController.execute(ResourceController.java:97)
	at hudson.model.Executor.run(Executor.java:429)
No artifacts found that match the file pattern "**/*.events,heapdumps/**,**/hs_err_pid*". Configuration error?
Recording test results
[Checks API] No suitable checks publisher found.
Build step 'Publish JUnit test result report' changed build result to UNSTABLE
Email was triggered for: Unstable (Test Failures)
Sending email for trigger: Unstable (Test Failures)

[JENKINS] Solr » Solr-Check-9.x - Build # 185 - Still Unstable!

Posted by Apache Jenkins Server <je...@builds.apache.org>.
Build: https://ci-builds.apache.org/job/Solr/job/Solr-Check-9.x/185/

1 tests failed.
FAILED:  org.apache.solr.cloud.TestLeaderElectionZkExpiry.classMethod

Error Message:
com.carrotsearch.randomizedtesting.ThreadLeakError: 2 threads leaked from SUITE scope at org.apache.solr.cloud.TestLeaderElectionZkExpiry: 
   1) Thread[id=6819, name=zkConnectionManagerCallback-3329-thread-1-EventThread, state=WAITING, group=TGRP-TestLeaderElectionZkExpiry]
        at java.base@11.0.12/java.lang.Object.wait(Native Method)
        at java.base@11.0.12/java.lang.Object.wait(Object.java:328)
        at app//org.apache.zookeeper.ClientCnxn.submitRequest(ClientCnxn.java:1584)
        at app//org.apache.zookeeper.ClientCnxn.submitRequest(ClientCnxn.java:1556)
        at app//org.apache.zookeeper.ClientCnxn.close(ClientCnxn.java:1523)
        at app//org.apache.zookeeper.ZooKeeper.close(ZooKeeper.java:1227)
        at app//org.apache.solr.common.cloud.SolrZooKeeper.close(SolrZooKeeper.java:97)
        at app//org.apache.solr.common.cloud.SolrZkClient.updateKeeper(SolrZkClient.java:668)
        at app//org.apache.solr.common.cloud.ConnectionManager$1.update(ConnectionManager.java:161)
        at app//org.apache.solr.common.cloud.DefaultConnectionStrategy.reconnect(DefaultConnectionStrategy.java:57)
        at app//org.apache.solr.common.cloud.ConnectionManager.process(ConnectionManager.java:152)
        at app//org.apache.zookeeper.ClientCnxn$EventThread.processEvent(ClientCnxn.java:580)
        at app//org.apache.zookeeper.ClientCnxn$EventThread.run(ClientCnxn.java:555)
   2) Thread[id=6823, name=zkConnectionManagerCallback-3329-thread-1-EventThread, state=WAITING, group=TGRP-TestLeaderElectionZkExpiry]
        at java.base@11.0.12/jdk.internal.misc.Unsafe.park(Native Method)
        at java.base@11.0.12/java.util.concurrent.locks.LockSupport.park(LockSupport.java:194)
        at java.base@11.0.12/java.util.concurrent.locks.AbstractQueuedSynchronizer$ConditionObject.await(AbstractQueuedSynchronizer.java:2081)
        at java.base@11.0.12/java.util.concurrent.LinkedBlockingQueue.take(LinkedBlockingQueue.java:433)
        at app//org.apache.zookeeper.ClientCnxn$EventThread.run(ClientCnxn.java:551)

Stack Trace:
com.carrotsearch.randomizedtesting.ThreadLeakError: 2 threads leaked from SUITE scope at org.apache.solr.cloud.TestLeaderElectionZkExpiry: 
   1) Thread[id=6819, name=zkConnectionManagerCallback-3329-thread-1-EventThread, state=WAITING, group=TGRP-TestLeaderElectionZkExpiry]
        at java.base@11.0.12/java.lang.Object.wait(Native Method)
        at java.base@11.0.12/java.lang.Object.wait(Object.java:328)
        at app//org.apache.zookeeper.ClientCnxn.submitRequest(ClientCnxn.java:1584)
        at app//org.apache.zookeeper.ClientCnxn.submitRequest(ClientCnxn.java:1556)
        at app//org.apache.zookeeper.ClientCnxn.close(ClientCnxn.java:1523)
        at app//org.apache.zookeeper.ZooKeeper.close(ZooKeeper.java:1227)
        at app//org.apache.solr.common.cloud.SolrZooKeeper.close(SolrZooKeeper.java:97)
        at app//org.apache.solr.common.cloud.SolrZkClient.updateKeeper(SolrZkClient.java:668)
        at app//org.apache.solr.common.cloud.ConnectionManager$1.update(ConnectionManager.java:161)
        at app//org.apache.solr.common.cloud.DefaultConnectionStrategy.reconnect(DefaultConnectionStrategy.java:57)
        at app//org.apache.solr.common.cloud.ConnectionManager.process(ConnectionManager.java:152)
        at app//org.apache.zookeeper.ClientCnxn$EventThread.processEvent(ClientCnxn.java:580)
        at app//org.apache.zookeeper.ClientCnxn$EventThread.run(ClientCnxn.java:555)
   2) Thread[id=6823, name=zkConnectionManagerCallback-3329-thread-1-EventThread, state=WAITING, group=TGRP-TestLeaderElectionZkExpiry]
        at java.base@11.0.12/jdk.internal.misc.Unsafe.park(Native Method)
        at java.base@11.0.12/java.util.concurrent.locks.LockSupport.park(LockSupport.java:194)
        at java.base@11.0.12/java.util.concurrent.locks.AbstractQueuedSynchronizer$ConditionObject.await(AbstractQueuedSynchronizer.java:2081)
        at java.base@11.0.12/java.util.concurrent.LinkedBlockingQueue.take(LinkedBlockingQueue.java:433)
        at app//org.apache.zookeeper.ClientCnxn$EventThread.run(ClientCnxn.java:551)
	at __randomizedtesting.SeedInfo.seed([CAB855AB532C1EF0]:0)




Build Log:
[...truncated 1870 lines...]
ERROR: The following test(s) have failed:
  - org.apache.solr.cloud.TestLeaderElectionZkExpiry.classMethod (:solr:core)
    Test output: /home/jenkins/jenkins-slave/workspace/Solr/Solr-Check-9.x/solr/core/build/test-results/test/outputs/OUTPUT-org.apache.solr.cloud.TestLeaderElectionZkExpiry.txt
    Reproduce with: gradlew :solr:core:test --tests "org.apache.solr.cloud.TestLeaderElectionZkExpiry.classMethod" -Ptests.jvms=4 -Ptests.haltonfailure=false -Ptests.jvmargs=-XX:TieredStopAtLevel=1 -Ptests.seed=CAB855AB532C1EF0 -Ptests.multiplier=2 -Ptests.badapples=false -Ptests.file.encoding=UTF-8


Deprecated Gradle features were used in this build, making it incompatible with Gradle 8.0.

You can use '--warning-mode all' to show the individual deprecation warnings and determine if they come from your own scripts or plugins.

See https://docs.gradle.org/7.2/userguide/command_line_interface.html#sec:command_line_warnings

BUILD SUCCESSFUL in 54m 26s
433 actionable tasks: 433 executed
Build step 'Invoke Gradle script' changed build result to SUCCESS
Archiving artifacts
java.lang.InterruptedException: no matches found within 10000
	at hudson.FilePath$ValidateAntFileMask.hasMatch(FilePath.java:3069)
	at hudson.FilePath$ValidateAntFileMask.invoke(FilePath.java:2948)
	at hudson.FilePath$ValidateAntFileMask.invoke(FilePath.java:2929)
	at hudson.FilePath$FileCallableWrapper.call(FilePath.java:3317)
Also:   hudson.remoting.Channel$CallSiteStackTrace: Remote call to lucene-solr-1
		at hudson.remoting.Channel.attachCallSiteStackTrace(Channel.java:1800)
		at hudson.remoting.UserRequest$ExceptionResponse.retrieve(UserRequest.java:356)
		at hudson.remoting.Channel.call(Channel.java:1001)
		at hudson.FilePath.act(FilePath.java:1159)
		at hudson.FilePath.act(FilePath.java:1148)
		at hudson.FilePath.validateAntFileMask(FilePath.java:2927)
		at hudson.tasks.ArtifactArchiver.perform(ArtifactArchiver.java:270)
		at hudson.tasks.BuildStepCompatibilityLayer.perform(BuildStepCompatibilityLayer.java:80)
		at hudson.tasks.BuildStepMonitor$1.perform(BuildStepMonitor.java:20)
		at hudson.model.AbstractBuild$AbstractBuildExecution.perform(AbstractBuild.java:803)
		at hudson.model.AbstractBuild$AbstractBuildExecution.performAllBuildSteps(AbstractBuild.java:752)
		at hudson.model.Build$BuildExecution.post2(Build.java:177)
		at hudson.model.AbstractBuild$AbstractBuildExecution.post(AbstractBuild.java:697)
		at hudson.model.Run.execute(Run.java:1931)
		at hudson.model.FreeStyleBuild.run(FreeStyleBuild.java:43)
		at hudson.model.ResourceController.execute(ResourceController.java:97)
		at hudson.model.Executor.run(Executor.java:429)
Caused: hudson.FilePath$TunneledInterruptedException
	at hudson.FilePath$FileCallableWrapper.call(FilePath.java:3319)
	at hudson.remoting.UserRequest.perform(UserRequest.java:211)
	at hudson.remoting.UserRequest.perform(UserRequest.java:54)
	at hudson.remoting.Request$2.run(Request.java:376)
	at hudson.remoting.InterceptingExecutorService.lambda$wrap$0(InterceptingExecutorService.java:78)
	at java.util.concurrent.FutureTask.run(FutureTask.java:266)
	at java.util.concurrent.ThreadPoolExecutor.runWorker(ThreadPoolExecutor.java:1149)
	at java.util.concurrent.ThreadPoolExecutor$Worker.run(ThreadPoolExecutor.java:624)
	at java.lang.Thread.run(Thread.java:748)
Caused: java.lang.InterruptedException: java.lang.InterruptedException: no matches found within 10000
	at hudson.FilePath.act(FilePath.java:1161)
	at hudson.FilePath.act(FilePath.java:1148)
	at hudson.FilePath.validateAntFileMask(FilePath.java:2927)
	at hudson.tasks.ArtifactArchiver.perform(ArtifactArchiver.java:270)
	at hudson.tasks.BuildStepCompatibilityLayer.perform(BuildStepCompatibilityLayer.java:80)
	at hudson.tasks.BuildStepMonitor$1.perform(BuildStepMonitor.java:20)
	at hudson.model.AbstractBuild$AbstractBuildExecution.perform(AbstractBuild.java:803)
	at hudson.model.AbstractBuild$AbstractBuildExecution.performAllBuildSteps(AbstractBuild.java:752)
	at hudson.model.Build$BuildExecution.post2(Build.java:177)
	at hudson.model.AbstractBuild$AbstractBuildExecution.post(AbstractBuild.java:697)
	at hudson.model.Run.execute(Run.java:1931)
	at hudson.model.FreeStyleBuild.run(FreeStyleBuild.java:43)
	at hudson.model.ResourceController.execute(ResourceController.java:97)
	at hudson.model.Executor.run(Executor.java:429)
No artifacts found that match the file pattern "**/*.events,heapdumps/**,**/hs_err_pid*". Configuration error?
Recording test results
[Checks API] No suitable checks publisher found.
Build step 'Publish JUnit test result report' changed build result to UNSTABLE
Email was triggered for: Unstable (Test Failures)
Sending email for trigger: Unstable (Test Failures)