You are viewing a plain text version of this content. The canonical link for it is here.
Posted to builds@beam.apache.org by Apache Jenkins Server <je...@builds.apache.org> on 2022/08/10 22:22:11 UTC
Build failed in Jenkins: beam_PerformanceTests_TextIOIT #6693
See <https://ci-beam.apache.org/job/beam_PerformanceTests_TextIOIT/6693/display/redirect?page=changes>
Changes:
[noreply] Clean up checkstyle suppressions.xml (#22649)
[noreply] [Playground] [Infrastructure] format python code style (#22291)
[noreply] Minor: Add helpful names for parameterized dataframe.schemas_test
[noreply] [BEAM-14118, #21639] Use vendored gRPC 1.48.1 (#22628)
[Ismaël Mejía] Fix #22466 Add github actions dependency updates with dependabot
[noreply] Change Python PostCommits timeout (#22655)
[noreply] Revert "Persist ghprbPullId parameter in seed job (#22579)" (#22656)
[noreply] Bump actions/setup-java from 2 to 3 (#22666)
[noreply] Bump actions/labeler from 3 to 4 (#22670)
[noreply] Bump actions/setup-node from 2 to 3 (#22671)
[noreply] Bump actions/setup-go from 2 to 3 (#22669)
[noreply] Bump actions/setup-python from 2 to 4 (#22668)
[noreply] Bump actions/checkout from 2 to 3 (#22667)
[noreply] Fix broken link to Retry Policy blog (#22554)
[noreply] Include total in header of issue report (#22475)
------------------------------------------
[...truncated 276.14 KB...]
Task ':sdks:java:extensions:protobuf:generateTestProto' is not up-to-date because:
No history is available.
Loaded cache entry for task ':sdks:java:extensions:protobuf:generateTestProto' with cache key c2fa3d3569fd35e8e591a329fdba3364
:sdks:java:extensions:protobuf:generateTestProto (Thread[Execution **** for ':' Thread 4,5,main]) completed. Took 0.022 secs.
:runners:google-cloud-dataflow-java:jar (Thread[Execution **** for ':' Thread 7,5,main]) started.
:sdks:java:extensions:protobuf:compileTestJava (Thread[Execution **** for ':' Thread 4,5,main]) started.
This JVM does not support getting OS memory, so no OS memory status updates will be broadcast
> Task :runners:google-cloud-dataflow-java:jar
Caching disabled for task ':runners:google-cloud-dataflow-java:jar' because:
Not worth caching
Task ':runners:google-cloud-dataflow-java:jar' is not up-to-date because:
No history is available.
:runners:google-cloud-dataflow-java:jar (Thread[Execution **** for ':' Thread 7,5,main]) completed. Took 0.076 secs.
:runners:google-cloud-dataflow-java:****:legacy-****:compileJava (Thread[Execution **** for ':' Thread 7,5,main]) started.
> Task :runners:direct-java:shadowTestJar FROM-CACHE
Build cache key for task ':runners:direct-java:shadowTestJar' is c0788384badb66cdc342130a932455c7
Task ':runners:direct-java:shadowTestJar' is not up-to-date because:
No history is available.
Loaded cache entry for task ':runners:direct-java:shadowTestJar' with cache key c0788384badb66cdc342130a932455c7
:runners:direct-java:shadowTestJar (Thread[included builds,5,main]) completed. Took 0.272 secs.
> Task :sdks:java:extensions:protobuf:compileTestJava FROM-CACHE
Custom actions are attached to task ':sdks:java:extensions:protobuf:compileTestJava'.
Build cache key for task ':sdks:java:extensions:protobuf:compileTestJava' is ec3c49dcb4b98ec14480f7ca021494b9
Task ':sdks:java:extensions:protobuf:compileTestJava' is not up-to-date because:
No history is available.
Loaded cache entry for task ':sdks:java:extensions:protobuf:compileTestJava' with cache key ec3c49dcb4b98ec14480f7ca021494b9
:sdks:java:extensions:protobuf:compileTestJava (Thread[Execution **** for ':' Thread 4,5,main]) completed. Took 0.145 secs.
:sdks:java:extensions:protobuf:testClasses (Thread[Execution **** for ':' Thread 4,5,main]) started.
> Task :sdks:java:extensions:protobuf:testClasses
Skipping task ':sdks:java:extensions:protobuf:testClasses' as it has no actions.
:sdks:java:extensions:protobuf:testClasses (Thread[Execution **** for ':' Thread 4,5,main]) completed. Took 0.0 secs.
:sdks:java:extensions:protobuf:testJar (Thread[Execution **** for ':' Thread 4,5,main]) started.
> Task :sdks:java:extensions:protobuf:testJar
Caching disabled for task ':sdks:java:extensions:protobuf:testJar' because:
Not worth caching
Task ':sdks:java:extensions:protobuf:testJar' is not up-to-date because:
No history is available.
:sdks:java:extensions:protobuf:testJar (Thread[Execution **** for ':' Thread 4,5,main]) completed. Took 0.095 secs.
:sdks:java:io:google-cloud-platform:compileTestJava (Thread[Execution **** for ':' Thread 4,5,main]) started.
> Task :runners:google-cloud-dataflow-java:****:legacy-****:compileJava FROM-CACHE
Custom actions are attached to task ':runners:google-cloud-dataflow-java:****:legacy-****:compileJava'.
Build cache key for task ':runners:google-cloud-dataflow-java:****:legacy-****:compileJava' is 15a63907717802bf62123244fb4323a0
Task ':runners:google-cloud-dataflow-java:****:legacy-****:compileJava' is not up-to-date because:
No history is available.
Loaded cache entry for task ':runners:google-cloud-dataflow-java:****:legacy-****:compileJava' with cache key 15a63907717802bf62123244fb4323a0
:runners:google-cloud-dataflow-java:****:legacy-****:compileJava (Thread[Execution **** for ':' Thread 7,5,main]) completed. Took 0.47 secs.
:runners:google-cloud-dataflow-java:****:legacy-****:classes (Thread[Execution **** for ':' Thread 7,5,main]) started.
> Task :runners:google-cloud-dataflow-java:****:legacy-****:classes UP-TO-DATE
Skipping task ':runners:google-cloud-dataflow-java:****:legacy-****:classes' as it has no actions.
:runners:google-cloud-dataflow-java:****:legacy-****:classes (Thread[Execution **** for ':' Thread 7,5,main]) completed. Took 0.0 secs.
:runners:google-cloud-dataflow-java:****:legacy-****:shadowJar (Thread[Execution **** for ':' Thread 7,5,main]) started.
> Task :sdks:java:io:parquet:compileTestJava
Custom actions are attached to task ':sdks:java:io:parquet:compileTestJava'.
Build cache key for task ':sdks:java:io:parquet:compileTestJava' is 18697ed1fdca33e67f31b3dd0227f4b7
Task ':sdks:java:io:parquet:compileTestJava' is not up-to-date because:
No history is available.
The input changes require a full rebuild for incremental task ':sdks:java:io:parquet:compileTestJava'.
Full recompilation is required because no incremental change information is available. This is usually caused by clean builds or changing compiler arguments.
Compiling with toolchain '/usr/lib/jvm/java-8-openjdk-amd64'.
Starting process 'Gradle Worker Daemon 2'. Working directory: /home/jenkins/.gradle/****s Command: /usr/lib/jvm/java-8-openjdk-amd64/bin/java -Djava.security.manager=****.org.gradle.process.internal.****.child.BootstrapSecurityManager -Xbootclasspath/p:/home/jenkins/.gradle/caches/modules-2/files-2.1/com.google.errorprone/javac/9+181-r4173-1/bdf4c0aa7d540ee1f7bf14d47447aea4bbf450c5/javac-9+181-r4173-1.jar -Xmx512m -Dfile.encoding=UTF-8 -Duser.country=US -Duser.language=en -Duser.variant -cp /home/jenkins/.gradle/caches/7.4/****Main/gradle-****.jar ****.org.gradle.process.internal.****.GradleWorkerMain 'Gradle Worker Daemon 2'
Successfully started process 'Gradle Worker Daemon 2'
Started Gradle **** daemon (0.687 secs) with fork options DaemonForkOptions{executable=/usr/lib/jvm/java-8-openjdk-amd64/bin/java, minHeapSize=null, maxHeapSize=null, jvmArgs=[-Xbootclasspath/p:/home/jenkins/.gradle/caches/modules-2/files-2.1/com.google.errorprone/javac/9+181-r4173-1/bdf4c0aa7d540ee1f7bf14d47447aea4bbf450c5/javac-9+181-r4173-1.jar], keepAliveMode=SESSION}.
Compiling with JDK Java compiler API.
> Task :runners:google-cloud-dataflow-java:****:legacy-****:shadowJar FROM-CACHE
Custom actions are attached to task ':runners:google-cloud-dataflow-java:****:legacy-****:shadowJar'.
Build cache key for task ':runners:google-cloud-dataflow-java:****:legacy-****:shadowJar' is 24c42b9c2561e6ddf3dcce8491c7e345
Task ':runners:google-cloud-dataflow-java:****:legacy-****:shadowJar' is not up-to-date because:
No history is available.
Loaded cache entry for task ':runners:google-cloud-dataflow-java:****:legacy-****:shadowJar' with cache key 24c42b9c2561e6ddf3dcce8491c7e345
:runners:google-cloud-dataflow-java:****:legacy-****:shadowJar (Thread[Execution **** for ':' Thread 7,5,main]) completed. Took 0.478 secs.
This JVM does not support getting OS memory, so no OS memory status updates will be broadcast
> Task :sdks:java:io:google-cloud-platform:compileTestJava
Custom actions are attached to task ':sdks:java:io:google-cloud-platform:compileTestJava'.
Build cache key for task ':sdks:java:io:google-cloud-platform:compileTestJava' is 4468980d35212cc0e86bb93338b69fd5
Task ':sdks:java:io:google-cloud-platform:compileTestJava' is not up-to-date because:
No history is available.
The input changes require a full rebuild for incremental task ':sdks:java:io:google-cloud-platform:compileTestJava'.
Full recompilation is required because no incremental change information is available. This is usually caused by clean builds or changing compiler arguments.
Compiling with toolchain '/usr/lib/jvm/java-8-openjdk-amd64'.
Starting process 'Gradle Worker Daemon 3'. Working directory: /home/jenkins/.gradle/****s Command: /usr/lib/jvm/java-8-openjdk-amd64/bin/java -Djava.security.manager=****.org.gradle.process.internal.****.child.BootstrapSecurityManager -Xbootclasspath/p:/home/jenkins/.gradle/caches/modules-2/files-2.1/com.google.errorprone/javac/9+181-r4173-1/bdf4c0aa7d540ee1f7bf14d47447aea4bbf450c5/javac-9+181-r4173-1.jar -Xmx512m -Dfile.encoding=UTF-8 -Duser.country=US -Duser.language=en -Duser.variant -cp /home/jenkins/.gradle/caches/7.4/****Main/gradle-****.jar ****.org.gradle.process.internal.****.GradleWorkerMain 'Gradle Worker Daemon 3'
Successfully started process 'Gradle Worker Daemon 3'
Started Gradle **** daemon (0.473 secs) with fork options DaemonForkOptions{executable=/usr/lib/jvm/java-8-openjdk-amd64/bin/java, minHeapSize=null, maxHeapSize=null, jvmArgs=[-Xbootclasspath/p:/home/jenkins/.gradle/caches/modules-2/files-2.1/com.google.errorprone/javac/9+181-r4173-1/bdf4c0aa7d540ee1f7bf14d47447aea4bbf450c5/javac-9+181-r4173-1.jar], keepAliveMode=SESSION}.
Compiling with JDK Java compiler API.
> Task :sdks:java:io:parquet:compileTestJava
Note: <https://ci-beam.apache.org/job/beam_PerformanceTests_TextIOIT/ws/src/sdks/java/io/parquet/src/test/java/org/apache/beam/sdk/io/parquet/ParquetIOTest.java> uses or overrides a deprecated API.
Note: Recompile with -Xlint:deprecation for details.
Class dependency analysis for incremental compilation took 0.09 secs.
Created classpath snapshot for incremental compilation in 0.583 secs.
Stored cache entry for task ':sdks:java:io:parquet:compileTestJava' with cache key 18697ed1fdca33e67f31b3dd0227f4b7
:sdks:java:io:parquet:compileTestJava (Thread[Execution **** for ':' Thread 6,5,main]) completed. Took 6.738 secs.
:sdks:java:io:parquet:testClasses (Thread[Execution **** for ':' Thread 6,5,main]) started.
> Task :sdks:java:io:parquet:testClasses
Skipping task ':sdks:java:io:parquet:testClasses' as it has no actions.
:sdks:java:io:parquet:testClasses (Thread[Execution **** for ':' Thread 6,5,main]) completed. Took 0.0 secs.
:sdks:java:io:parquet:testJar (Thread[Execution **** for ':' Thread 6,5,main]) started.
> Task :sdks:java:io:parquet:testJar
Caching disabled for task ':sdks:java:io:parquet:testJar' because:
Not worth caching
Task ':sdks:java:io:parquet:testJar' is not up-to-date because:
No history is available.
:sdks:java:io:parquet:testJar (Thread[Execution **** for ':' Thread 6,5,main]) completed. Took 0.009 secs.
> Task :sdks:java:io:google-cloud-platform:compileTestJava
<https://ci-beam.apache.org/job/beam_PerformanceTests_TextIOIT/ws/src/sdks/java/io/google-cloud-platform/src/test/java/org/apache/beam/sdk/io/gcp/spanner/SpannerTransformRegistrarTest.java>:39: error: package org.apache.beam.vendor.grpc.v1p43p2.com.google.protobuf does not exist
import org.apache.beam.vendor.grpc.v1p43p2.com.google.protobuf.InvalidProtocolBufferException;
^
<https://ci-beam.apache.org/job/beam_PerformanceTests_TextIOIT/ws/src/sdks/java/io/google-cloud-platform/src/test/java/org/apache/beam/sdk/io/gcp/spanner/SpannerTransformRegistrarTest.java>:104: error: cannot find symbol
public void testReadBuilderBuildExternalWithSpannerTable() throws InvalidProtocolBufferException {
^
symbol: class InvalidProtocolBufferException
location: class SpannerTransformRegistrarTest
<https://ci-beam.apache.org/job/beam_PerformanceTests_TextIOIT/ws/src/sdks/java/io/google-cloud-platform/src/test/java/org/apache/beam/sdk/io/gcp/spanner/SpannerTransformRegistrarTest.java>:113: error: cannot find symbol
public void testReadBuilderBuildExternalWithSqlQuery() throws InvalidProtocolBufferException {
^
symbol: class InvalidProtocolBufferException
location: class SpannerTransformRegistrarTest
<https://ci-beam.apache.org/job/beam_PerformanceTests_TextIOIT/ws/src/sdks/java/io/google-cloud-platform/src/test/java/org/apache/beam/sdk/io/gcp/spanner/SpannerTransformRegistrarTest.java>:123: error: cannot find symbol
throws InvalidProtocolBufferException {
^
symbol: class InvalidProtocolBufferException
location: class SpannerTransformRegistrarTest
<https://ci-beam.apache.org/job/beam_PerformanceTests_TextIOIT/ws/src/sdks/java/io/google-cloud-platform/src/test/java/org/apache/beam/sdk/io/gcp/spanner/SpannerTransformRegistrarTest.java>:133: error: cannot find symbol
throws InvalidProtocolBufferException {
^
symbol: class InvalidProtocolBufferException
location: class SpannerTransformRegistrarTest
Note: Some input files use or override a deprecated API.
Note: Recompile with -Xlint:deprecation for details.
5 errors
> Task :sdks:java:io:google-cloud-platform:compileTestJava FAILED
:sdks:java:io:google-cloud-platform:compileTestJava (Thread[Execution **** for ':' Thread 4,5,main]) completed. Took 7.294 secs.
> Task :sdks:java:io:xml:compileJava
Note: Some input files use or override a deprecated API.
Note: Recompile with -Xlint:deprecation for details.
Class dependency analysis for incremental compilation took 0.02 secs.
Created classpath snapshot for incremental compilation in 0.035 secs.
Stored cache entry for task ':sdks:java:io:xml:compileJava' with cache key 1ef778925092c4263d2ba118b5977c72
:sdks:java:io:xml:compileJava (Thread[Execution **** for ':',5,main]) completed. Took 11.914 secs.
:sdks:java:io:xml:classes (Thread[Execution **** for ':',5,main]) started.
> Task :sdks:java:io:xml:classes
Skipping task ':sdks:java:io:xml:classes' as it has no actions.
:sdks:java:io:xml:classes (Thread[Execution **** for ':',5,main]) completed. Took 0.0 secs.
:sdks:java:io:xml:jar (Thread[Execution **** for ':',5,main]) started.
> Task :sdks:java:io:xml:jar
Caching disabled for task ':sdks:java:io:xml:jar' because:
Not worth caching
Task ':sdks:java:io:xml:jar' is not up-to-date because:
No history is available.
file or directory '<https://ci-beam.apache.org/job/beam_PerformanceTests_TextIOIT/ws/src/sdks/java/io/xml/build/resources/main',> not found
:sdks:java:io:xml:jar (Thread[Execution **** for ':',5,main]) completed. Took 0.014 secs.
:sdks:java:io:xml:compileTestJava (Thread[Execution **** for ':',5,main]) started.
> Task :sdks:java:io:xml:compileTestJava
Custom actions are attached to task ':sdks:java:io:xml:compileTestJava'.
Build cache key for task ':sdks:java:io:xml:compileTestJava' is 9595d7f4a33a12d8b6055b3432d93d4f
Task ':sdks:java:io:xml:compileTestJava' is not up-to-date because:
No history is available.
The input changes require a full rebuild for incremental task ':sdks:java:io:xml:compileTestJava'.
Full recompilation is required because no incremental change information is available. This is usually caused by clean builds or changing compiler arguments.
Compiling with toolchain '/usr/lib/jvm/java-8-openjdk-amd64'.
Compiling with JDK Java compiler API.
Note: Some input files use or override a deprecated API.
Note: Recompile with -Xlint:deprecation for details.
Class dependency analysis for incremental compilation took 0.006 secs.
Created classpath snapshot for incremental compilation in 0.029 secs.
Stored cache entry for task ':sdks:java:io:xml:compileTestJava' with cache key 9595d7f4a33a12d8b6055b3432d93d4f
:sdks:java:io:xml:compileTestJava (Thread[Execution **** for ':',5,main]) completed. Took 2.281 secs.
:sdks:java:io:xml:testClasses (Thread[Execution **** for ':',5,main]) started.
> Task :sdks:java:io:xml:testClasses
Skipping task ':sdks:java:io:xml:testClasses' as it has no actions.
:sdks:java:io:xml:testClasses (Thread[Execution **** for ':',5,main]) completed. Took 0.0 secs.
:sdks:java:io:xml:testJar (Thread[Execution **** for ':',5,main]) started.
> Task :sdks:java:io:xml:testJar
Caching disabled for task ':sdks:java:io:xml:testJar' because:
Not worth caching
Task ':sdks:java:io:xml:testJar' is not up-to-date because:
No history is available.
file or directory '<https://ci-beam.apache.org/job/beam_PerformanceTests_TextIOIT/ws/src/sdks/java/io/xml/build/resources/test',> not found
:sdks:java:io:xml:testJar (Thread[Execution **** for ':',5,main]) completed. Took 0.008 secs.
:sdks:java:io:file-based-io-tests:compileTestJava (Thread[Execution **** for ':',5,main]) started.
> Task :sdks:java:io:file-based-io-tests:compileTestJava
Custom actions are attached to task ':sdks:java:io:file-based-io-tests:compileTestJava'.
Build cache key for task ':sdks:java:io:file-based-io-tests:compileTestJava' is f113fd0ecf7b9bc53725dd131f402e6b
Task ':sdks:java:io:file-based-io-tests:compileTestJava' is not up-to-date because:
No history is available.
The input changes require a full rebuild for incremental task ':sdks:java:io:file-based-io-tests:compileTestJava'.
Full recompilation is required because no incremental change information is available. This is usually caused by clean builds or changing compiler arguments.
Compiling with toolchain '/usr/lib/jvm/java-8-openjdk-amd64'.
Compiling with JDK Java compiler API.
Note: <https://ci-beam.apache.org/job/beam_PerformanceTests_TextIOIT/ws/src/sdks/java/io/file-based-io-tests/src/test/java/org/apache/beam/sdk/io/tfrecord/TFRecordIOIT.java> uses or overrides a deprecated API.
Note: Recompile with -Xlint:deprecation for details.
Class dependency analysis for incremental compilation took 0.007 secs.
Created classpath snapshot for incremental compilation in 0.155 secs.
Stored cache entry for task ':sdks:java:io:file-based-io-tests:compileTestJava' with cache key f113fd0ecf7b9bc53725dd131f402e6b
:sdks:java:io:file-based-io-tests:compileTestJava (Thread[Execution **** for ':',5,main]) completed. Took 2.858 secs.
:sdks:java:io:file-based-io-tests:testClasses (Thread[Execution **** for ':',5,main]) started.
> Task :sdks:java:io:file-based-io-tests:testClasses
Skipping task ':sdks:java:io:file-based-io-tests:testClasses' as it has no actions.
:sdks:java:io:file-based-io-tests:testClasses (Thread[Execution **** for ':',5,main]) completed. Took 0.0 secs.
FAILURE: Build failed with an exception.
* What went wrong:
Execution failed for task ':sdks:java:io:google-cloud-platform:compileTestJava'.
> Compilation failed; see the compiler error output for details.
* Try:
> Run with --stacktrace option to get the stack trace.
> Run with --debug option to get more log output.
> Run with --scan to get full insights.
* Get more help at https://help.gradle.org
Deprecated Gradle features were used in this build, making it incompatible with Gradle 8.0.
You can use '--warning-mode all' to show the individual deprecation warnings and determine if they come from your own scripts or plugins.
See https://docs.gradle.org/7.4/userguide/command_line_interface.html#sec:command_line_warnings
BUILD FAILED in 42s
144 actionable tasks: 90 executed, 52 from cache, 2 up-to-date
Publishing build scan...
https://gradle.com/s/p7dbanik4mr6a
Stopped 3 **** daemon(s).
Build step 'Invoke Gradle script' changed build result to FAILURE
Build step 'Invoke Gradle script' marked build as failure
---------------------------------------------------------------------
To unsubscribe, e-mail: builds-unsubscribe@beam.apache.org
For additional commands, e-mail: builds-help@beam.apache.org
Jenkins build is back to normal : beam_PerformanceTests_TextIOIT #6694
Posted by Apache Jenkins Server <je...@builds.apache.org>.
See <https://ci-beam.apache.org/job/beam_PerformanceTests_TextIOIT/6694/display/redirect?page=changes>
---------------------------------------------------------------------
To unsubscribe, e-mail: builds-unsubscribe@beam.apache.org
For additional commands, e-mail: builds-help@beam.apache.org