You are viewing a plain text version of this content. The canonical link for it is here.
Posted to dev@kafka.apache.org by Apache Jenkins Server <je...@builds.apache.org> on 2021/01/14 03:52:04 UTC

Build failed in Jenkins: Kafka » kafka-trunk-jdk15 #399

See <https://ci-builds.apache.org/job/Kafka/job/kafka-trunk-jdk15/399/display/redirect?page=changes>

Changes:

[github] KAFKA-7340: Migrate clients module to JUnit 5 (#9874)


------------------------------------------
[...truncated 3.68 MB...]
org.apache.kafka.streams.test.ConsumerRecordFactoryTest > shouldRequireCustomTopicNameIfNotDefaultFactoryTopicNameWithDefaultTimestamp STARTED

org.apache.kafka.streams.test.ConsumerRecordFactoryTest > shouldRequireCustomTopicNameIfNotDefaultFactoryTopicNameWithDefaultTimestamp PASSED

org.apache.kafka.streams.test.ConsumerRecordFactoryTest > shouldNotAllowToCreateTopicWithNullTopicNameWithNullKey STARTED

org.apache.kafka.streams.test.ConsumerRecordFactoryTest > shouldNotAllowToCreateTopicWithNullTopicNameWithNullKey PASSED

org.apache.kafka.streams.test.ConsumerRecordFactoryTest > shouldCreateNullKeyConsumerRecordWithOtherTopicNameAndTimestampWithTimetamp STARTED

org.apache.kafka.streams.test.ConsumerRecordFactoryTest > shouldCreateNullKeyConsumerRecordWithOtherTopicNameAndTimestampWithTimetamp PASSED

org.apache.kafka.streams.test.ConsumerRecordFactoryTest > shouldCreateConsumerRecordWithTimestamp STARTED

org.apache.kafka.streams.test.ConsumerRecordFactoryTest > shouldCreateConsumerRecordWithTimestamp PASSED

org.apache.kafka.streams.test.ConsumerRecordFactoryTest > shouldNotAllowToCreateTopicWithNullHeaders STARTED

org.apache.kafka.streams.test.ConsumerRecordFactoryTest > shouldNotAllowToCreateTopicWithNullHeaders PASSED

org.apache.kafka.streams.test.ConsumerRecordFactoryTest > shouldNotAllowToCreateTopicWithNullTopicNameWithDefaultTimestamp STARTED

org.apache.kafka.streams.test.ConsumerRecordFactoryTest > shouldNotAllowToCreateTopicWithNullTopicNameWithDefaultTimestamp PASSED

org.apache.kafka.streams.test.ConsumerRecordFactoryTest > shouldRequireCustomTopicNameIfNotDefaultFactoryTopicName STARTED

org.apache.kafka.streams.test.ConsumerRecordFactoryTest > shouldRequireCustomTopicNameIfNotDefaultFactoryTopicName PASSED

org.apache.kafka.streams.test.ConsumerRecordFactoryTest > shouldRequireCustomTopicNameIfNotDefaultFactoryTopicNameWithNullKey STARTED

org.apache.kafka.streams.test.ConsumerRecordFactoryTest > shouldRequireCustomTopicNameIfNotDefaultFactoryTopicNameWithNullKey PASSED

org.apache.kafka.streams.test.ConsumerRecordFactoryTest > shouldCreateConsumerRecord STARTED

org.apache.kafka.streams.test.ConsumerRecordFactoryTest > shouldCreateConsumerRecord PASSED

org.apache.kafka.streams.test.ConsumerRecordFactoryTest > shouldCreateNullKeyConsumerRecord STARTED

org.apache.kafka.streams.test.ConsumerRecordFactoryTest > shouldCreateNullKeyConsumerRecord PASSED

org.apache.kafka.streams.test.ConsumerRecordFactoryTest > shouldCreateConsumerRecordWithOtherTopicName STARTED

org.apache.kafka.streams.test.ConsumerRecordFactoryTest > shouldCreateConsumerRecordWithOtherTopicName PASSED

org.apache.kafka.streams.test.ConsumerRecordFactoryTest > shouldAdvanceTime STARTED

org.apache.kafka.streams.test.ConsumerRecordFactoryTest > shouldAdvanceTime PASSED

org.apache.kafka.streams.test.ConsumerRecordFactoryTest > shouldNotAllowToCreateTopicWithNullTopicNameWithKeyValuePairs STARTED

org.apache.kafka.streams.test.ConsumerRecordFactoryTest > shouldNotAllowToCreateTopicWithNullTopicNameWithKeyValuePairs PASSED

org.apache.kafka.streams.test.ConsumerRecordFactoryTest > shouldRequireCustomTopicNameIfNotDefaultFactoryTopicNameWithKeyValuePairsAndCustomTimestamps STARTED

org.apache.kafka.streams.test.ConsumerRecordFactoryTest > shouldRequireCustomTopicNameIfNotDefaultFactoryTopicNameWithKeyValuePairsAndCustomTimestamps PASSED

org.apache.kafka.streams.test.ConsumerRecordFactoryTest > shouldRequireCustomTopicNameIfNotDefaultFactoryTopicNameWithKeyValuePairs STARTED

org.apache.kafka.streams.test.ConsumerRecordFactoryTest > shouldRequireCustomTopicNameIfNotDefaultFactoryTopicNameWithKeyValuePairs PASSED

org.apache.kafka.streams.test.ConsumerRecordFactoryTest > shouldCreateConsumerRecordWithOtherTopicNameAndTimestamp STARTED

org.apache.kafka.streams.test.ConsumerRecordFactoryTest > shouldCreateConsumerRecordWithOtherTopicNameAndTimestamp PASSED

org.apache.kafka.streams.test.ConsumerRecordFactoryTest > shouldNotAllowToCreateTopicWithNullTopicNameWithKeyValuePairsAndCustomTimestamps STARTED

org.apache.kafka.streams.test.ConsumerRecordFactoryTest > shouldNotAllowToCreateTopicWithNullTopicNameWithKeyValuePairsAndCustomTimestamps PASSED

org.apache.kafka.streams.test.ConsumerRecordFactoryTest > shouldNotAllowToCreateTopicWithNullTopicName STARTED

org.apache.kafka.streams.test.ConsumerRecordFactoryTest > shouldNotAllowToCreateTopicWithNullTopicName PASSED

org.apache.kafka.streams.test.ConsumerRecordFactoryTest > shouldCreateConsumerRecordsFromKeyValuePairsWithCustomTimestampAndIncrementsAndNotAdvanceTime STARTED

org.apache.kafka.streams.test.ConsumerRecordFactoryTest > shouldCreateConsumerRecordsFromKeyValuePairsWithCustomTimestampAndIncrementsAndNotAdvanceTime PASSED

org.apache.kafka.streams.test.ConsumerRecordFactoryTest > shouldCreateNullKeyConsumerRecordWithTimestampWithTimestamp STARTED

org.apache.kafka.streams.test.ConsumerRecordFactoryTest > shouldCreateNullKeyConsumerRecordWithTimestampWithTimestamp PASSED

org.apache.kafka.streams.test.ConsumerRecordFactoryTest > shouldRequireCustomTopicNameIfNotDefaultFactoryTopicNameWithNullKeyAndDefaultTimestamp STARTED

org.apache.kafka.streams.test.ConsumerRecordFactoryTest > shouldRequireCustomTopicNameIfNotDefaultFactoryTopicNameWithNullKeyAndDefaultTimestamp PASSED

org.apache.kafka.streams.test.ConsumerRecordFactoryTest > shouldCreateConsumerRecordsFromKeyValuePairsWithTimestampAndIncrements STARTED

org.apache.kafka.streams.test.ConsumerRecordFactoryTest > shouldCreateConsumerRecordsFromKeyValuePairsWithTimestampAndIncrements PASSED

> Task :streams:upgrade-system-tests-0100:compileJava NO-SOURCE
> Task :streams:upgrade-system-tests-0100:processResources NO-SOURCE
> Task :streams:upgrade-system-tests-0100:classes UP-TO-DATE
> Task :streams:upgrade-system-tests-0100:checkstyleMain NO-SOURCE
> Task :streams:upgrade-system-tests-0100:compileTestJava
> Task :streams:upgrade-system-tests-0100:processTestResources NO-SOURCE
> Task :streams:upgrade-system-tests-0100:testClasses
> Task :streams:upgrade-system-tests-0100:checkstyleTest
> Task :streams:upgrade-system-tests-0100:spotbugsMain NO-SOURCE
> Task :streams:upgrade-system-tests-0100:test
> Task :streams:upgrade-system-tests-0101:compileJava NO-SOURCE
> Task :streams:upgrade-system-tests-0101:processResources NO-SOURCE
> Task :streams:upgrade-system-tests-0101:classes UP-TO-DATE
> Task :streams:upgrade-system-tests-0101:checkstyleMain NO-SOURCE
> Task :streams:upgrade-system-tests-0101:compileTestJava
> Task :streams:upgrade-system-tests-0101:processTestResources NO-SOURCE
> Task :streams:upgrade-system-tests-0101:testClasses
> Task :streams:upgrade-system-tests-0101:checkstyleTest
> Task :streams:upgrade-system-tests-0101:spotbugsMain NO-SOURCE
> Task :streams:upgrade-system-tests-0101:test
> Task :streams:upgrade-system-tests-0102:compileJava NO-SOURCE
> Task :streams:upgrade-system-tests-0102:processResources NO-SOURCE
> Task :streams:upgrade-system-tests-0102:classes UP-TO-DATE
> Task :streams:upgrade-system-tests-0102:checkstyleMain NO-SOURCE
> Task :streams:upgrade-system-tests-0102:compileTestJava
> Task :streams:upgrade-system-tests-0102:processTestResources NO-SOURCE
> Task :streams:upgrade-system-tests-0102:testClasses
> Task :streams:upgrade-system-tests-0102:checkstyleTest
> Task :streams:upgrade-system-tests-0102:spotbugsMain NO-SOURCE
> Task :streams:upgrade-system-tests-0102:test
> Task :streams:upgrade-system-tests-0110:compileJava NO-SOURCE
> Task :streams:upgrade-system-tests-0110:processResources NO-SOURCE
> Task :streams:upgrade-system-tests-0110:classes UP-TO-DATE
> Task :streams:upgrade-system-tests-0110:checkstyleMain NO-SOURCE
> Task :streams:upgrade-system-tests-0110:compileTestJava
> Task :streams:upgrade-system-tests-0110:processTestResources NO-SOURCE
> Task :streams:upgrade-system-tests-0110:testClasses
> Task :streams:upgrade-system-tests-0110:checkstyleTest
> Task :streams:upgrade-system-tests-0110:spotbugsMain NO-SOURCE
> Task :streams:upgrade-system-tests-0110:test
> Task :streams:upgrade-system-tests-10:compileJava NO-SOURCE
> Task :streams:upgrade-system-tests-10:processResources NO-SOURCE
> Task :streams:upgrade-system-tests-10:classes UP-TO-DATE
> Task :streams:upgrade-system-tests-10:checkstyleMain NO-SOURCE
> Task :streams:upgrade-system-tests-10:compileTestJava
> Task :streams:upgrade-system-tests-10:processTestResources NO-SOURCE
> Task :streams:upgrade-system-tests-10:testClasses
> Task :streams:upgrade-system-tests-10:checkstyleTest
> Task :streams:upgrade-system-tests-10:spotbugsMain NO-SOURCE
> Task :streams:upgrade-system-tests-10:test
> Task :streams:upgrade-system-tests-11:compileJava NO-SOURCE
> Task :streams:upgrade-system-tests-11:processResources NO-SOURCE
> Task :streams:upgrade-system-tests-11:classes UP-TO-DATE
> Task :streams:upgrade-system-tests-11:checkstyleMain NO-SOURCE
> Task :streams:upgrade-system-tests-11:compileTestJava
> Task :streams:upgrade-system-tests-11:processTestResources NO-SOURCE
> Task :streams:upgrade-system-tests-11:testClasses
> Task :streams:upgrade-system-tests-11:checkstyleTest
> Task :streams:upgrade-system-tests-11:spotbugsMain NO-SOURCE
> Task :streams:upgrade-system-tests-11:test
> Task :streams:upgrade-system-tests-20:compileJava NO-SOURCE
> Task :streams:upgrade-system-tests-20:processResources NO-SOURCE
> Task :streams:upgrade-system-tests-20:classes UP-TO-DATE
> Task :streams:upgrade-system-tests-20:checkstyleMain NO-SOURCE
> Task :streams:upgrade-system-tests-20:compileTestJava
> Task :streams:upgrade-system-tests-20:processTestResources NO-SOURCE
> Task :streams:upgrade-system-tests-20:testClasses
> Task :streams:upgrade-system-tests-20:checkstyleTest
> Task :streams:upgrade-system-tests-20:spotbugsMain NO-SOURCE
> Task :streams:upgrade-system-tests-20:test
> Task :streams:upgrade-system-tests-21:compileJava NO-SOURCE
> Task :streams:upgrade-system-tests-21:processResources NO-SOURCE
> Task :streams:upgrade-system-tests-21:classes UP-TO-DATE
> Task :streams:upgrade-system-tests-21:checkstyleMain NO-SOURCE
> Task :streams:upgrade-system-tests-21:compileTestJava
> Task :streams:upgrade-system-tests-21:processTestResources NO-SOURCE
> Task :streams:upgrade-system-tests-21:testClasses
> Task :streams:upgrade-system-tests-21:checkstyleTest
> Task :streams:upgrade-system-tests-21:spotbugsMain NO-SOURCE
> Task :streams:upgrade-system-tests-21:test
> Task :streams:upgrade-system-tests-22:compileJava NO-SOURCE
> Task :streams:upgrade-system-tests-22:processResources NO-SOURCE
> Task :streams:upgrade-system-tests-22:classes UP-TO-DATE
> Task :streams:upgrade-system-tests-22:checkstyleMain NO-SOURCE
> Task :streams:upgrade-system-tests-22:compileTestJava
> Task :streams:upgrade-system-tests-22:processTestResources NO-SOURCE
> Task :streams:upgrade-system-tests-22:testClasses
> Task :streams:upgrade-system-tests-22:checkstyleTest
> Task :streams:upgrade-system-tests-22:spotbugsMain NO-SOURCE
> Task :streams:upgrade-system-tests-22:test
> Task :streams:upgrade-system-tests-23:compileJava NO-SOURCE
> Task :streams:upgrade-system-tests-23:processResources NO-SOURCE
> Task :streams:upgrade-system-tests-23:classes UP-TO-DATE
> Task :streams:upgrade-system-tests-23:checkstyleMain NO-SOURCE
> Task :streams:upgrade-system-tests-23:compileTestJava
> Task :streams:upgrade-system-tests-23:processTestResources NO-SOURCE
> Task :streams:upgrade-system-tests-23:testClasses
> Task :streams:upgrade-system-tests-23:checkstyleTest
> Task :streams:upgrade-system-tests-23:spotbugsMain NO-SOURCE
> Task :streams:upgrade-system-tests-23:test
> Task :streams:upgrade-system-tests-24:compileJava NO-SOURCE
> Task :streams:upgrade-system-tests-24:processResources NO-SOURCE
> Task :streams:upgrade-system-tests-24:classes UP-TO-DATE
> Task :streams:upgrade-system-tests-24:checkstyleMain NO-SOURCE
> Task :streams:upgrade-system-tests-24:compileTestJava
> Task :streams:upgrade-system-tests-24:processTestResources NO-SOURCE
> Task :streams:upgrade-system-tests-24:testClasses
> Task :streams:upgrade-system-tests-24:checkstyleTest
> Task :streams:upgrade-system-tests-24:spotbugsMain NO-SOURCE
> Task :streams:upgrade-system-tests-24:test
> Task :streams:upgrade-system-tests-25:compileJava NO-SOURCE
> Task :streams:upgrade-system-tests-25:processResources NO-SOURCE
> Task :streams:upgrade-system-tests-25:classes UP-TO-DATE
> Task :streams:upgrade-system-tests-25:checkstyleMain NO-SOURCE
> Task :streams:upgrade-system-tests-25:compileTestJava
> Task :streams:upgrade-system-tests-25:processTestResources NO-SOURCE
> Task :streams:upgrade-system-tests-25:testClasses
> Task :streams:upgrade-system-tests-25:checkstyleTest
> Task :streams:upgrade-system-tests-25:spotbugsMain NO-SOURCE
> Task :streams:upgrade-system-tests-25:test
> Task :streams:upgrade-system-tests-26:compileJava NO-SOURCE
> Task :streams:upgrade-system-tests-26:processResources NO-SOURCE
> Task :streams:upgrade-system-tests-26:classes UP-TO-DATE
> Task :streams:upgrade-system-tests-26:checkstyleMain NO-SOURCE
> Task :streams:upgrade-system-tests-26:compileTestJava
> Task :streams:upgrade-system-tests-26:processTestResources NO-SOURCE
> Task :streams:upgrade-system-tests-26:testClasses
> Task :streams:upgrade-system-tests-26:checkstyleTest
> Task :streams:upgrade-system-tests-26:spotbugsMain NO-SOURCE
> Task :streams:upgrade-system-tests-26:test
> Task :streams:upgrade-system-tests-27:compileJava NO-SOURCE
> Task :streams:upgrade-system-tests-27:processResources NO-SOURCE
> Task :streams:upgrade-system-tests-27:classes UP-TO-DATE
> Task :streams:upgrade-system-tests-27:checkstyleMain NO-SOURCE
> Task :streams:upgrade-system-tests-27:compileTestJava
> Task :streams:upgrade-system-tests-27:processTestResources NO-SOURCE
> Task :streams:upgrade-system-tests-27:testClasses
> Task :streams:upgrade-system-tests-27:checkstyleTest
> Task :streams:upgrade-system-tests-27:spotbugsMain NO-SOURCE
> Task :streams:upgrade-system-tests-27:test

FAILURE: Build failed with an exception.

* What went wrong:
Execution failed for task ':streams:test'.
> There were failing tests. See the report at: file://<https://ci-builds.apache.org/job/Kafka/job/kafka-trunk-jdk15/ws/streams/build/reports/tests/test/index.html>

* Try:
Run with --stacktrace option to get the stack trace. Run with --info or --debug option to get more log output. Run with --scan to get full insights.

* Get more help at https://help.gradle.org

Deprecated Gradle features were used in this build, making it incompatible with Gradle 7.0.
Use '--warning-mode all' to show the individual deprecation warnings.
See https://docs.gradle.org/6.7.1/userguide/command_line_interface.html#sec:command_line_warnings

BUILD FAILED in 2h 21m 52s
240 actionable tasks: 205 executed, 35 up-to-date
Build step 'Execute shell' marked build as failure
Recording test results
Not sending mail to unregistered user github@hugo-hirsch.de

Build failed in Jenkins: Kafka » kafka-trunk-jdk15 #413

Posted by Apache Jenkins Server <je...@builds.apache.org>.
See <https://ci-builds.apache.org/job/Kafka/job/kafka-trunk-jdk15/413/display/redirect?page=changes>

Changes:

[github] KAFKA-10674: Controller API version bond with forwardable APIs (#9600)


------------------------------------------
[...truncated 3.65 MB...]
TopologyTestDriverEosTest > shouldProcessFromSourcesThatMatchMultiplePattern() PASSED

TopologyTestDriverEosTest > shouldPopulateGlobalStore() STARTED

TopologyTestDriverEosTest > shouldPopulateGlobalStore() PASSED

TopologyTestDriverEosTest > shouldThrowIfPersistentBuiltInStoreIsAccessedWithUntypedMethod() STARTED

TopologyTestDriverEosTest > shouldThrowIfPersistentBuiltInStoreIsAccessedWithUntypedMethod() PASSED

TopologyTestDriverEosTest > shouldAllowPrePopulatingStatesStoresWithCachingEnabled() STARTED

TopologyTestDriverEosTest > shouldAllowPrePopulatingStatesStoresWithCachingEnabled() PASSED

TopologyTestDriverEosTest > shouldReturnCorrectPersistentStoreTypeOnly() STARTED

TopologyTestDriverEosTest > shouldReturnCorrectPersistentStoreTypeOnly() PASSED

TopologyTestDriverEosTest > shouldRespectTaskIdling() STARTED

TopologyTestDriverEosTest > shouldRespectTaskIdling() PASSED

TopologyTestDriverEosTest > shouldUseSourceSpecificDeserializers() STARTED

TopologyTestDriverEosTest > shouldUseSourceSpecificDeserializers() PASSED

TopologyTestDriverEosTest > shouldReturnAllStores() STARTED

TopologyTestDriverEosTest > shouldReturnAllStores() PASSED

TopologyTestDriverEosTest > shouldNotCreateStateDirectoryForStatelessTopology() STARTED

TopologyTestDriverEosTest > shouldNotCreateStateDirectoryForStatelessTopology() PASSED

TopologyTestDriverEosTest > shouldApplyGlobalUpdatesCorrectlyInRecursiveTopologies() STARTED

TopologyTestDriverEosTest > shouldApplyGlobalUpdatesCorrectlyInRecursiveTopologies() PASSED

TopologyTestDriverEosTest > shouldReturnAllStoresNames() STARTED

TopologyTestDriverEosTest > shouldReturnAllStoresNames() PASSED

TopologyTestDriverEosTest > shouldPassRecordHeadersIntoSerializersAndDeserializers() STARTED

TopologyTestDriverEosTest > shouldPassRecordHeadersIntoSerializersAndDeserializers() PASSED

TopologyTestDriverEosTest > shouldProcessConsumerRecordList() STARTED

TopologyTestDriverEosTest > shouldProcessConsumerRecordList() PASSED

TopologyTestDriverEosTest > shouldUseSinkSpecificSerializers() STARTED

TopologyTestDriverEosTest > shouldUseSinkSpecificSerializers() PASSED

TopologyTestDriverEosTest > shouldFlushStoreForFirstInput() STARTED

TopologyTestDriverEosTest > shouldFlushStoreForFirstInput() PASSED

TopologyTestDriverEosTest > shouldProcessFromSourceThatMatchPattern() STARTED

TopologyTestDriverEosTest > shouldProcessFromSourceThatMatchPattern() PASSED

TopologyTestDriverEosTest > shouldCaptureSinkTopicNamesIfWrittenInto() STARTED

TopologyTestDriverEosTest > shouldCaptureSinkTopicNamesIfWrittenInto() PASSED

TopologyTestDriverEosTest > shouldUpdateStoreForNewKey() STARTED

TopologyTestDriverEosTest > shouldUpdateStoreForNewKey() PASSED

TopologyTestDriverEosTest > shouldSendRecordViaCorrectSourceTopicDeprecated() STARTED

TopologyTestDriverEosTest > shouldSendRecordViaCorrectSourceTopicDeprecated() PASSED

TopologyTestDriverEosTest > shouldPunctuateOnWallClockTime() STARTED

TopologyTestDriverEosTest > shouldPunctuateOnWallClockTime() PASSED

TopologyTestDriverEosTest > shouldSetRecordMetadata() STARTED

TopologyTestDriverEosTest > shouldSetRecordMetadata() PASSED

TopologyTestDriverEosTest > shouldNotUpdateStoreForLargerValue() STARTED

TopologyTestDriverEosTest > shouldNotUpdateStoreForLargerValue() PASSED

TopologyTestDriverEosTest > shouldReturnCorrectInMemoryStoreTypeOnly() STARTED

TopologyTestDriverEosTest > shouldReturnCorrectInMemoryStoreTypeOnly() PASSED

TopologyTestDriverEosTest > shouldThrowForMissingTime() STARTED

TopologyTestDriverEosTest > shouldThrowForMissingTime() PASSED

TopologyTestDriverEosTest > shouldCaptureInternalTopicNamesIfWrittenInto() STARTED

TopologyTestDriverEosTest > shouldCaptureInternalTopicNamesIfWrittenInto() PASSED

TopologyTestDriverEosTest > shouldPunctuateOnWallClockTimeDeprecated() STARTED

TopologyTestDriverEosTest > shouldPunctuateOnWallClockTimeDeprecated() PASSED

TopologyTestDriverEosTest > shouldProcessRecordForTopic() STARTED

TopologyTestDriverEosTest > shouldProcessRecordForTopic() PASSED

TopologyTestDriverEosTest > shouldForwardRecordsFromSubtopologyToSubtopology() STARTED

TopologyTestDriverEosTest > shouldForwardRecordsFromSubtopologyToSubtopology() PASSED

TopologyTestDriverEosTest > shouldNotUpdateStoreForSmallerValue() STARTED

TopologyTestDriverEosTest > shouldNotUpdateStoreForSmallerValue() PASSED

TopologyTestDriverEosTest > shouldCreateStateDirectoryForStatefulTopology() STARTED

TopologyTestDriverEosTest > shouldCreateStateDirectoryForStatefulTopology() PASSED

TopologyTestDriverEosTest > shouldNotRequireParameters() STARTED

TopologyTestDriverEosTest > shouldNotRequireParameters() PASSED

TopologyTestDriverEosTest > shouldPunctuateIfWallClockTimeAdvances() STARTED

TopologyTestDriverEosTest > shouldPunctuateIfWallClockTimeAdvances() PASSED

> Task :streams:upgrade-system-tests-0110:spotbugsMain NO-SOURCE
> Task :streams:upgrade-system-tests-0110:test
> Task :streams:upgrade-system-tests-10:compileJava NO-SOURCE
> Task :streams:upgrade-system-tests-10:processResources NO-SOURCE
> Task :streams:upgrade-system-tests-10:classes UP-TO-DATE
> Task :streams:upgrade-system-tests-10:checkstyleMain NO-SOURCE
> Task :streams:upgrade-system-tests-10:compileTestJava
> Task :streams:upgrade-system-tests-10:processTestResources NO-SOURCE
> Task :streams:upgrade-system-tests-10:testClasses
> Task :streams:upgrade-system-tests-10:checkstyleTest
> Task :streams:upgrade-system-tests-10:spotbugsMain NO-SOURCE
> Task :streams:upgrade-system-tests-10:test
> Task :streams:upgrade-system-tests-11:compileJava NO-SOURCE
> Task :streams:upgrade-system-tests-11:processResources NO-SOURCE
> Task :streams:upgrade-system-tests-11:classes UP-TO-DATE
> Task :streams:upgrade-system-tests-11:checkstyleMain NO-SOURCE
> Task :streams:upgrade-system-tests-11:compileTestJava
> Task :streams:upgrade-system-tests-11:processTestResources NO-SOURCE
> Task :streams:upgrade-system-tests-11:testClasses
> Task :streams:upgrade-system-tests-11:checkstyleTest
> Task :streams:upgrade-system-tests-11:spotbugsMain NO-SOURCE
> Task :streams:upgrade-system-tests-11:test
> Task :streams:upgrade-system-tests-20:compileJava NO-SOURCE
> Task :streams:upgrade-system-tests-20:processResources NO-SOURCE
> Task :streams:upgrade-system-tests-20:classes UP-TO-DATE
> Task :streams:upgrade-system-tests-20:checkstyleMain NO-SOURCE
> Task :streams:upgrade-system-tests-20:compileTestJava
> Task :streams:upgrade-system-tests-20:processTestResources NO-SOURCE
> Task :streams:upgrade-system-tests-20:testClasses
> Task :streams:upgrade-system-tests-20:checkstyleTest
> Task :streams:upgrade-system-tests-20:spotbugsMain NO-SOURCE
> Task :streams:upgrade-system-tests-20:test
> Task :streams:upgrade-system-tests-21:compileJava NO-SOURCE
> Task :streams:upgrade-system-tests-21:processResources NO-SOURCE
> Task :streams:upgrade-system-tests-21:classes UP-TO-DATE
> Task :streams:upgrade-system-tests-21:checkstyleMain NO-SOURCE
> Task :streams:upgrade-system-tests-21:compileTestJava
> Task :streams:upgrade-system-tests-21:processTestResources NO-SOURCE
> Task :streams:upgrade-system-tests-21:testClasses
> Task :streams:upgrade-system-tests-21:checkstyleTest
> Task :streams:upgrade-system-tests-21:spotbugsMain NO-SOURCE
> Task :streams:upgrade-system-tests-21:test
> Task :streams:upgrade-system-tests-22:compileJava NO-SOURCE
> Task :streams:upgrade-system-tests-22:processResources NO-SOURCE
> Task :streams:upgrade-system-tests-22:classes UP-TO-DATE
> Task :streams:upgrade-system-tests-22:checkstyleMain NO-SOURCE
> Task :streams:upgrade-system-tests-22:compileTestJava
> Task :streams:upgrade-system-tests-22:processTestResources NO-SOURCE
> Task :streams:upgrade-system-tests-22:testClasses
> Task :streams:upgrade-system-tests-22:checkstyleTest
> Task :streams:upgrade-system-tests-22:spotbugsMain NO-SOURCE
> Task :streams:upgrade-system-tests-22:test
> Task :streams:upgrade-system-tests-23:compileJava NO-SOURCE
> Task :streams:upgrade-system-tests-23:processResources NO-SOURCE
> Task :streams:upgrade-system-tests-23:classes UP-TO-DATE
> Task :streams:upgrade-system-tests-23:checkstyleMain NO-SOURCE
> Task :streams:upgrade-system-tests-23:compileTestJava
> Task :streams:upgrade-system-tests-23:processTestResources NO-SOURCE
> Task :streams:upgrade-system-tests-23:testClasses
> Task :streams:upgrade-system-tests-23:checkstyleTest
> Task :streams:upgrade-system-tests-23:spotbugsMain NO-SOURCE
> Task :streams:upgrade-system-tests-23:test
> Task :streams:upgrade-system-tests-24:compileJava NO-SOURCE
> Task :streams:upgrade-system-tests-24:processResources NO-SOURCE
> Task :streams:upgrade-system-tests-24:classes UP-TO-DATE
> Task :streams:upgrade-system-tests-24:checkstyleMain NO-SOURCE
> Task :streams:upgrade-system-tests-24:compileTestJava
> Task :streams:upgrade-system-tests-24:processTestResources NO-SOURCE
> Task :streams:upgrade-system-tests-24:testClasses
> Task :streams:upgrade-system-tests-24:checkstyleTest
> Task :streams:upgrade-system-tests-24:spotbugsMain NO-SOURCE
> Task :streams:upgrade-system-tests-24:test
> Task :streams:upgrade-system-tests-25:compileJava NO-SOURCE
> Task :streams:upgrade-system-tests-25:processResources NO-SOURCE
> Task :streams:upgrade-system-tests-25:classes UP-TO-DATE
> Task :streams:upgrade-system-tests-25:checkstyleMain NO-SOURCE
> Task :streams:upgrade-system-tests-25:compileTestJava
> Task :streams:upgrade-system-tests-25:processTestResources NO-SOURCE
> Task :streams:upgrade-system-tests-25:testClasses
> Task :streams:upgrade-system-tests-25:checkstyleTest
> Task :streams:upgrade-system-tests-25:spotbugsMain NO-SOURCE
> Task :streams:upgrade-system-tests-25:test
> Task :streams:upgrade-system-tests-26:compileJava NO-SOURCE
> Task :streams:upgrade-system-tests-26:processResources NO-SOURCE
> Task :streams:upgrade-system-tests-26:classes UP-TO-DATE
> Task :streams:upgrade-system-tests-26:checkstyleMain NO-SOURCE
> Task :streams:upgrade-system-tests-26:compileTestJava
> Task :streams:upgrade-system-tests-26:processTestResources NO-SOURCE
> Task :streams:upgrade-system-tests-26:testClasses
> Task :streams:upgrade-system-tests-26:checkstyleTest
> Task :streams:upgrade-system-tests-26:spotbugsMain NO-SOURCE
> Task :streams:upgrade-system-tests-26:test
> Task :streams:upgrade-system-tests-27:compileJava NO-SOURCE
> Task :streams:upgrade-system-tests-27:processResources NO-SOURCE
> Task :streams:upgrade-system-tests-27:classes UP-TO-DATE
> Task :streams:upgrade-system-tests-27:checkstyleMain NO-SOURCE
> Task :streams:upgrade-system-tests-27:compileTestJava
> Task :streams:upgrade-system-tests-27:processTestResources NO-SOURCE
> Task :streams:upgrade-system-tests-27:testClasses
> Task :streams:upgrade-system-tests-27:checkstyleTest
> Task :streams:upgrade-system-tests-27:spotbugsMain NO-SOURCE
> Task :streams:upgrade-system-tests-27:test

FAILURE: Build failed with an exception.

* What went wrong:
Execution failed for task ':core:test'.
> There were failing tests. See the report at: file://<https://ci-builds.apache.org/job/Kafka/job/kafka-trunk-jdk15/ws/core/build/reports/tests/test/index.html>

* Try:
Run with --stacktrace option to get the stack trace. Run with --info or --debug option to get more log output. Run with --scan to get full insights.

* Get more help at https://help.gradle.org

Deprecated Gradle features were used in this build, making it incompatible with Gradle 7.0.
Use '--warning-mode all' to show the individual deprecation warnings.
See https://docs.gradle.org/6.7.1/userguide/command_line_interface.html#sec:command_line_warnings

BUILD FAILED in 2h 40m 28s
250 actionable tasks: 214 executed, 36 up-to-date
Build step 'Execute shell' marked build as failure
Recording test results
Not sending mail to unregistered user github@hugo-hirsch.de

Build failed in Jenkins: Kafka » kafka-trunk-jdk15 #412

Posted by Apache Jenkins Server <je...@builds.apache.org>.
See <https://ci-builds.apache.org/job/Kafka/job/kafka-trunk-jdk15/412/display/redirect?page=changes>

Changes:

[github] MINOR: Generalize server startup to make way for KIP-500 (#9883)


------------------------------------------
[...truncated 3.66 MB...]

TopologyTestDriverAtLeastOnceTest > shouldCreateStateDirectoryForStatefulTopology() PASSED

TopologyTestDriverAtLeastOnceTest > shouldNotRequireParameters() STARTED

TopologyTestDriverAtLeastOnceTest > shouldNotRequireParameters() PASSED

TopologyTestDriverAtLeastOnceTest > shouldPunctuateIfWallClockTimeAdvances() STARTED

TopologyTestDriverAtLeastOnceTest > shouldPunctuateIfWallClockTimeAdvances() PASSED

TestTopicsTest > testNonUsedOutputTopic() STARTED

TestTopicsTest > testNonUsedOutputTopic() PASSED

TestTopicsTest > testEmptyTopic() STARTED

TestTopicsTest > testEmptyTopic() PASSED

TestTopicsTest > testStartTimestamp() STARTED

TestTopicsTest > testStartTimestamp() PASSED

TestTopicsTest > testNegativeAdvance() STARTED

TestTopicsTest > testNegativeAdvance() PASSED

TestTopicsTest > shouldNotAllowToCreateWithNullDriver() STARTED

TestTopicsTest > shouldNotAllowToCreateWithNullDriver() PASSED

TestTopicsTest > testDuration() STARTED

TestTopicsTest > testDuration() PASSED

TestTopicsTest > testOutputToString() STARTED

TestTopicsTest > testOutputToString() PASSED

TestTopicsTest > testValue() STARTED

TestTopicsTest > testValue() PASSED

TestTopicsTest > testTimestampAutoAdvance() STARTED

TestTopicsTest > testTimestampAutoAdvance() PASSED

TestTopicsTest > testOutputWrongSerde() STARTED

TestTopicsTest > testOutputWrongSerde() PASSED

TestTopicsTest > shouldNotAllowToCreateOutputTopicWithNullTopicName() STARTED

TestTopicsTest > shouldNotAllowToCreateOutputTopicWithNullTopicName() PASSED

TestTopicsTest > testWrongSerde() STARTED

TestTopicsTest > testWrongSerde() PASSED

TestTopicsTest > testKeyValuesToMapWithNull() STARTED

TestTopicsTest > testKeyValuesToMapWithNull() PASSED

TestTopicsTest > testNonExistingOutputTopic() STARTED

TestTopicsTest > testNonExistingOutputTopic() PASSED

TestTopicsTest > testMultipleTopics() STARTED

TestTopicsTest > testMultipleTopics() PASSED

TestTopicsTest > testKeyValueList() STARTED

TestTopicsTest > testKeyValueList() PASSED

TestTopicsTest > shouldNotAllowToCreateOutputWithNullDriver() STARTED

TestTopicsTest > shouldNotAllowToCreateOutputWithNullDriver() PASSED

TestTopicsTest > testValueList() STARTED

TestTopicsTest > testValueList() PASSED

TestTopicsTest > testRecordList() STARTED

TestTopicsTest > testRecordList() PASSED

TestTopicsTest > testNonExistingInputTopic() STARTED

TestTopicsTest > testNonExistingInputTopic() PASSED

TestTopicsTest > testKeyValuesToMap() STARTED

TestTopicsTest > testKeyValuesToMap() PASSED

TestTopicsTest > testRecordsToList() STARTED

TestTopicsTest > testRecordsToList() PASSED

TestTopicsTest > testKeyValueListDuration() STARTED

TestTopicsTest > testKeyValueListDuration() PASSED

TestTopicsTest > testInputToString() STARTED

TestTopicsTest > testInputToString() PASSED

TestTopicsTest > testTimestamp() STARTED

TestTopicsTest > testTimestamp() PASSED

TestTopicsTest > testWithHeaders() STARTED

TestTopicsTest > testWithHeaders() PASSED

TestTopicsTest > testKeyValue() STARTED

TestTopicsTest > testKeyValue() PASSED

TestTopicsTest > shouldNotAllowToCreateTopicWithNullTopicName() STARTED

TestTopicsTest > shouldNotAllowToCreateTopicWithNullTopicName() PASSED

> Task :streams:upgrade-system-tests-11:spotbugsMain NO-SOURCE
> Task :streams:upgrade-system-tests-11:test
> Task :streams:upgrade-system-tests-20:compileJava NO-SOURCE
> Task :streams:upgrade-system-tests-20:processResources NO-SOURCE
> Task :streams:upgrade-system-tests-20:classes UP-TO-DATE
> Task :streams:upgrade-system-tests-20:checkstyleMain NO-SOURCE
> Task :streams:upgrade-system-tests-20:compileTestJava
> Task :streams:upgrade-system-tests-20:processTestResources NO-SOURCE
> Task :streams:upgrade-system-tests-20:testClasses
> Task :streams:upgrade-system-tests-20:checkstyleTest
> Task :streams:upgrade-system-tests-20:spotbugsMain NO-SOURCE
> Task :streams:upgrade-system-tests-20:test
> Task :streams:upgrade-system-tests-21:compileJava NO-SOURCE
> Task :streams:upgrade-system-tests-21:processResources NO-SOURCE
> Task :streams:upgrade-system-tests-21:classes UP-TO-DATE
> Task :streams:upgrade-system-tests-21:checkstyleMain NO-SOURCE
> Task :streams:upgrade-system-tests-21:compileTestJava
> Task :streams:upgrade-system-tests-21:processTestResources NO-SOURCE
> Task :streams:upgrade-system-tests-21:testClasses
> Task :streams:upgrade-system-tests-21:checkstyleTest
> Task :streams:upgrade-system-tests-21:spotbugsMain NO-SOURCE
> Task :streams:upgrade-system-tests-21:test
> Task :streams:upgrade-system-tests-22:compileJava NO-SOURCE
> Task :streams:upgrade-system-tests-22:processResources NO-SOURCE
> Task :streams:upgrade-system-tests-22:classes UP-TO-DATE
> Task :streams:upgrade-system-tests-22:checkstyleMain NO-SOURCE
> Task :streams:upgrade-system-tests-22:compileTestJava
> Task :streams:upgrade-system-tests-22:processTestResources NO-SOURCE
> Task :streams:upgrade-system-tests-22:testClasses
> Task :streams:upgrade-system-tests-22:checkstyleTest
> Task :streams:upgrade-system-tests-22:spotbugsMain NO-SOURCE
> Task :streams:upgrade-system-tests-22:test
> Task :streams:upgrade-system-tests-23:compileJava NO-SOURCE
> Task :streams:upgrade-system-tests-23:processResources NO-SOURCE
> Task :streams:upgrade-system-tests-23:classes UP-TO-DATE
> Task :streams:upgrade-system-tests-23:checkstyleMain NO-SOURCE
> Task :streams:upgrade-system-tests-23:compileTestJava
> Task :streams:upgrade-system-tests-23:processTestResources NO-SOURCE
> Task :streams:upgrade-system-tests-23:testClasses
> Task :streams:upgrade-system-tests-23:checkstyleTest
> Task :streams:upgrade-system-tests-23:spotbugsMain NO-SOURCE
> Task :streams:upgrade-system-tests-23:test
> Task :streams:upgrade-system-tests-24:compileJava NO-SOURCE
> Task :streams:upgrade-system-tests-24:processResources NO-SOURCE
> Task :streams:upgrade-system-tests-24:classes UP-TO-DATE
> Task :streams:upgrade-system-tests-24:checkstyleMain NO-SOURCE
> Task :streams:upgrade-system-tests-24:compileTestJava
> Task :streams:upgrade-system-tests-24:processTestResources NO-SOURCE
> Task :streams:upgrade-system-tests-24:testClasses
> Task :streams:upgrade-system-tests-24:checkstyleTest
> Task :streams:upgrade-system-tests-24:spotbugsMain NO-SOURCE
> Task :streams:upgrade-system-tests-24:test
> Task :streams:upgrade-system-tests-25:compileJava NO-SOURCE
> Task :streams:upgrade-system-tests-25:processResources NO-SOURCE
> Task :streams:upgrade-system-tests-25:classes UP-TO-DATE
> Task :streams:upgrade-system-tests-25:checkstyleMain NO-SOURCE
> Task :streams:upgrade-system-tests-25:compileTestJava
> Task :streams:upgrade-system-tests-25:processTestResources NO-SOURCE
> Task :streams:upgrade-system-tests-25:testClasses
> Task :streams:upgrade-system-tests-25:checkstyleTest
> Task :streams:upgrade-system-tests-25:spotbugsMain NO-SOURCE
> Task :streams:upgrade-system-tests-25:test
> Task :streams:upgrade-system-tests-26:compileJava NO-SOURCE
> Task :streams:upgrade-system-tests-26:processResources NO-SOURCE
> Task :streams:upgrade-system-tests-26:classes UP-TO-DATE
> Task :streams:upgrade-system-tests-26:checkstyleMain NO-SOURCE
> Task :streams:upgrade-system-tests-26:compileTestJava
> Task :streams:upgrade-system-tests-26:processTestResources NO-SOURCE
> Task :streams:upgrade-system-tests-26:testClasses
> Task :streams:upgrade-system-tests-26:checkstyleTest
> Task :streams:upgrade-system-tests-26:spotbugsMain NO-SOURCE
> Task :streams:upgrade-system-tests-26:test
> Task :streams:upgrade-system-tests-27:compileJava NO-SOURCE
> Task :streams:upgrade-system-tests-27:processResources NO-SOURCE
> Task :streams:upgrade-system-tests-27:classes UP-TO-DATE
> Task :streams:upgrade-system-tests-27:checkstyleMain NO-SOURCE
> Task :streams:upgrade-system-tests-27:compileTestJava
> Task :streams:upgrade-system-tests-27:processTestResources NO-SOURCE
> Task :streams:upgrade-system-tests-27:testClasses
> Task :streams:upgrade-system-tests-27:checkstyleTest
> Task :streams:upgrade-system-tests-27:spotbugsMain NO-SOURCE
> Task :streams:upgrade-system-tests-27:test

FAILURE: Build completed with 3 failures.

1: Task failed with an exception.
-----------
* What went wrong:
Execution failed for task ':clients:test'.
> There were failing tests. See the report at: file://<https://ci-builds.apache.org/job/Kafka/job/kafka-trunk-jdk15/ws/clients/build/reports/tests/test/index.html>

* Try:
Run with --stacktrace option to get the stack trace. Run with --info or --debug option to get more log output. Run with --scan to get full insights.
==============================================================================

2: Task failed with an exception.
-----------
* What went wrong:
Execution failed for task ':core:test'.
> There were failing tests. See the report at: file://<https://ci-builds.apache.org/job/Kafka/job/kafka-trunk-jdk15/ws/core/build/reports/tests/test/index.html>

* Try:
Run with --stacktrace option to get the stack trace. Run with --info or --debug option to get more log output. Run with --scan to get full insights.
==============================================================================

3: Task failed with an exception.
-----------
* What went wrong:
Execution failed for task ':streams:test'.
> There were failing tests. See the report at: file://<https://ci-builds.apache.org/job/Kafka/job/kafka-trunk-jdk15/ws/streams/build/reports/tests/test/index.html>

* Try:
Run with --stacktrace option to get the stack trace. Run with --info or --debug option to get more log output. Run with --scan to get full insights.
==============================================================================

* Get more help at https://help.gradle.org

Deprecated Gradle features were used in this build, making it incompatible with Gradle 7.0.
Use '--warning-mode all' to show the individual deprecation warnings.
See https://docs.gradle.org/6.7.1/userguide/command_line_interface.html#sec:command_line_warnings

BUILD FAILED in 2h 35m 34s
250 actionable tasks: 214 executed, 36 up-to-date
Build step 'Execute shell' marked build as failure
Recording test results
Not sending mail to unregistered user github@hugo-hirsch.de

Build failed in Jenkins: Kafka » kafka-trunk-jdk15 #411

Posted by Apache Jenkins Server <je...@builds.apache.org>.
See <https://ci-builds.apache.org/job/Kafka/job/kafka-trunk-jdk15/411/display/redirect?page=changes>

Changes:

[github] KAFKA-12214: Generated code does not include UUID or struct fields in its toString output (#9914)


------------------------------------------
[...truncated 3.65 MB...]

TopologyTestDriverEosTest > shouldPopulateGlobalStore() PASSED

TopologyTestDriverEosTest > shouldThrowIfPersistentBuiltInStoreIsAccessedWithUntypedMethod() STARTED

TopologyTestDriverAtLeastOnceTest > shouldCaptureInternalTopicNamesIfWrittenInto() PASSED

TopologyTestDriverAtLeastOnceTest > shouldPunctuateOnWallClockTimeDeprecated() STARTED

TopologyTestDriverAtLeastOnceTest > shouldPunctuateOnWallClockTimeDeprecated() PASSED

TopologyTestDriverAtLeastOnceTest > shouldProcessRecordForTopic() STARTED

TopologyTestDriverAtLeastOnceTest > shouldProcessRecordForTopic() PASSED

TopologyTestDriverAtLeastOnceTest > shouldForwardRecordsFromSubtopologyToSubtopology() STARTED

TopologyTestDriverAtLeastOnceTest > shouldForwardRecordsFromSubtopologyToSubtopology() PASSED

TopologyTestDriverAtLeastOnceTest > shouldNotUpdateStoreForSmallerValue() STARTED

TopologyTestDriverAtLeastOnceTest > shouldNotUpdateStoreForSmallerValue() PASSED

TopologyTestDriverAtLeastOnceTest > shouldCreateStateDirectoryForStatefulTopology() STARTED

TopologyTestDriverEosTest > shouldThrowIfPersistentBuiltInStoreIsAccessedWithUntypedMethod() PASSED

TopologyTestDriverEosTest > shouldAllowPrePopulatingStatesStoresWithCachingEnabled() STARTED

TopologyTestDriverEosTest > shouldAllowPrePopulatingStatesStoresWithCachingEnabled() PASSED

TopologyTestDriverEosTest > shouldReturnCorrectPersistentStoreTypeOnly() STARTED

TopologyTestDriverAtLeastOnceTest > shouldCreateStateDirectoryForStatefulTopology() PASSED

TopologyTestDriverAtLeastOnceTest > shouldNotRequireParameters() STARTED

TopologyTestDriverAtLeastOnceTest > shouldNotRequireParameters() PASSED

TopologyTestDriverAtLeastOnceTest > shouldPunctuateIfWallClockTimeAdvances() STARTED

TopologyTestDriverAtLeastOnceTest > shouldPunctuateIfWallClockTimeAdvances() PASSED

TopologyTestDriverEosTest > shouldReturnCorrectPersistentStoreTypeOnly() PASSED

TopologyTestDriverEosTest > shouldRespectTaskIdling() STARTED

TopologyTestDriverEosTest > shouldRespectTaskIdling() PASSED

TopologyTestDriverEosTest > shouldUseSourceSpecificDeserializers() STARTED

TopologyTestDriverEosTest > shouldUseSourceSpecificDeserializers() PASSED

TopologyTestDriverEosTest > shouldReturnAllStores() STARTED

TopologyTestDriverEosTest > shouldReturnAllStores() PASSED

TopologyTestDriverEosTest > shouldNotCreateStateDirectoryForStatelessTopology() STARTED

TopologyTestDriverEosTest > shouldNotCreateStateDirectoryForStatelessTopology() PASSED

TopologyTestDriverEosTest > shouldApplyGlobalUpdatesCorrectlyInRecursiveTopologies() STARTED

TopologyTestDriverEosTest > shouldApplyGlobalUpdatesCorrectlyInRecursiveTopologies() PASSED

TopologyTestDriverEosTest > shouldReturnAllStoresNames() STARTED

TopologyTestDriverEosTest > shouldReturnAllStoresNames() PASSED

TopologyTestDriverEosTest > shouldPassRecordHeadersIntoSerializersAndDeserializers() STARTED

TopologyTestDriverEosTest > shouldPassRecordHeadersIntoSerializersAndDeserializers() PASSED

TopologyTestDriverEosTest > shouldProcessConsumerRecordList() STARTED

TopologyTestDriverEosTest > shouldProcessConsumerRecordList() PASSED

TopologyTestDriverEosTest > shouldUseSinkSpecificSerializers() STARTED

TopologyTestDriverEosTest > shouldUseSinkSpecificSerializers() PASSED

TopologyTestDriverEosTest > shouldFlushStoreForFirstInput() STARTED

TopologyTestDriverEosTest > shouldFlushStoreForFirstInput() PASSED

TopologyTestDriverEosTest > shouldProcessFromSourceThatMatchPattern() STARTED

TopologyTestDriverEosTest > shouldProcessFromSourceThatMatchPattern() PASSED

TopologyTestDriverEosTest > shouldCaptureSinkTopicNamesIfWrittenInto() STARTED

TopologyTestDriverEosTest > shouldCaptureSinkTopicNamesIfWrittenInto() PASSED

TopologyTestDriverEosTest > shouldUpdateStoreForNewKey() STARTED

TopologyTestDriverEosTest > shouldUpdateStoreForNewKey() PASSED

TopologyTestDriverEosTest > shouldSendRecordViaCorrectSourceTopicDeprecated() STARTED

TopologyTestDriverEosTest > shouldSendRecordViaCorrectSourceTopicDeprecated() PASSED

TopologyTestDriverEosTest > shouldPunctuateOnWallClockTime() STARTED

TopologyTestDriverEosTest > shouldPunctuateOnWallClockTime() PASSED

TopologyTestDriverEosTest > shouldSetRecordMetadata() STARTED

TopologyTestDriverEosTest > shouldSetRecordMetadata() PASSED

TopologyTestDriverEosTest > shouldNotUpdateStoreForLargerValue() STARTED

TopologyTestDriverEosTest > shouldNotUpdateStoreForLargerValue() PASSED

TopologyTestDriverEosTest > shouldReturnCorrectInMemoryStoreTypeOnly() STARTED

TopologyTestDriverEosTest > shouldReturnCorrectInMemoryStoreTypeOnly() PASSED

TopologyTestDriverEosTest > shouldThrowForMissingTime() STARTED

TopologyTestDriverEosTest > shouldThrowForMissingTime() PASSED

TopologyTestDriverEosTest > shouldCaptureInternalTopicNamesIfWrittenInto() STARTED

TopologyTestDriverEosTest > shouldCaptureInternalTopicNamesIfWrittenInto() PASSED

TopologyTestDriverEosTest > shouldPunctuateOnWallClockTimeDeprecated() STARTED

TopologyTestDriverEosTest > shouldPunctuateOnWallClockTimeDeprecated() PASSED

TopologyTestDriverEosTest > shouldProcessRecordForTopic() STARTED

TopologyTestDriverEosTest > shouldProcessRecordForTopic() PASSED

TopologyTestDriverEosTest > shouldForwardRecordsFromSubtopologyToSubtopology() STARTED

TopologyTestDriverEosTest > shouldForwardRecordsFromSubtopologyToSubtopology() PASSED

TopologyTestDriverEosTest > shouldNotUpdateStoreForSmallerValue() STARTED

TopologyTestDriverEosTest > shouldNotUpdateStoreForSmallerValue() PASSED

TopologyTestDriverEosTest > shouldCreateStateDirectoryForStatefulTopology() STARTED

TopologyTestDriverEosTest > shouldCreateStateDirectoryForStatefulTopology() PASSED

TopologyTestDriverEosTest > shouldNotRequireParameters() STARTED

TopologyTestDriverEosTest > shouldNotRequireParameters() PASSED

TopologyTestDriverEosTest > shouldPunctuateIfWallClockTimeAdvances() STARTED

TopologyTestDriverEosTest > shouldPunctuateIfWallClockTimeAdvances() PASSED

> Task :streams:upgrade-system-tests-20:processTestResources NO-SOURCE
> Task :streams:upgrade-system-tests-20:testClasses
> Task :streams:upgrade-system-tests-20:checkstyleTest
> Task :streams:upgrade-system-tests-20:spotbugsMain NO-SOURCE
> Task :streams:upgrade-system-tests-20:test
> Task :streams:upgrade-system-tests-21:compileJava NO-SOURCE
> Task :streams:upgrade-system-tests-21:processResources NO-SOURCE
> Task :streams:upgrade-system-tests-21:classes UP-TO-DATE
> Task :streams:upgrade-system-tests-21:checkstyleMain NO-SOURCE
> Task :streams:upgrade-system-tests-21:compileTestJava
> Task :streams:upgrade-system-tests-21:processTestResources NO-SOURCE
> Task :streams:upgrade-system-tests-21:testClasses
> Task :streams:upgrade-system-tests-21:checkstyleTest
> Task :streams:upgrade-system-tests-21:spotbugsMain NO-SOURCE
> Task :streams:upgrade-system-tests-21:test
> Task :streams:upgrade-system-tests-22:compileJava NO-SOURCE
> Task :streams:upgrade-system-tests-22:processResources NO-SOURCE
> Task :streams:upgrade-system-tests-22:classes UP-TO-DATE
> Task :streams:upgrade-system-tests-22:checkstyleMain NO-SOURCE
> Task :streams:upgrade-system-tests-22:compileTestJava
> Task :streams:upgrade-system-tests-22:processTestResources NO-SOURCE
> Task :streams:upgrade-system-tests-22:testClasses
> Task :streams:upgrade-system-tests-22:checkstyleTest
> Task :streams:upgrade-system-tests-22:spotbugsMain NO-SOURCE
> Task :streams:upgrade-system-tests-22:test
> Task :streams:upgrade-system-tests-23:compileJava NO-SOURCE
> Task :streams:upgrade-system-tests-23:processResources NO-SOURCE
> Task :streams:upgrade-system-tests-23:classes UP-TO-DATE
> Task :streams:upgrade-system-tests-23:checkstyleMain NO-SOURCE
> Task :streams:upgrade-system-tests-23:compileTestJava
> Task :streams:upgrade-system-tests-23:processTestResources NO-SOURCE
> Task :streams:upgrade-system-tests-23:testClasses
> Task :streams:upgrade-system-tests-23:checkstyleTest
> Task :streams:upgrade-system-tests-23:spotbugsMain NO-SOURCE
> Task :streams:upgrade-system-tests-23:test
> Task :streams:upgrade-system-tests-24:compileJava NO-SOURCE
> Task :streams:upgrade-system-tests-24:processResources NO-SOURCE
> Task :streams:upgrade-system-tests-24:classes UP-TO-DATE
> Task :streams:upgrade-system-tests-24:checkstyleMain NO-SOURCE
> Task :streams:upgrade-system-tests-24:compileTestJava
> Task :streams:upgrade-system-tests-24:processTestResources NO-SOURCE
> Task :streams:upgrade-system-tests-24:testClasses
> Task :streams:upgrade-system-tests-24:checkstyleTest
> Task :streams:upgrade-system-tests-24:spotbugsMain NO-SOURCE
> Task :streams:upgrade-system-tests-24:test
> Task :streams:upgrade-system-tests-25:compileJava NO-SOURCE
> Task :streams:upgrade-system-tests-25:processResources NO-SOURCE
> Task :streams:upgrade-system-tests-25:classes UP-TO-DATE
> Task :streams:upgrade-system-tests-25:checkstyleMain NO-SOURCE
> Task :streams:upgrade-system-tests-25:compileTestJava
> Task :streams:upgrade-system-tests-25:processTestResources NO-SOURCE
> Task :streams:upgrade-system-tests-25:testClasses
> Task :streams:upgrade-system-tests-25:checkstyleTest
> Task :streams:upgrade-system-tests-25:spotbugsMain NO-SOURCE
> Task :streams:upgrade-system-tests-25:test
> Task :streams:upgrade-system-tests-26:compileJava NO-SOURCE
> Task :streams:upgrade-system-tests-26:processResources NO-SOURCE
> Task :streams:upgrade-system-tests-26:classes UP-TO-DATE
> Task :streams:upgrade-system-tests-26:checkstyleMain NO-SOURCE
> Task :streams:upgrade-system-tests-26:compileTestJava
> Task :streams:upgrade-system-tests-26:processTestResources NO-SOURCE
> Task :streams:upgrade-system-tests-26:testClasses
> Task :streams:upgrade-system-tests-26:checkstyleTest
> Task :streams:upgrade-system-tests-26:spotbugsMain NO-SOURCE
> Task :streams:upgrade-system-tests-26:test
> Task :streams:upgrade-system-tests-27:compileJava NO-SOURCE
> Task :streams:upgrade-system-tests-27:processResources NO-SOURCE
> Task :streams:upgrade-system-tests-27:classes UP-TO-DATE
> Task :streams:upgrade-system-tests-27:checkstyleMain NO-SOURCE
> Task :streams:upgrade-system-tests-27:compileTestJava
> Task :streams:upgrade-system-tests-27:processTestResources NO-SOURCE
> Task :streams:upgrade-system-tests-27:testClasses
> Task :streams:upgrade-system-tests-27:checkstyleTest
> Task :streams:upgrade-system-tests-27:spotbugsMain NO-SOURCE
> Task :streams:upgrade-system-tests-27:test

FAILURE: Build failed with an exception.

* What went wrong:
Execution failed for task ':streams:test'.
> There were failing tests. See the report at: file://<https://ci-builds.apache.org/job/Kafka/job/kafka-trunk-jdk15/ws/streams/build/reports/tests/test/index.html>

* Try:
Run with --stacktrace option to get the stack trace. Run with --info or --debug option to get more log output. Run with --scan to get full insights.

* Get more help at https://help.gradle.org

Deprecated Gradle features were used in this build, making it incompatible with Gradle 7.0.
Use '--warning-mode all' to show the individual deprecation warnings.
See https://docs.gradle.org/6.7.1/userguide/command_line_interface.html#sec:command_line_warnings

BUILD FAILED in 2h 25m 39s
250 actionable tasks: 214 executed, 36 up-to-date
Build step 'Execute shell' marked build as failure
Recording test results
Not sending mail to unregistered user github@hugo-hirsch.de

Build failed in Jenkins: Kafka » kafka-trunk-jdk15 #410

Posted by Apache Jenkins Server <je...@builds.apache.org>.
See <https://ci-builds.apache.org/job/Kafka/job/kafka-trunk-jdk15/410/display/redirect?page=changes>

Changes:

[github] MINOR: Upstream ApisUtils from kip-500 (#9715)

[github] KAFKA-12208: Rename AdminManager to ZkAdminManager (#9900)

[github] KAFKA-12161; Support raft observers with optional id (#9871)


------------------------------------------
[...truncated 3.65 MB...]
OutputVerifierTest > shouldFailIfValueIsDifferentForCompareValueTimestamp() PASSED

OutputVerifierTest > shouldNotAllowNullProducerRecordForCompareValue() STARTED

OutputVerifierTest > shouldNotAllowNullProducerRecordForCompareValue() PASSED

OutputVerifierTest > shouldFailIfValueIsDifferentWithNullForCompareValueTimestamp() STARTED

OutputVerifierTest > shouldFailIfValueIsDifferentWithNullForCompareValueTimestamp() PASSED

OutputVerifierTest > shouldFailIfKeyIsDifferentForCompareKeyValueTimestamp() STARTED

OutputVerifierTest > shouldFailIfKeyIsDifferentForCompareKeyValueTimestamp() PASSED

OutputVerifierTest > shouldFailIfKeyIsDifferentForCompareKeyValueTimestampWithProducerRecord() STARTED

OutputVerifierTest > shouldFailIfKeyIsDifferentForCompareKeyValueTimestampWithProducerRecord() PASSED

OutputVerifierTest > shouldPassIfValueIsEqualWithNullForCompareValueWithProducerRecord() STARTED

OutputVerifierTest > shouldPassIfValueIsEqualWithNullForCompareValueWithProducerRecord() PASSED

OutputVerifierTest > shouldFailIfValueIsDifferentWithNullReverseForCompareValueTimestamp() STARTED

OutputVerifierTest > shouldFailIfValueIsDifferentWithNullReverseForCompareValueTimestamp() PASSED

OutputVerifierTest > shouldFailIfValueIsDifferentWithNullReverseForCompareValue() STARTED

OutputVerifierTest > shouldFailIfValueIsDifferentWithNullReverseForCompareValue() PASSED

OutputVerifierTest > shouldFailIfTimestampIsDifferentForCompareValueTimestamp() STARTED

OutputVerifierTest > shouldFailIfTimestampIsDifferentForCompareValueTimestamp() PASSED

OutputVerifierTest > shouldPassIfKeyAndValueAndTimestampIsEqualWithNullForCompareKeyValueTimestampWithProducerRecord() STARTED

OutputVerifierTest > shouldPassIfKeyAndValueAndTimestampIsEqualWithNullForCompareKeyValueTimestampWithProducerRecord() PASSED

OutputVerifierTest > shouldFailIfValueIsDifferentWithNullForCompareKeyValueWithProducerRecord() STARTED

OutputVerifierTest > shouldFailIfValueIsDifferentWithNullForCompareKeyValueWithProducerRecord() PASSED

OutputVerifierTest > shouldFailIfValueIsDifferentForCompareKeyValueTimestampWithProducerRecord() STARTED

OutputVerifierTest > shouldFailIfValueIsDifferentForCompareKeyValueTimestampWithProducerRecord() PASSED

OutputVerifierTest > shouldNotAllowNullProducerRecordWithExpectedRecordForCompareValueTimestamp() STARTED

OutputVerifierTest > shouldNotAllowNullProducerRecordWithExpectedRecordForCompareValueTimestamp() PASSED

OutputVerifierTest > shouldNotAllowNullExpectedRecordForCompareValue() STARTED

OutputVerifierTest > shouldNotAllowNullExpectedRecordForCompareValue() PASSED

OutputVerifierTest > shouldFailIfValueIsDifferentWithNullReversForCompareKeyValueTimestampWithProducerRecord() STARTED

OutputVerifierTest > shouldFailIfValueIsDifferentWithNullReversForCompareKeyValueTimestampWithProducerRecord() PASSED

OutputVerifierTest > shouldNotAllowNullProducerRecordForCompareKeyValue() STARTED

OutputVerifierTest > shouldNotAllowNullProducerRecordForCompareKeyValue() PASSED

OutputVerifierTest > shouldFailIfValueIsDifferentWithNullReversForCompareKeyValueWithProducerRecord() STARTED

OutputVerifierTest > shouldFailIfValueIsDifferentWithNullReversForCompareKeyValueWithProducerRecord() PASSED

OutputVerifierTest > shouldPassIfKeyAndValueAndTimestampIsEqualForCompareKeyValueTimestamp() STARTED

OutputVerifierTest > shouldPassIfKeyAndValueAndTimestampIsEqualForCompareKeyValueTimestamp() PASSED

OutputVerifierTest > shouldFailIfValueIsDifferentWithNullForCompareKeyValueTimestampWithProducerRecord() STARTED

OutputVerifierTest > shouldFailIfValueIsDifferentWithNullForCompareKeyValueTimestampWithProducerRecord() PASSED

OutputVerifierTest > shouldFailIfKeyIsDifferentWithNullReversForCompareKeyValueWithProducerRecord() STARTED

OutputVerifierTest > shouldFailIfKeyIsDifferentWithNullReversForCompareKeyValueWithProducerRecord() PASSED

OutputVerifierTest > shouldPassIfKeyAndValueIsEqualWithNullForCompareKeyValueWithProducerRecord() STARTED

OutputVerifierTest > shouldPassIfKeyAndValueIsEqualWithNullForCompareKeyValueWithProducerRecord() PASSED

OutputVerifierTest > shouldFailIfKeyIsDifferentWithNullForCompareKeyValueTimestampWithProducerRecord() STARTED

OutputVerifierTest > shouldFailIfKeyIsDifferentWithNullForCompareKeyValueTimestampWithProducerRecord() PASSED

OutputVerifierTest > shouldFailIfValueIsDifferentForCompareKeyValueTimestamp() STARTED

OutputVerifierTest > shouldFailIfValueIsDifferentForCompareKeyValueTimestamp() PASSED

OutputVerifierTest > shouldPassIfValueAndTimestampIsEqualForCompareValueTimestampWithProducerRecord() STARTED

OutputVerifierTest > shouldPassIfValueAndTimestampIsEqualForCompareValueTimestampWithProducerRecord() PASSED

OutputVerifierTest > shouldFailIfValueIsDifferentWithNullReversForCompareKeyValueTimestamp() STARTED

OutputVerifierTest > shouldFailIfValueIsDifferentWithNullReversForCompareKeyValueTimestamp() PASSED

OutputVerifierTest > shouldFailIfValueIsDifferentWithNullReverseForCompareValueTimestampWithProducerRecord() STARTED

OutputVerifierTest > shouldFailIfValueIsDifferentWithNullReverseForCompareValueTimestampWithProducerRecord() PASSED

KeyValueStoreFacadeTest > shouldReturnIsOpen() STARTED

KeyValueStoreFacadeTest > shouldReturnIsOpen() PASSED

KeyValueStoreFacadeTest > shouldDeleteAndReturnPlainValue() STARTED

KeyValueStoreFacadeTest > shouldDeleteAndReturnPlainValue() PASSED

KeyValueStoreFacadeTest > shouldReturnName() STARTED

KeyValueStoreFacadeTest > shouldReturnName() PASSED

KeyValueStoreFacadeTest > shouldPutWithUnknownTimestamp() STARTED

KeyValueStoreFacadeTest > shouldPutWithUnknownTimestamp() PASSED

KeyValueStoreFacadeTest > shouldPutAllWithUnknownTimestamp() STARTED

KeyValueStoreFacadeTest > shouldPutAllWithUnknownTimestamp() PASSED

KeyValueStoreFacadeTest > shouldReturnIsPersistent() STARTED

KeyValueStoreFacadeTest > shouldReturnIsPersistent() PASSED

KeyValueStoreFacadeTest > shouldForwardDeprecatedInit() STARTED

KeyValueStoreFacadeTest > shouldForwardDeprecatedInit() PASSED

KeyValueStoreFacadeTest > shouldPutIfAbsentWithUnknownTimestamp() STARTED

KeyValueStoreFacadeTest > shouldPutIfAbsentWithUnknownTimestamp() PASSED

KeyValueStoreFacadeTest > shouldForwardClose() STARTED

KeyValueStoreFacadeTest > shouldForwardClose() PASSED

KeyValueStoreFacadeTest > shouldForwardFlush() STARTED

KeyValueStoreFacadeTest > shouldForwardFlush() PASSED

KeyValueStoreFacadeTest > shouldForwardInit() STARTED

KeyValueStoreFacadeTest > shouldForwardInit() PASSED

> Task :streams:upgrade-system-tests-11:spotbugsMain NO-SOURCE
> Task :streams:upgrade-system-tests-11:test
> Task :streams:upgrade-system-tests-20:compileJava NO-SOURCE
> Task :streams:upgrade-system-tests-20:processResources NO-SOURCE
> Task :streams:upgrade-system-tests-20:classes UP-TO-DATE
> Task :streams:upgrade-system-tests-20:checkstyleMain NO-SOURCE
> Task :streams:upgrade-system-tests-20:compileTestJava
> Task :streams:upgrade-system-tests-20:processTestResources NO-SOURCE
> Task :streams:upgrade-system-tests-20:testClasses
> Task :streams:upgrade-system-tests-20:checkstyleTest
> Task :streams:upgrade-system-tests-20:spotbugsMain NO-SOURCE
> Task :streams:upgrade-system-tests-20:test
> Task :streams:upgrade-system-tests-21:compileJava NO-SOURCE
> Task :streams:upgrade-system-tests-21:processResources NO-SOURCE
> Task :streams:upgrade-system-tests-21:classes UP-TO-DATE
> Task :streams:upgrade-system-tests-21:checkstyleMain NO-SOURCE
> Task :streams:upgrade-system-tests-21:compileTestJava
> Task :streams:upgrade-system-tests-21:processTestResources NO-SOURCE
> Task :streams:upgrade-system-tests-21:testClasses
> Task :streams:upgrade-system-tests-21:checkstyleTest
> Task :streams:upgrade-system-tests-21:spotbugsMain NO-SOURCE
> Task :streams:upgrade-system-tests-21:test
> Task :streams:upgrade-system-tests-22:compileJava NO-SOURCE
> Task :streams:upgrade-system-tests-22:processResources NO-SOURCE
> Task :streams:upgrade-system-tests-22:classes UP-TO-DATE
> Task :streams:upgrade-system-tests-22:checkstyleMain NO-SOURCE
> Task :streams:upgrade-system-tests-22:compileTestJava
> Task :streams:upgrade-system-tests-22:processTestResources NO-SOURCE
> Task :streams:upgrade-system-tests-22:testClasses
> Task :streams:upgrade-system-tests-22:checkstyleTest
> Task :streams:upgrade-system-tests-22:spotbugsMain NO-SOURCE
> Task :streams:upgrade-system-tests-22:test
> Task :streams:upgrade-system-tests-23:compileJava NO-SOURCE
> Task :streams:upgrade-system-tests-23:processResources NO-SOURCE
> Task :streams:upgrade-system-tests-23:classes UP-TO-DATE
> Task :streams:upgrade-system-tests-23:checkstyleMain NO-SOURCE
> Task :streams:upgrade-system-tests-23:compileTestJava
> Task :streams:upgrade-system-tests-23:processTestResources NO-SOURCE
> Task :streams:upgrade-system-tests-23:testClasses
> Task :streams:upgrade-system-tests-23:checkstyleTest
> Task :streams:upgrade-system-tests-23:spotbugsMain NO-SOURCE
> Task :streams:upgrade-system-tests-23:test
> Task :streams:upgrade-system-tests-24:compileJava NO-SOURCE
> Task :streams:upgrade-system-tests-24:processResources NO-SOURCE
> Task :streams:upgrade-system-tests-24:classes UP-TO-DATE
> Task :streams:upgrade-system-tests-24:checkstyleMain NO-SOURCE
> Task :streams:upgrade-system-tests-24:compileTestJava
> Task :streams:upgrade-system-tests-24:processTestResources NO-SOURCE
> Task :streams:upgrade-system-tests-24:testClasses
> Task :streams:upgrade-system-tests-24:checkstyleTest
> Task :streams:upgrade-system-tests-24:spotbugsMain NO-SOURCE
> Task :streams:upgrade-system-tests-24:test
> Task :streams:upgrade-system-tests-25:compileJava NO-SOURCE
> Task :streams:upgrade-system-tests-25:processResources NO-SOURCE
> Task :streams:upgrade-system-tests-25:classes UP-TO-DATE
> Task :streams:upgrade-system-tests-25:checkstyleMain NO-SOURCE
> Task :streams:upgrade-system-tests-25:compileTestJava
> Task :streams:upgrade-system-tests-25:processTestResources NO-SOURCE
> Task :streams:upgrade-system-tests-25:testClasses
> Task :streams:upgrade-system-tests-25:checkstyleTest
> Task :streams:upgrade-system-tests-25:spotbugsMain NO-SOURCE
> Task :streams:upgrade-system-tests-25:test
> Task :streams:upgrade-system-tests-26:compileJava NO-SOURCE
> Task :streams:upgrade-system-tests-26:processResources NO-SOURCE
> Task :streams:upgrade-system-tests-26:classes UP-TO-DATE
> Task :streams:upgrade-system-tests-26:checkstyleMain NO-SOURCE
> Task :streams:upgrade-system-tests-26:compileTestJava
> Task :streams:upgrade-system-tests-26:processTestResources NO-SOURCE
> Task :streams:upgrade-system-tests-26:testClasses
> Task :streams:upgrade-system-tests-26:checkstyleTest
> Task :streams:upgrade-system-tests-26:spotbugsMain NO-SOURCE
> Task :streams:upgrade-system-tests-26:test
> Task :streams:upgrade-system-tests-27:compileJava NO-SOURCE
> Task :streams:upgrade-system-tests-27:processResources NO-SOURCE
> Task :streams:upgrade-system-tests-27:classes UP-TO-DATE
> Task :streams:upgrade-system-tests-27:checkstyleMain NO-SOURCE
> Task :streams:upgrade-system-tests-27:compileTestJava
> Task :streams:upgrade-system-tests-27:processTestResources NO-SOURCE
> Task :streams:upgrade-system-tests-27:testClasses
> Task :streams:upgrade-system-tests-27:checkstyleTest
> Task :streams:upgrade-system-tests-27:spotbugsMain NO-SOURCE
> Task :streams:upgrade-system-tests-27:test

FAILURE: Build failed with an exception.

* What went wrong:
Execution failed for task ':streams:test'.
> There were failing tests. See the report at: file://<https://ci-builds.apache.org/job/Kafka/job/kafka-trunk-jdk15/ws/streams/build/reports/tests/test/index.html>

* Try:
Run with --stacktrace option to get the stack trace. Run with --info or --debug option to get more log output. Run with --scan to get full insights.

* Get more help at https://help.gradle.org

Deprecated Gradle features were used in this build, making it incompatible with Gradle 7.0.
Use '--warning-mode all' to show the individual deprecation warnings.
See https://docs.gradle.org/6.7.1/userguide/command_line_interface.html#sec:command_line_warnings

BUILD FAILED in 2h 16m 52s
250 actionable tasks: 214 executed, 36 up-to-date
Build step 'Execute shell' marked build as failure
Recording test results
Not sending mail to unregistered user github@hugo-hirsch.de

Build failed in Jenkins: Kafka » kafka-trunk-jdk15 #409

Posted by Apache Jenkins Server <je...@builds.apache.org>.
See <https://ci-builds.apache.org/job/Kafka/job/kafka-trunk-jdk15/409/display/redirect?page=changes>

Changes:

[github] MINOR: remove unused flag 'hasIdempotentRecords' (#9884)

[github] KAFKA-12198: Migrate connect:json module to JUnit 5 (#9890)


------------------------------------------
[...truncated 3.65 MB...]

WindowedWordCountProcessorTest > shouldWorkWithInMemoryStore() PASSED

WindowedWordCountProcessorTest > shouldWorkWithPersistentStore() STARTED

WindowedWordCountProcessorTest > shouldWorkWithPersistentStore() PASSED

ConsumerRecordFactoryTest > shouldCreateConsumerRecordsFromKeyValuePairs() STARTED

ConsumerRecordFactoryTest > shouldCreateConsumerRecordsFromKeyValuePairs() PASSED

ConsumerRecordFactoryTest > shouldNotAllowToCreateTopicWithNullTopicNameWithNullKeyAndDefaultTimestamp() STARTED

ConsumerRecordFactoryTest > shouldNotAllowToCreateTopicWithNullTopicNameWithNullKeyAndDefaultTimestamp() PASSED

ConsumerRecordFactoryTest > shouldRequireCustomTopicNameIfNotDefaultFactoryTopicNameWithDefaultTimestamp() STARTED

ConsumerRecordFactoryTest > shouldRequireCustomTopicNameIfNotDefaultFactoryTopicNameWithDefaultTimestamp() PASSED

ConsumerRecordFactoryTest > shouldNotAllowToCreateTopicWithNullTopicNameWithNullKey() STARTED

ConsumerRecordFactoryTest > shouldNotAllowToCreateTopicWithNullTopicNameWithNullKey() PASSED

ConsumerRecordFactoryTest > shouldCreateNullKeyConsumerRecordWithOtherTopicNameAndTimestampWithTimetamp() STARTED

ConsumerRecordFactoryTest > shouldCreateNullKeyConsumerRecordWithOtherTopicNameAndTimestampWithTimetamp() PASSED

ConsumerRecordFactoryTest > shouldCreateConsumerRecordWithTimestamp() STARTED

ConsumerRecordFactoryTest > shouldCreateConsumerRecordWithTimestamp() PASSED

ConsumerRecordFactoryTest > shouldNotAllowToCreateTopicWithNullHeaders() STARTED

ConsumerRecordFactoryTest > shouldNotAllowToCreateTopicWithNullHeaders() PASSED

ConsumerRecordFactoryTest > shouldNotAllowToCreateTopicWithNullTopicNameWithDefaultTimestamp() STARTED

ConsumerRecordFactoryTest > shouldNotAllowToCreateTopicWithNullTopicNameWithDefaultTimestamp() PASSED

ConsumerRecordFactoryTest > shouldRequireCustomTopicNameIfNotDefaultFactoryTopicName() STARTED

ConsumerRecordFactoryTest > shouldRequireCustomTopicNameIfNotDefaultFactoryTopicName() PASSED

ConsumerRecordFactoryTest > shouldRequireCustomTopicNameIfNotDefaultFactoryTopicNameWithNullKey() STARTED

ConsumerRecordFactoryTest > shouldRequireCustomTopicNameIfNotDefaultFactoryTopicNameWithNullKey() PASSED

ConsumerRecordFactoryTest > shouldCreateConsumerRecord() STARTED

ConsumerRecordFactoryTest > shouldCreateConsumerRecord() PASSED

ConsumerRecordFactoryTest > shouldCreateNullKeyConsumerRecord() STARTED

ConsumerRecordFactoryTest > shouldCreateNullKeyConsumerRecord() PASSED

ConsumerRecordFactoryTest > shouldCreateConsumerRecordWithOtherTopicName() STARTED

ConsumerRecordFactoryTest > shouldCreateConsumerRecordWithOtherTopicName() PASSED

ConsumerRecordFactoryTest > shouldAdvanceTime() STARTED

ConsumerRecordFactoryTest > shouldAdvanceTime() PASSED

ConsumerRecordFactoryTest > shouldNotAllowToCreateTopicWithNullTopicNameWithKeyValuePairs() STARTED

ConsumerRecordFactoryTest > shouldNotAllowToCreateTopicWithNullTopicNameWithKeyValuePairs() PASSED

ConsumerRecordFactoryTest > shouldRequireCustomTopicNameIfNotDefaultFactoryTopicNameWithKeyValuePairsAndCustomTimestamps() STARTED

ConsumerRecordFactoryTest > shouldRequireCustomTopicNameIfNotDefaultFactoryTopicNameWithKeyValuePairsAndCustomTimestamps() PASSED

ConsumerRecordFactoryTest > shouldRequireCustomTopicNameIfNotDefaultFactoryTopicNameWithKeyValuePairs() STARTED

ConsumerRecordFactoryTest > shouldRequireCustomTopicNameIfNotDefaultFactoryTopicNameWithKeyValuePairs() PASSED

ConsumerRecordFactoryTest > shouldCreateConsumerRecordWithOtherTopicNameAndTimestamp() STARTED

ConsumerRecordFactoryTest > shouldCreateConsumerRecordWithOtherTopicNameAndTimestamp() PASSED

ConsumerRecordFactoryTest > shouldNotAllowToCreateTopicWithNullTopicNameWithKeyValuePairsAndCustomTimestamps() STARTED

ConsumerRecordFactoryTest > shouldNotAllowToCreateTopicWithNullTopicNameWithKeyValuePairsAndCustomTimestamps() PASSED

ConsumerRecordFactoryTest > shouldNotAllowToCreateTopicWithNullTopicName() STARTED

ConsumerRecordFactoryTest > shouldNotAllowToCreateTopicWithNullTopicName() PASSED

ConsumerRecordFactoryTest > shouldCreateConsumerRecordsFromKeyValuePairsWithCustomTimestampAndIncrementsAndNotAdvanceTime() STARTED

ConsumerRecordFactoryTest > shouldCreateConsumerRecordsFromKeyValuePairsWithCustomTimestampAndIncrementsAndNotAdvanceTime() PASSED

ConsumerRecordFactoryTest > shouldCreateNullKeyConsumerRecordWithTimestampWithTimestamp() STARTED

ConsumerRecordFactoryTest > shouldCreateNullKeyConsumerRecordWithTimestampWithTimestamp() PASSED

ConsumerRecordFactoryTest > shouldRequireCustomTopicNameIfNotDefaultFactoryTopicNameWithNullKeyAndDefaultTimestamp() STARTED

ConsumerRecordFactoryTest > shouldRequireCustomTopicNameIfNotDefaultFactoryTopicNameWithNullKeyAndDefaultTimestamp() PASSED

ConsumerRecordFactoryTest > shouldCreateConsumerRecordsFromKeyValuePairsWithTimestampAndIncrements() STARTED

ConsumerRecordFactoryTest > shouldCreateConsumerRecordsFromKeyValuePairsWithTimestampAndIncrements() PASSED

> Task :streams:upgrade-system-tests-0101:processTestResources NO-SOURCE
> Task :streams:upgrade-system-tests-0101:testClasses
> Task :streams:upgrade-system-tests-0101:checkstyleTest
> Task :streams:upgrade-system-tests-0101:spotbugsMain NO-SOURCE
> Task :streams:upgrade-system-tests-0101:test
> Task :streams:upgrade-system-tests-0102:compileJava NO-SOURCE
> Task :streams:upgrade-system-tests-0102:processResources NO-SOURCE
> Task :streams:upgrade-system-tests-0102:classes UP-TO-DATE
> Task :streams:upgrade-system-tests-0102:checkstyleMain NO-SOURCE
> Task :streams:upgrade-system-tests-0102:compileTestJava
> Task :streams:upgrade-system-tests-0102:processTestResources NO-SOURCE
> Task :streams:upgrade-system-tests-0102:testClasses
> Task :streams:upgrade-system-tests-0102:checkstyleTest
> Task :streams:upgrade-system-tests-0102:spotbugsMain NO-SOURCE
> Task :streams:upgrade-system-tests-0102:test
> Task :streams:upgrade-system-tests-0110:compileJava NO-SOURCE
> Task :streams:upgrade-system-tests-0110:processResources NO-SOURCE
> Task :streams:upgrade-system-tests-0110:classes UP-TO-DATE
> Task :streams:upgrade-system-tests-0110:checkstyleMain NO-SOURCE
> Task :streams:upgrade-system-tests-0110:compileTestJava
> Task :streams:upgrade-system-tests-0110:processTestResources NO-SOURCE
> Task :streams:upgrade-system-tests-0110:testClasses
> Task :streams:upgrade-system-tests-0110:checkstyleTest
> Task :streams:upgrade-system-tests-0110:spotbugsMain NO-SOURCE
> Task :streams:upgrade-system-tests-0110:test
> Task :streams:upgrade-system-tests-10:compileJava NO-SOURCE
> Task :streams:upgrade-system-tests-10:processResources NO-SOURCE
> Task :streams:upgrade-system-tests-10:classes UP-TO-DATE
> Task :streams:upgrade-system-tests-10:checkstyleMain NO-SOURCE
> Task :streams:upgrade-system-tests-10:compileTestJava
> Task :streams:upgrade-system-tests-10:processTestResources NO-SOURCE
> Task :streams:upgrade-system-tests-10:testClasses
> Task :streams:upgrade-system-tests-10:checkstyleTest
> Task :streams:upgrade-system-tests-10:spotbugsMain NO-SOURCE
> Task :streams:upgrade-system-tests-10:test
> Task :streams:upgrade-system-tests-11:compileJava NO-SOURCE
> Task :streams:upgrade-system-tests-11:processResources NO-SOURCE
> Task :streams:upgrade-system-tests-11:classes UP-TO-DATE
> Task :streams:upgrade-system-tests-11:checkstyleMain NO-SOURCE
> Task :streams:upgrade-system-tests-11:compileTestJava
> Task :streams:upgrade-system-tests-11:processTestResources NO-SOURCE
> Task :streams:upgrade-system-tests-11:testClasses
> Task :streams:upgrade-system-tests-11:checkstyleTest
> Task :streams:upgrade-system-tests-11:spotbugsMain NO-SOURCE
> Task :streams:upgrade-system-tests-11:test
> Task :streams:upgrade-system-tests-20:compileJava NO-SOURCE
> Task :streams:upgrade-system-tests-20:processResources NO-SOURCE
> Task :streams:upgrade-system-tests-20:classes UP-TO-DATE
> Task :streams:upgrade-system-tests-20:checkstyleMain NO-SOURCE
> Task :streams:upgrade-system-tests-20:compileTestJava
> Task :streams:upgrade-system-tests-20:processTestResources NO-SOURCE
> Task :streams:upgrade-system-tests-20:testClasses
> Task :streams:upgrade-system-tests-20:checkstyleTest
> Task :streams:upgrade-system-tests-20:spotbugsMain NO-SOURCE
> Task :streams:upgrade-system-tests-20:test
> Task :streams:upgrade-system-tests-21:compileJava NO-SOURCE
> Task :streams:upgrade-system-tests-21:processResources NO-SOURCE
> Task :streams:upgrade-system-tests-21:classes UP-TO-DATE
> Task :streams:upgrade-system-tests-21:checkstyleMain NO-SOURCE
> Task :streams:upgrade-system-tests-21:compileTestJava
> Task :streams:upgrade-system-tests-21:processTestResources NO-SOURCE
> Task :streams:upgrade-system-tests-21:testClasses
> Task :streams:upgrade-system-tests-21:checkstyleTest
> Task :streams:upgrade-system-tests-21:spotbugsMain NO-SOURCE
> Task :streams:upgrade-system-tests-21:test
> Task :streams:upgrade-system-tests-22:compileJava NO-SOURCE
> Task :streams:upgrade-system-tests-22:processResources NO-SOURCE
> Task :streams:upgrade-system-tests-22:classes UP-TO-DATE
> Task :streams:upgrade-system-tests-22:checkstyleMain NO-SOURCE
> Task :streams:upgrade-system-tests-22:compileTestJava
> Task :streams:upgrade-system-tests-22:processTestResources NO-SOURCE
> Task :streams:upgrade-system-tests-22:testClasses
> Task :streams:upgrade-system-tests-22:checkstyleTest
> Task :streams:upgrade-system-tests-22:spotbugsMain NO-SOURCE
> Task :streams:upgrade-system-tests-22:test
> Task :streams:upgrade-system-tests-23:compileJava NO-SOURCE
> Task :streams:upgrade-system-tests-23:processResources NO-SOURCE
> Task :streams:upgrade-system-tests-23:classes UP-TO-DATE
> Task :streams:upgrade-system-tests-23:checkstyleMain NO-SOURCE
> Task :streams:upgrade-system-tests-23:compileTestJava
> Task :streams:upgrade-system-tests-23:processTestResources NO-SOURCE
> Task :streams:upgrade-system-tests-23:testClasses
> Task :streams:upgrade-system-tests-23:checkstyleTest
> Task :streams:upgrade-system-tests-23:spotbugsMain NO-SOURCE
> Task :streams:upgrade-system-tests-23:test
> Task :streams:upgrade-system-tests-24:compileJava NO-SOURCE
> Task :streams:upgrade-system-tests-24:processResources NO-SOURCE
> Task :streams:upgrade-system-tests-24:classes UP-TO-DATE
> Task :streams:upgrade-system-tests-24:checkstyleMain NO-SOURCE
> Task :streams:upgrade-system-tests-24:compileTestJava
> Task :streams:upgrade-system-tests-24:processTestResources NO-SOURCE
> Task :streams:upgrade-system-tests-24:testClasses
> Task :streams:upgrade-system-tests-24:checkstyleTest
> Task :streams:upgrade-system-tests-24:spotbugsMain NO-SOURCE
> Task :streams:upgrade-system-tests-24:test
> Task :streams:upgrade-system-tests-25:compileJava NO-SOURCE
> Task :streams:upgrade-system-tests-25:processResources NO-SOURCE
> Task :streams:upgrade-system-tests-25:classes UP-TO-DATE
> Task :streams:upgrade-system-tests-25:checkstyleMain NO-SOURCE
> Task :streams:upgrade-system-tests-25:compileTestJava
> Task :streams:upgrade-system-tests-25:processTestResources NO-SOURCE
> Task :streams:upgrade-system-tests-25:testClasses
> Task :streams:upgrade-system-tests-25:checkstyleTest
> Task :streams:upgrade-system-tests-25:spotbugsMain NO-SOURCE
> Task :streams:upgrade-system-tests-25:test
> Task :streams:upgrade-system-tests-26:compileJava NO-SOURCE
> Task :streams:upgrade-system-tests-26:processResources NO-SOURCE
> Task :streams:upgrade-system-tests-26:classes UP-TO-DATE
> Task :streams:upgrade-system-tests-26:checkstyleMain NO-SOURCE
> Task :streams:upgrade-system-tests-26:compileTestJava
> Task :streams:upgrade-system-tests-26:processTestResources NO-SOURCE
> Task :streams:upgrade-system-tests-26:testClasses
> Task :streams:upgrade-system-tests-26:checkstyleTest
> Task :streams:upgrade-system-tests-26:spotbugsMain NO-SOURCE
> Task :streams:upgrade-system-tests-26:test
> Task :streams:upgrade-system-tests-27:compileJava NO-SOURCE
> Task :streams:upgrade-system-tests-27:processResources NO-SOURCE
> Task :streams:upgrade-system-tests-27:classes UP-TO-DATE
> Task :streams:upgrade-system-tests-27:checkstyleMain NO-SOURCE
> Task :streams:upgrade-system-tests-27:compileTestJava
> Task :streams:upgrade-system-tests-27:processTestResources NO-SOURCE
> Task :streams:upgrade-system-tests-27:testClasses
> Task :streams:upgrade-system-tests-27:checkstyleTest
> Task :streams:upgrade-system-tests-27:spotbugsMain NO-SOURCE
> Task :streams:upgrade-system-tests-27:test

FAILURE: Build failed with an exception.

* What went wrong:
Execution failed for task ':clients:test'.
> There were failing tests. See the report at: file://<https://ci-builds.apache.org/job/Kafka/job/kafka-trunk-jdk15/ws/clients/build/reports/tests/test/index.html>

* Try:
Run with --stacktrace option to get the stack trace. Run with --info or --debug option to get more log output. Run with --scan to get full insights.

* Get more help at https://help.gradle.org

Deprecated Gradle features were used in this build, making it incompatible with Gradle 7.0.
Use '--warning-mode all' to show the individual deprecation warnings.
See https://docs.gradle.org/6.7.1/userguide/command_line_interface.html#sec:command_line_warnings

BUILD FAILED in 2h 22m 50s
250 actionable tasks: 214 executed, 36 up-to-date
Build step 'Execute shell' marked build as failure
Recording test results
Not sending mail to unregistered user github@hugo-hirsch.de

Build failed in Jenkins: Kafka » kafka-trunk-jdk15 #408

Posted by Apache Jenkins Server <je...@builds.apache.org>.
See <https://ci-builds.apache.org/job/Kafka/job/kafka-trunk-jdk15/408/display/redirect?page=changes>

Changes:

[github] MINOR: Remove incorrect code in metadata module build (#9897)

[github] KAFKA-12206: o.a.k.common.Uuid should implement Comparable (#9896)


------------------------------------------
[...truncated 3.65 MB...]
TopologyTestDriverEosTest > shouldUseSourceSpecificDeserializers() PASSED

TopologyTestDriverEosTest > shouldReturnAllStores() STARTED

TopologyTestDriverEosTest > shouldReturnAllStores() PASSED

TopologyTestDriverEosTest > shouldNotCreateStateDirectoryForStatelessTopology() STARTED

TopologyTestDriverEosTest > shouldNotCreateStateDirectoryForStatelessTopology() PASSED

TopologyTestDriverEosTest > shouldApplyGlobalUpdatesCorrectlyInRecursiveTopologies() STARTED

TopologyTestDriverEosTest > shouldApplyGlobalUpdatesCorrectlyInRecursiveTopologies() PASSED

TopologyTestDriverEosTest > shouldReturnAllStoresNames() STARTED

TopologyTestDriverEosTest > shouldReturnAllStoresNames() PASSED

TopologyTestDriverEosTest > shouldPassRecordHeadersIntoSerializersAndDeserializers() STARTED

TopologyTestDriverEosTest > shouldPassRecordHeadersIntoSerializersAndDeserializers() PASSED

TopologyTestDriverEosTest > shouldProcessConsumerRecordList() STARTED

TopologyTestDriverEosTest > shouldProcessConsumerRecordList() PASSED

TopologyTestDriverEosTest > shouldUseSinkSpecificSerializers() STARTED

TopologyTestDriverEosTest > shouldUseSinkSpecificSerializers() PASSED

TopologyTestDriverEosTest > shouldFlushStoreForFirstInput() STARTED

TopologyTestDriverEosTest > shouldFlushStoreForFirstInput() PASSED

TopologyTestDriverEosTest > shouldProcessFromSourceThatMatchPattern() STARTED

TopologyTestDriverEosTest > shouldProcessFromSourceThatMatchPattern() PASSED

TopologyTestDriverEosTest > shouldCaptureSinkTopicNamesIfWrittenInto() STARTED

TopologyTestDriverEosTest > shouldCaptureSinkTopicNamesIfWrittenInto() PASSED

TopologyTestDriverEosTest > shouldUpdateStoreForNewKey() STARTED

TopologyTestDriverEosTest > shouldUpdateStoreForNewKey() PASSED

TopologyTestDriverEosTest > shouldSendRecordViaCorrectSourceTopicDeprecated() STARTED

TopologyTestDriverEosTest > shouldSendRecordViaCorrectSourceTopicDeprecated() PASSED

TopologyTestDriverEosTest > shouldPunctuateOnWallClockTime() STARTED

TopologyTestDriverEosTest > shouldPunctuateOnWallClockTime() PASSED

TopologyTestDriverEosTest > shouldSetRecordMetadata() STARTED

TopologyTestDriverEosTest > shouldSetRecordMetadata() PASSED

TopologyTestDriverEosTest > shouldNotUpdateStoreForLargerValue() STARTED

TopologyTestDriverEosTest > shouldNotUpdateStoreForLargerValue() PASSED

TopologyTestDriverEosTest > shouldReturnCorrectInMemoryStoreTypeOnly() STARTED

TopologyTestDriverEosTest > shouldReturnCorrectInMemoryStoreTypeOnly() PASSED

TopologyTestDriverEosTest > shouldThrowForMissingTime() STARTED

TopologyTestDriverEosTest > shouldThrowForMissingTime() PASSED

TopologyTestDriverEosTest > shouldCaptureInternalTopicNamesIfWrittenInto() STARTED

TopologyTestDriverEosTest > shouldCaptureInternalTopicNamesIfWrittenInto() PASSED

TopologyTestDriverEosTest > shouldPunctuateOnWallClockTimeDeprecated() STARTED

TopologyTestDriverEosTest > shouldPunctuateOnWallClockTimeDeprecated() PASSED

TopologyTestDriverEosTest > shouldProcessRecordForTopic() STARTED

TopologyTestDriverEosTest > shouldProcessRecordForTopic() PASSED

TopologyTestDriverEosTest > shouldForwardRecordsFromSubtopologyToSubtopology() STARTED

TopologyTestDriverEosTest > shouldForwardRecordsFromSubtopologyToSubtopology() PASSED

TopologyTestDriverEosTest > shouldNotUpdateStoreForSmallerValue() STARTED

TopologyTestDriverEosTest > shouldNotUpdateStoreForSmallerValue() PASSED

TopologyTestDriverEosTest > shouldCreateStateDirectoryForStatefulTopology() STARTED

TopologyTestDriverEosTest > shouldCreateStateDirectoryForStatefulTopology() PASSED

TopologyTestDriverEosTest > shouldNotRequireParameters() STARTED

TopologyTestDriverEosTest > shouldNotRequireParameters() PASSED

TopologyTestDriverEosTest > shouldPunctuateIfWallClockTimeAdvances() STARTED

TopologyTestDriverEosTest > shouldPunctuateIfWallClockTimeAdvances() PASSED

WindowStoreFacadeTest > shouldReturnIsOpen() STARTED

WindowStoreFacadeTest > shouldReturnIsOpen() PASSED

WindowStoreFacadeTest > shouldReturnName() STARTED

WindowStoreFacadeTest > shouldReturnName() PASSED

WindowStoreFacadeTest > shouldPutWithUnknownTimestamp() STARTED

WindowStoreFacadeTest > shouldPutWithUnknownTimestamp() PASSED

WindowStoreFacadeTest > shouldPutWindowStartTimestampWithUnknownTimestamp() STARTED

WindowStoreFacadeTest > shouldPutWindowStartTimestampWithUnknownTimestamp() PASSED

WindowStoreFacadeTest > shouldReturnIsPersistent() STARTED

WindowStoreFacadeTest > shouldReturnIsPersistent() PASSED

WindowStoreFacadeTest > shouldForwardDeprecatedInit() STARTED

WindowStoreFacadeTest > shouldForwardDeprecatedInit() PASSED

WindowStoreFacadeTest > shouldForwardClose() STARTED

WindowStoreFacadeTest > shouldForwardClose() PASSED

WindowStoreFacadeTest > shouldForwardFlush() STARTED

WindowStoreFacadeTest > shouldForwardFlush() PASSED

WindowStoreFacadeTest > shouldForwardInit() STARTED

WindowStoreFacadeTest > shouldForwardInit() PASSED

> Task :streams:upgrade-system-tests-11:compileJava NO-SOURCE
> Task :streams:upgrade-system-tests-11:processResources NO-SOURCE
> Task :streams:upgrade-system-tests-11:classes UP-TO-DATE
> Task :streams:upgrade-system-tests-11:checkstyleMain NO-SOURCE
> Task :streams:upgrade-system-tests-11:compileTestJava
> Task :streams:upgrade-system-tests-11:processTestResources NO-SOURCE
> Task :streams:upgrade-system-tests-11:testClasses
> Task :streams:upgrade-system-tests-11:checkstyleTest
> Task :streams:upgrade-system-tests-11:spotbugsMain NO-SOURCE
> Task :streams:upgrade-system-tests-11:test
> Task :streams:upgrade-system-tests-20:compileJava NO-SOURCE
> Task :streams:upgrade-system-tests-20:processResources NO-SOURCE
> Task :streams:upgrade-system-tests-20:classes UP-TO-DATE
> Task :streams:upgrade-system-tests-20:checkstyleMain NO-SOURCE
> Task :streams:upgrade-system-tests-20:compileTestJava
> Task :streams:upgrade-system-tests-20:processTestResources NO-SOURCE
> Task :streams:upgrade-system-tests-20:testClasses
> Task :streams:upgrade-system-tests-20:checkstyleTest
> Task :streams:upgrade-system-tests-20:spotbugsMain NO-SOURCE
> Task :streams:upgrade-system-tests-20:test
> Task :streams:upgrade-system-tests-21:compileJava NO-SOURCE
> Task :streams:upgrade-system-tests-21:processResources NO-SOURCE
> Task :streams:upgrade-system-tests-21:classes UP-TO-DATE
> Task :streams:upgrade-system-tests-21:checkstyleMain NO-SOURCE
> Task :streams:upgrade-system-tests-21:compileTestJava
> Task :streams:upgrade-system-tests-21:processTestResources NO-SOURCE
> Task :streams:upgrade-system-tests-21:testClasses
> Task :streams:upgrade-system-tests-21:checkstyleTest
> Task :streams:upgrade-system-tests-21:spotbugsMain NO-SOURCE
> Task :streams:upgrade-system-tests-21:test
> Task :streams:upgrade-system-tests-22:compileJava NO-SOURCE
> Task :streams:upgrade-system-tests-22:processResources NO-SOURCE
> Task :streams:upgrade-system-tests-22:classes UP-TO-DATE
> Task :streams:upgrade-system-tests-22:checkstyleMain NO-SOURCE
> Task :streams:upgrade-system-tests-22:compileTestJava
> Task :streams:upgrade-system-tests-22:processTestResources NO-SOURCE
> Task :streams:upgrade-system-tests-22:testClasses
> Task :streams:upgrade-system-tests-22:checkstyleTest
> Task :streams:upgrade-system-tests-22:spotbugsMain NO-SOURCE
> Task :streams:upgrade-system-tests-22:test
> Task :streams:upgrade-system-tests-23:compileJava NO-SOURCE
> Task :streams:upgrade-system-tests-23:processResources NO-SOURCE
> Task :streams:upgrade-system-tests-23:classes UP-TO-DATE
> Task :streams:upgrade-system-tests-23:checkstyleMain NO-SOURCE
> Task :streams:upgrade-system-tests-23:compileTestJava
> Task :streams:upgrade-system-tests-23:processTestResources NO-SOURCE
> Task :streams:upgrade-system-tests-23:testClasses
> Task :streams:upgrade-system-tests-23:checkstyleTest
> Task :streams:upgrade-system-tests-23:spotbugsMain NO-SOURCE
> Task :streams:upgrade-system-tests-23:test
> Task :streams:upgrade-system-tests-24:compileJava NO-SOURCE
> Task :streams:upgrade-system-tests-24:processResources NO-SOURCE
> Task :streams:upgrade-system-tests-24:classes UP-TO-DATE
> Task :streams:upgrade-system-tests-24:checkstyleMain NO-SOURCE
> Task :streams:upgrade-system-tests-24:compileTestJava
> Task :streams:upgrade-system-tests-24:processTestResources NO-SOURCE
> Task :streams:upgrade-system-tests-24:testClasses
> Task :streams:upgrade-system-tests-24:checkstyleTest
> Task :streams:upgrade-system-tests-24:spotbugsMain NO-SOURCE
> Task :streams:upgrade-system-tests-24:test
> Task :streams:upgrade-system-tests-25:compileJava NO-SOURCE
> Task :streams:upgrade-system-tests-25:processResources NO-SOURCE
> Task :streams:upgrade-system-tests-25:classes UP-TO-DATE
> Task :streams:upgrade-system-tests-25:checkstyleMain NO-SOURCE
> Task :streams:upgrade-system-tests-25:compileTestJava
> Task :streams:upgrade-system-tests-25:processTestResources NO-SOURCE
> Task :streams:upgrade-system-tests-25:testClasses
> Task :streams:upgrade-system-tests-25:checkstyleTest
> Task :streams:upgrade-system-tests-25:spotbugsMain NO-SOURCE
> Task :streams:upgrade-system-tests-25:test
> Task :streams:upgrade-system-tests-26:compileJava NO-SOURCE
> Task :streams:upgrade-system-tests-26:processResources NO-SOURCE
> Task :streams:upgrade-system-tests-26:classes UP-TO-DATE
> Task :streams:upgrade-system-tests-26:checkstyleMain NO-SOURCE
> Task :streams:upgrade-system-tests-26:compileTestJava
> Task :streams:upgrade-system-tests-26:processTestResources NO-SOURCE
> Task :streams:upgrade-system-tests-26:testClasses
> Task :streams:upgrade-system-tests-26:checkstyleTest
> Task :streams:upgrade-system-tests-26:spotbugsMain NO-SOURCE
> Task :streams:upgrade-system-tests-26:test
> Task :streams:upgrade-system-tests-27:compileJava NO-SOURCE
> Task :streams:upgrade-system-tests-27:processResources NO-SOURCE
> Task :streams:upgrade-system-tests-27:classes UP-TO-DATE
> Task :streams:upgrade-system-tests-27:checkstyleMain NO-SOURCE
> Task :streams:upgrade-system-tests-27:compileTestJava
> Task :streams:upgrade-system-tests-27:processTestResources NO-SOURCE
> Task :streams:upgrade-system-tests-27:testClasses
> Task :streams:upgrade-system-tests-27:checkstyleTest
> Task :streams:upgrade-system-tests-27:spotbugsMain NO-SOURCE
> Task :streams:upgrade-system-tests-27:test

FAILURE: Build failed with an exception.

* What went wrong:
Execution failed for task ':core:test'.
> There were failing tests. See the report at: file://<https://ci-builds.apache.org/job/Kafka/job/kafka-trunk-jdk15/ws/core/build/reports/tests/test/index.html>

* Try:
Run with --stacktrace option to get the stack trace. Run with --info or --debug option to get more log output. Run with --scan to get full insights.

* Get more help at https://help.gradle.org

Deprecated Gradle features were used in this build, making it incompatible with Gradle 7.0.
Use '--warning-mode all' to show the individual deprecation warnings.
See https://docs.gradle.org/6.7.1/userguide/command_line_interface.html#sec:command_line_warnings

BUILD FAILED in 2h 30m 28s
250 actionable tasks: 214 executed, 36 up-to-date
Build step 'Execute shell' marked build as failure
Recording test results
Not sending mail to unregistered user github@hugo-hirsch.de

Build failed in Jenkins: Kafka » kafka-trunk-jdk15 #407

Posted by Apache Jenkins Server <je...@builds.apache.org>.
See <https://ci-builds.apache.org/job/Kafka/job/kafka-trunk-jdk15/407/display/redirect?page=changes>

Changes:

[github] KAFKA-12189 ShellTest can replace 'assumeTrue' by (junit 5) conditional test (#9898)

[github] KAFKA-12191 SslTransportTls12Tls13Test can replace 'assumeTrue' by (junit 5) conditional test (#9899)


------------------------------------------
[...truncated 3.65 MB...]
MockProcessorContextStateStoreTest > builder = org.apache.kafka.streams.state.internals.WindowStoreBuilder@4f48f2e5, timestamped = false, caching = false, logging = true STARTED

MockProcessorContextStateStoreTest > builder = org.apache.kafka.streams.state.internals.WindowStoreBuilder@4f48f2e5, timestamped = false, caching = false, logging = true PASSED

MockProcessorContextStateStoreTest > builder = org.apache.kafka.streams.state.internals.WindowStoreBuilder@6a2f400e, timestamped = false, caching = false, logging = false STARTED

MockProcessorContextStateStoreTest > builder = org.apache.kafka.streams.state.internals.WindowStoreBuilder@6a2f400e, timestamped = false, caching = false, logging = false PASSED

MockProcessorContextStateStoreTest > builder = org.apache.kafka.streams.state.internals.WindowStoreBuilder@74257e5d, timestamped = false, caching = false, logging = false STARTED

MockProcessorContextStateStoreTest > builder = org.apache.kafka.streams.state.internals.WindowStoreBuilder@74257e5d, timestamped = false, caching = false, logging = false PASSED

MockProcessorContextStateStoreTest > builder = org.apache.kafka.streams.state.internals.WindowStoreBuilder@154022ab, timestamped = false, caching = false, logging = false STARTED

MockProcessorContextStateStoreTest > builder = org.apache.kafka.streams.state.internals.WindowStoreBuilder@154022ab, timestamped = false, caching = false, logging = false PASSED

MockProcessorContextStateStoreTest > builder = org.apache.kafka.streams.state.internals.SessionStoreBuilder@37681333, timestamped = false, caching = true, logging = true STARTED

MockProcessorContextStateStoreTest > builder = org.apache.kafka.streams.state.internals.SessionStoreBuilder@37681333, timestamped = false, caching = true, logging = true PASSED

MockProcessorContextStateStoreTest > builder = org.apache.kafka.streams.state.internals.SessionStoreBuilder@6cc4063d, timestamped = false, caching = true, logging = true STARTED

MockProcessorContextStateStoreTest > builder = org.apache.kafka.streams.state.internals.SessionStoreBuilder@6cc4063d, timestamped = false, caching = true, logging = true PASSED

MockProcessorContextStateStoreTest > builder = org.apache.kafka.streams.state.internals.SessionStoreBuilder@7a4ca735, timestamped = false, caching = true, logging = false STARTED

MockProcessorContextStateStoreTest > builder = org.apache.kafka.streams.state.internals.SessionStoreBuilder@7a4ca735, timestamped = false, caching = true, logging = false PASSED

MockProcessorContextStateStoreTest > builder = org.apache.kafka.streams.state.internals.SessionStoreBuilder@70567e4b, timestamped = false, caching = true, logging = false STARTED

MockProcessorContextStateStoreTest > builder = org.apache.kafka.streams.state.internals.SessionStoreBuilder@70567e4b, timestamped = false, caching = true, logging = false PASSED

MockProcessorContextStateStoreTest > builder = org.apache.kafka.streams.state.internals.SessionStoreBuilder@1f742195, timestamped = false, caching = false, logging = true STARTED

MockProcessorContextStateStoreTest > builder = org.apache.kafka.streams.state.internals.SessionStoreBuilder@1f742195, timestamped = false, caching = false, logging = true PASSED

MockProcessorContextStateStoreTest > builder = org.apache.kafka.streams.state.internals.SessionStoreBuilder@22018cd3, timestamped = false, caching = false, logging = true STARTED

MockProcessorContextStateStoreTest > builder = org.apache.kafka.streams.state.internals.SessionStoreBuilder@22018cd3, timestamped = false, caching = false, logging = true PASSED

MockProcessorContextStateStoreTest > builder = org.apache.kafka.streams.state.internals.SessionStoreBuilder@5bc19e0c, timestamped = false, caching = false, logging = false STARTED

MockProcessorContextStateStoreTest > builder = org.apache.kafka.streams.state.internals.SessionStoreBuilder@5bc19e0c, timestamped = false, caching = false, logging = false PASSED

MockProcessorContextStateStoreTest > builder = org.apache.kafka.streams.state.internals.SessionStoreBuilder@130a63eb, timestamped = false, caching = false, logging = false STARTED

MockProcessorContextStateStoreTest > builder = org.apache.kafka.streams.state.internals.SessionStoreBuilder@130a63eb, timestamped = false, caching = false, logging = false PASSED

TestRecordTest > testConsumerRecord() STARTED

TestRecordTest > testConsumerRecord() PASSED

TestRecordTest > testToString() STARTED

TestRecordTest > testToString() PASSED

TestRecordTest > testInvalidRecords() STARTED

TestRecordTest > testInvalidRecords() PASSED

TestRecordTest > testPartialConstructorEquals() STARTED

TestRecordTest > testPartialConstructorEquals() PASSED

TestRecordTest > testMultiFieldMatcher() STARTED

TestRecordTest > testMultiFieldMatcher() PASSED

TestRecordTest > testFields() STARTED

TestRecordTest > testFields() PASSED

TestRecordTest > testProducerRecord() STARTED

TestRecordTest > testProducerRecord() PASSED

TestRecordTest > testEqualsAndHashCode() STARTED

TestRecordTest > testEqualsAndHashCode() PASSED

> Task :streams:upgrade-system-tests-0100:processTestResources NO-SOURCE
> Task :streams:upgrade-system-tests-0100:testClasses
> Task :streams:upgrade-system-tests-0100:checkstyleTest
> Task :streams:upgrade-system-tests-0100:spotbugsMain NO-SOURCE
> Task :streams:upgrade-system-tests-0100:test
> Task :streams:upgrade-system-tests-0101:compileJava NO-SOURCE
> Task :streams:upgrade-system-tests-0101:processResources NO-SOURCE
> Task :streams:upgrade-system-tests-0101:classes UP-TO-DATE
> Task :streams:upgrade-system-tests-0101:checkstyleMain NO-SOURCE
> Task :streams:upgrade-system-tests-0101:compileTestJava
> Task :streams:upgrade-system-tests-0101:processTestResources NO-SOURCE
> Task :streams:upgrade-system-tests-0101:testClasses
> Task :streams:upgrade-system-tests-0101:checkstyleTest
> Task :streams:upgrade-system-tests-0101:spotbugsMain NO-SOURCE
> Task :streams:upgrade-system-tests-0101:test
> Task :streams:upgrade-system-tests-0102:compileJava NO-SOURCE
> Task :streams:upgrade-system-tests-0102:processResources NO-SOURCE
> Task :streams:upgrade-system-tests-0102:classes UP-TO-DATE
> Task :streams:upgrade-system-tests-0102:checkstyleMain NO-SOURCE
> Task :streams:upgrade-system-tests-0102:compileTestJava
> Task :streams:upgrade-system-tests-0102:processTestResources NO-SOURCE
> Task :streams:upgrade-system-tests-0102:testClasses
> Task :streams:upgrade-system-tests-0102:checkstyleTest
> Task :streams:upgrade-system-tests-0102:spotbugsMain NO-SOURCE
> Task :streams:upgrade-system-tests-0102:test
> Task :streams:upgrade-system-tests-0110:compileJava NO-SOURCE
> Task :streams:upgrade-system-tests-0110:processResources NO-SOURCE
> Task :streams:upgrade-system-tests-0110:classes UP-TO-DATE
> Task :streams:upgrade-system-tests-0110:checkstyleMain NO-SOURCE
> Task :streams:upgrade-system-tests-0110:compileTestJava
> Task :streams:upgrade-system-tests-0110:processTestResources NO-SOURCE
> Task :streams:upgrade-system-tests-0110:testClasses
> Task :streams:upgrade-system-tests-0110:checkstyleTest
> Task :streams:upgrade-system-tests-0110:spotbugsMain NO-SOURCE
> Task :streams:upgrade-system-tests-0110:test
> Task :streams:upgrade-system-tests-10:compileJava NO-SOURCE
> Task :streams:upgrade-system-tests-10:processResources NO-SOURCE
> Task :streams:upgrade-system-tests-10:classes UP-TO-DATE
> Task :streams:upgrade-system-tests-10:checkstyleMain NO-SOURCE
> Task :streams:upgrade-system-tests-10:compileTestJava
> Task :streams:upgrade-system-tests-10:processTestResources NO-SOURCE
> Task :streams:upgrade-system-tests-10:testClasses
> Task :streams:upgrade-system-tests-10:checkstyleTest
> Task :streams:upgrade-system-tests-10:spotbugsMain NO-SOURCE
> Task :streams:upgrade-system-tests-10:test
> Task :streams:upgrade-system-tests-11:compileJava NO-SOURCE
> Task :streams:upgrade-system-tests-11:processResources NO-SOURCE
> Task :streams:upgrade-system-tests-11:classes UP-TO-DATE
> Task :streams:upgrade-system-tests-11:checkstyleMain NO-SOURCE
> Task :streams:upgrade-system-tests-11:compileTestJava
> Task :streams:upgrade-system-tests-11:processTestResources NO-SOURCE
> Task :streams:upgrade-system-tests-11:testClasses
> Task :streams:upgrade-system-tests-11:checkstyleTest
> Task :streams:upgrade-system-tests-11:spotbugsMain NO-SOURCE
> Task :streams:upgrade-system-tests-11:test
> Task :streams:upgrade-system-tests-20:compileJava NO-SOURCE
> Task :streams:upgrade-system-tests-20:processResources NO-SOURCE
> Task :streams:upgrade-system-tests-20:classes UP-TO-DATE
> Task :streams:upgrade-system-tests-20:checkstyleMain NO-SOURCE
> Task :streams:upgrade-system-tests-20:compileTestJava
> Task :streams:upgrade-system-tests-20:processTestResources NO-SOURCE
> Task :streams:upgrade-system-tests-20:testClasses
> Task :streams:upgrade-system-tests-20:checkstyleTest
> Task :streams:upgrade-system-tests-20:spotbugsMain NO-SOURCE
> Task :streams:upgrade-system-tests-20:test
> Task :streams:upgrade-system-tests-21:compileJava NO-SOURCE
> Task :streams:upgrade-system-tests-21:processResources NO-SOURCE
> Task :streams:upgrade-system-tests-21:classes UP-TO-DATE
> Task :streams:upgrade-system-tests-21:checkstyleMain NO-SOURCE
> Task :streams:upgrade-system-tests-21:compileTestJava
> Task :streams:upgrade-system-tests-21:processTestResources NO-SOURCE
> Task :streams:upgrade-system-tests-21:testClasses
> Task :streams:upgrade-system-tests-21:checkstyleTest
> Task :streams:upgrade-system-tests-21:spotbugsMain NO-SOURCE
> Task :streams:upgrade-system-tests-21:test
> Task :streams:upgrade-system-tests-22:compileJava NO-SOURCE
> Task :streams:upgrade-system-tests-22:processResources NO-SOURCE
> Task :streams:upgrade-system-tests-22:classes UP-TO-DATE
> Task :streams:upgrade-system-tests-22:checkstyleMain NO-SOURCE
> Task :streams:upgrade-system-tests-22:compileTestJava
> Task :streams:upgrade-system-tests-22:processTestResources NO-SOURCE
> Task :streams:upgrade-system-tests-22:testClasses
> Task :streams:upgrade-system-tests-22:checkstyleTest
> Task :streams:upgrade-system-tests-22:spotbugsMain NO-SOURCE
> Task :streams:upgrade-system-tests-22:test
> Task :streams:upgrade-system-tests-23:compileJava NO-SOURCE
> Task :streams:upgrade-system-tests-23:processResources NO-SOURCE
> Task :streams:upgrade-system-tests-23:classes UP-TO-DATE
> Task :streams:upgrade-system-tests-23:checkstyleMain NO-SOURCE
> Task :streams:upgrade-system-tests-23:compileTestJava
> Task :streams:upgrade-system-tests-23:processTestResources NO-SOURCE
> Task :streams:upgrade-system-tests-23:testClasses
> Task :streams:upgrade-system-tests-23:checkstyleTest
> Task :streams:upgrade-system-tests-23:spotbugsMain NO-SOURCE
> Task :streams:upgrade-system-tests-23:test
> Task :streams:upgrade-system-tests-24:compileJava NO-SOURCE
> Task :streams:upgrade-system-tests-24:processResources NO-SOURCE
> Task :streams:upgrade-system-tests-24:classes UP-TO-DATE
> Task :streams:upgrade-system-tests-24:checkstyleMain NO-SOURCE
> Task :streams:upgrade-system-tests-24:compileTestJava
> Task :streams:upgrade-system-tests-24:processTestResources NO-SOURCE
> Task :streams:upgrade-system-tests-24:testClasses
> Task :streams:upgrade-system-tests-24:checkstyleTest
> Task :streams:upgrade-system-tests-24:spotbugsMain NO-SOURCE
> Task :streams:upgrade-system-tests-24:test
> Task :streams:upgrade-system-tests-25:compileJava NO-SOURCE
> Task :streams:upgrade-system-tests-25:processResources NO-SOURCE
> Task :streams:upgrade-system-tests-25:classes UP-TO-DATE
> Task :streams:upgrade-system-tests-25:checkstyleMain NO-SOURCE
> Task :streams:upgrade-system-tests-25:compileTestJava
> Task :streams:upgrade-system-tests-25:processTestResources NO-SOURCE
> Task :streams:upgrade-system-tests-25:testClasses
> Task :streams:upgrade-system-tests-25:checkstyleTest
> Task :streams:upgrade-system-tests-25:spotbugsMain NO-SOURCE
> Task :streams:upgrade-system-tests-25:test
> Task :streams:upgrade-system-tests-26:compileJava NO-SOURCE
> Task :streams:upgrade-system-tests-26:processResources NO-SOURCE
> Task :streams:upgrade-system-tests-26:classes UP-TO-DATE
> Task :streams:upgrade-system-tests-26:checkstyleMain NO-SOURCE
> Task :streams:upgrade-system-tests-26:compileTestJava
> Task :streams:upgrade-system-tests-26:processTestResources NO-SOURCE
> Task :streams:upgrade-system-tests-26:testClasses
> Task :streams:upgrade-system-tests-26:checkstyleTest
> Task :streams:upgrade-system-tests-26:spotbugsMain NO-SOURCE
> Task :streams:upgrade-system-tests-26:test
> Task :streams:upgrade-system-tests-27:compileJava NO-SOURCE
> Task :streams:upgrade-system-tests-27:processResources NO-SOURCE
> Task :streams:upgrade-system-tests-27:classes UP-TO-DATE
> Task :streams:upgrade-system-tests-27:checkstyleMain NO-SOURCE
> Task :streams:upgrade-system-tests-27:compileTestJava
> Task :streams:upgrade-system-tests-27:processTestResources NO-SOURCE
> Task :streams:upgrade-system-tests-27:testClasses
> Task :streams:upgrade-system-tests-27:checkstyleTest
> Task :streams:upgrade-system-tests-27:spotbugsMain NO-SOURCE
> Task :streams:upgrade-system-tests-27:test

FAILURE: Build completed with 2 failures.

1: Task failed with an exception.
-----------
* What went wrong:
Execution failed for task ':core:test'.
> There were failing tests. See the report at: file://<https://ci-builds.apache.org/job/Kafka/job/kafka-trunk-jdk15/ws/core/build/reports/tests/test/index.html>

* Try:
Run with --stacktrace option to get the stack trace. Run with --info or --debug option to get more log output. Run with --scan to get full insights.
==============================================================================

2: Task failed with an exception.
-----------
* What went wrong:
Execution failed for task ':streams:test'.
> There were failing tests. See the report at: file://<https://ci-builds.apache.org/job/Kafka/job/kafka-trunk-jdk15/ws/streams/build/reports/tests/test/index.html>

* Try:
Run with --stacktrace option to get the stack trace. Run with --info or --debug option to get more log output. Run with --scan to get full insights.
==============================================================================

* Get more help at https://help.gradle.org

Deprecated Gradle features were used in this build, making it incompatible with Gradle 7.0.
Use '--warning-mode all' to show the individual deprecation warnings.
See https://docs.gradle.org/6.7.1/userguide/command_line_interface.html#sec:command_line_warnings

BUILD FAILED in 3h 19m 19s
250 actionable tasks: 214 executed, 36 up-to-date
Build step 'Execute shell' marked build as failure
Recording test results
Not sending mail to unregistered user github@hugo-hirsch.de

Build failed in Jenkins: Kafka » kafka-trunk-jdk15 #406

Posted by Apache Jenkins Server <je...@builds.apache.org>.
See <https://ci-builds.apache.org/job/Kafka/job/kafka-trunk-jdk15/406/display/redirect?page=changes>

Changes:

[github] KAFKA-12203 Migrate connect:mirror-client module to JUnit 5 (#9889)


------------------------------------------
[...truncated 3.65 MB...]
MockProcessorContextStateStoreTest > builder = org.apache.kafka.streams.state.internals.TimestampedWindowStoreBuilder@29ab64de, timestamped = true, caching = false, logging = false STARTED

MockProcessorContextStateStoreTest > builder = org.apache.kafka.streams.state.internals.TimestampedWindowStoreBuilder@29ab64de, timestamped = true, caching = false, logging = false PASSED

MockProcessorContextStateStoreTest > builder = org.apache.kafka.streams.state.internals.TimestampedWindowStoreBuilder@3dc3a570, timestamped = true, caching = false, logging = false STARTED

MockProcessorContextStateStoreTest > builder = org.apache.kafka.streams.state.internals.TimestampedWindowStoreBuilder@3dc3a570, timestamped = true, caching = false, logging = false PASSED

MockProcessorContextStateStoreTest > builder = org.apache.kafka.streams.state.internals.WindowStoreBuilder@2c482d4d, timestamped = false, caching = true, logging = true STARTED

MockProcessorContextStateStoreTest > builder = org.apache.kafka.streams.state.internals.WindowStoreBuilder@2c482d4d, timestamped = false, caching = true, logging = true PASSED

MockProcessorContextStateStoreTest > builder = org.apache.kafka.streams.state.internals.WindowStoreBuilder@26cb30e3, timestamped = false, caching = true, logging = true STARTED

MockProcessorContextStateStoreTest > builder = org.apache.kafka.streams.state.internals.WindowStoreBuilder@26cb30e3, timestamped = false, caching = true, logging = true PASSED

MockProcessorContextStateStoreTest > builder = org.apache.kafka.streams.state.internals.WindowStoreBuilder@4207e1c9, timestamped = false, caching = true, logging = true STARTED

MockProcessorContextStateStoreTest > builder = org.apache.kafka.streams.state.internals.WindowStoreBuilder@4207e1c9, timestamped = false, caching = true, logging = true PASSED

MockProcessorContextStateStoreTest > builder = org.apache.kafka.streams.state.internals.WindowStoreBuilder@2385583a, timestamped = false, caching = true, logging = false STARTED

MockProcessorContextStateStoreTest > builder = org.apache.kafka.streams.state.internals.WindowStoreBuilder@2385583a, timestamped = false, caching = true, logging = false PASSED

MockProcessorContextStateStoreTest > builder = org.apache.kafka.streams.state.internals.WindowStoreBuilder@4bdf61c9, timestamped = false, caching = true, logging = false STARTED

MockProcessorContextStateStoreTest > builder = org.apache.kafka.streams.state.internals.WindowStoreBuilder@4bdf61c9, timestamped = false, caching = true, logging = false PASSED

MockProcessorContextStateStoreTest > builder = org.apache.kafka.streams.state.internals.WindowStoreBuilder@3393e4a3, timestamped = false, caching = true, logging = false STARTED

MockProcessorContextStateStoreTest > builder = org.apache.kafka.streams.state.internals.WindowStoreBuilder@3393e4a3, timestamped = false, caching = true, logging = false PASSED

MockProcessorContextStateStoreTest > builder = org.apache.kafka.streams.state.internals.WindowStoreBuilder@6b52b06f, timestamped = false, caching = false, logging = true STARTED

MockProcessorContextStateStoreTest > builder = org.apache.kafka.streams.state.internals.WindowStoreBuilder@6b52b06f, timestamped = false, caching = false, logging = true PASSED

MockProcessorContextStateStoreTest > builder = org.apache.kafka.streams.state.internals.WindowStoreBuilder@23d05ff4, timestamped = false, caching = false, logging = true STARTED

MockProcessorContextStateStoreTest > builder = org.apache.kafka.streams.state.internals.WindowStoreBuilder@23d05ff4, timestamped = false, caching = false, logging = true PASSED

MockProcessorContextStateStoreTest > builder = org.apache.kafka.streams.state.internals.WindowStoreBuilder@4f48f2e5, timestamped = false, caching = false, logging = true STARTED

MockProcessorContextStateStoreTest > builder = org.apache.kafka.streams.state.internals.WindowStoreBuilder@4f48f2e5, timestamped = false, caching = false, logging = true PASSED

MockProcessorContextStateStoreTest > builder = org.apache.kafka.streams.state.internals.WindowStoreBuilder@6a2f400e, timestamped = false, caching = false, logging = false STARTED

MockProcessorContextStateStoreTest > builder = org.apache.kafka.streams.state.internals.WindowStoreBuilder@6a2f400e, timestamped = false, caching = false, logging = false PASSED

MockProcessorContextStateStoreTest > builder = org.apache.kafka.streams.state.internals.WindowStoreBuilder@74257e5d, timestamped = false, caching = false, logging = false STARTED

MockProcessorContextStateStoreTest > builder = org.apache.kafka.streams.state.internals.WindowStoreBuilder@74257e5d, timestamped = false, caching = false, logging = false PASSED

MockProcessorContextStateStoreTest > builder = org.apache.kafka.streams.state.internals.WindowStoreBuilder@154022ab, timestamped = false, caching = false, logging = false STARTED

MockProcessorContextStateStoreTest > builder = org.apache.kafka.streams.state.internals.WindowStoreBuilder@154022ab, timestamped = false, caching = false, logging = false PASSED

MockProcessorContextStateStoreTest > builder = org.apache.kafka.streams.state.internals.SessionStoreBuilder@37681333, timestamped = false, caching = true, logging = true STARTED

MockProcessorContextStateStoreTest > builder = org.apache.kafka.streams.state.internals.SessionStoreBuilder@37681333, timestamped = false, caching = true, logging = true PASSED

MockProcessorContextStateStoreTest > builder = org.apache.kafka.streams.state.internals.SessionStoreBuilder@6cc4063d, timestamped = false, caching = true, logging = true STARTED

MockProcessorContextStateStoreTest > builder = org.apache.kafka.streams.state.internals.SessionStoreBuilder@6cc4063d, timestamped = false, caching = true, logging = true PASSED

MockProcessorContextStateStoreTest > builder = org.apache.kafka.streams.state.internals.SessionStoreBuilder@7a4ca735, timestamped = false, caching = true, logging = false STARTED

MockProcessorContextStateStoreTest > builder = org.apache.kafka.streams.state.internals.SessionStoreBuilder@7a4ca735, timestamped = false, caching = true, logging = false PASSED

MockProcessorContextStateStoreTest > builder = org.apache.kafka.streams.state.internals.SessionStoreBuilder@70567e4b, timestamped = false, caching = true, logging = false STARTED

MockProcessorContextStateStoreTest > builder = org.apache.kafka.streams.state.internals.SessionStoreBuilder@70567e4b, timestamped = false, caching = true, logging = false PASSED

MockProcessorContextStateStoreTest > builder = org.apache.kafka.streams.state.internals.SessionStoreBuilder@1f742195, timestamped = false, caching = false, logging = true STARTED

MockProcessorContextStateStoreTest > builder = org.apache.kafka.streams.state.internals.SessionStoreBuilder@1f742195, timestamped = false, caching = false, logging = true PASSED

MockProcessorContextStateStoreTest > builder = org.apache.kafka.streams.state.internals.SessionStoreBuilder@22018cd3, timestamped = false, caching = false, logging = true STARTED

MockProcessorContextStateStoreTest > builder = org.apache.kafka.streams.state.internals.SessionStoreBuilder@22018cd3, timestamped = false, caching = false, logging = true PASSED

MockProcessorContextStateStoreTest > builder = org.apache.kafka.streams.state.internals.SessionStoreBuilder@5bc19e0c, timestamped = false, caching = false, logging = false STARTED

MockProcessorContextStateStoreTest > builder = org.apache.kafka.streams.state.internals.SessionStoreBuilder@5bc19e0c, timestamped = false, caching = false, logging = false PASSED

MockProcessorContextStateStoreTest > builder = org.apache.kafka.streams.state.internals.SessionStoreBuilder@130a63eb, timestamped = false, caching = false, logging = false STARTED

MockProcessorContextStateStoreTest > builder = org.apache.kafka.streams.state.internals.SessionStoreBuilder@130a63eb, timestamped = false, caching = false, logging = false PASSED

TestRecordTest > testConsumerRecord() STARTED

TestRecordTest > testConsumerRecord() PASSED

TestRecordTest > testToString() STARTED

TestRecordTest > testToString() PASSED

TestRecordTest > testInvalidRecords() STARTED

TestRecordTest > testInvalidRecords() PASSED

TestRecordTest > testPartialConstructorEquals() STARTED

TestRecordTest > testPartialConstructorEquals() PASSED

TestRecordTest > testMultiFieldMatcher() STARTED

TestRecordTest > testMultiFieldMatcher() PASSED

TestRecordTest > testFields() STARTED

TestRecordTest > testFields() PASSED

TestRecordTest > testProducerRecord() STARTED

TestRecordTest > testProducerRecord() PASSED

TestRecordTest > testEqualsAndHashCode() STARTED

TestRecordTest > testEqualsAndHashCode() PASSED

> Task :streams:upgrade-system-tests-11:processTestResources NO-SOURCE
> Task :streams:upgrade-system-tests-11:testClasses
> Task :streams:upgrade-system-tests-11:checkstyleTest
> Task :streams:upgrade-system-tests-11:spotbugsMain NO-SOURCE
> Task :streams:upgrade-system-tests-11:test
> Task :streams:upgrade-system-tests-20:compileJava NO-SOURCE
> Task :streams:upgrade-system-tests-20:processResources NO-SOURCE
> Task :streams:upgrade-system-tests-20:classes UP-TO-DATE
> Task :streams:upgrade-system-tests-20:checkstyleMain NO-SOURCE
> Task :streams:upgrade-system-tests-20:compileTestJava
> Task :streams:upgrade-system-tests-20:processTestResources NO-SOURCE
> Task :streams:upgrade-system-tests-20:testClasses
> Task :streams:upgrade-system-tests-20:checkstyleTest
> Task :streams:upgrade-system-tests-20:spotbugsMain NO-SOURCE
> Task :streams:upgrade-system-tests-20:test
> Task :streams:upgrade-system-tests-21:compileJava NO-SOURCE
> Task :streams:upgrade-system-tests-21:processResources NO-SOURCE
> Task :streams:upgrade-system-tests-21:classes UP-TO-DATE
> Task :streams:upgrade-system-tests-21:checkstyleMain NO-SOURCE
> Task :streams:upgrade-system-tests-21:compileTestJava
> Task :streams:upgrade-system-tests-21:processTestResources NO-SOURCE
> Task :streams:upgrade-system-tests-21:testClasses
> Task :streams:upgrade-system-tests-21:checkstyleTest
> Task :streams:upgrade-system-tests-21:spotbugsMain NO-SOURCE
> Task :streams:upgrade-system-tests-21:test
> Task :streams:upgrade-system-tests-22:compileJava NO-SOURCE
> Task :streams:upgrade-system-tests-22:processResources NO-SOURCE
> Task :streams:upgrade-system-tests-22:classes UP-TO-DATE
> Task :streams:upgrade-system-tests-22:checkstyleMain NO-SOURCE
> Task :streams:upgrade-system-tests-22:compileTestJava
> Task :streams:upgrade-system-tests-22:processTestResources NO-SOURCE
> Task :streams:upgrade-system-tests-22:testClasses
> Task :streams:upgrade-system-tests-22:checkstyleTest
> Task :streams:upgrade-system-tests-22:spotbugsMain NO-SOURCE
> Task :streams:upgrade-system-tests-22:test
> Task :streams:upgrade-system-tests-23:compileJava NO-SOURCE
> Task :streams:upgrade-system-tests-23:processResources NO-SOURCE
> Task :streams:upgrade-system-tests-23:classes UP-TO-DATE
> Task :streams:upgrade-system-tests-23:checkstyleMain NO-SOURCE
> Task :streams:upgrade-system-tests-23:compileTestJava
> Task :streams:upgrade-system-tests-23:processTestResources NO-SOURCE
> Task :streams:upgrade-system-tests-23:testClasses
> Task :streams:upgrade-system-tests-23:checkstyleTest
> Task :streams:upgrade-system-tests-23:spotbugsMain NO-SOURCE
> Task :streams:upgrade-system-tests-23:test
> Task :streams:upgrade-system-tests-24:compileJava NO-SOURCE
> Task :streams:upgrade-system-tests-24:processResources NO-SOURCE
> Task :streams:upgrade-system-tests-24:classes UP-TO-DATE
> Task :streams:upgrade-system-tests-24:checkstyleMain NO-SOURCE
> Task :streams:upgrade-system-tests-24:compileTestJava
> Task :streams:upgrade-system-tests-24:processTestResources NO-SOURCE
> Task :streams:upgrade-system-tests-24:testClasses
> Task :streams:upgrade-system-tests-24:checkstyleTest
> Task :streams:upgrade-system-tests-24:spotbugsMain NO-SOURCE
> Task :streams:upgrade-system-tests-24:test
> Task :streams:upgrade-system-tests-25:compileJava NO-SOURCE
> Task :streams:upgrade-system-tests-25:processResources NO-SOURCE
> Task :streams:upgrade-system-tests-25:classes UP-TO-DATE
> Task :streams:upgrade-system-tests-25:checkstyleMain NO-SOURCE
> Task :streams:upgrade-system-tests-25:compileTestJava
> Task :streams:upgrade-system-tests-25:processTestResources NO-SOURCE
> Task :streams:upgrade-system-tests-25:testClasses
> Task :streams:upgrade-system-tests-25:checkstyleTest
> Task :streams:upgrade-system-tests-25:spotbugsMain NO-SOURCE
> Task :streams:upgrade-system-tests-25:test
> Task :streams:upgrade-system-tests-26:compileJava NO-SOURCE
> Task :streams:upgrade-system-tests-26:processResources NO-SOURCE
> Task :streams:upgrade-system-tests-26:classes UP-TO-DATE
> Task :streams:upgrade-system-tests-26:checkstyleMain NO-SOURCE
> Task :streams:upgrade-system-tests-26:compileTestJava
> Task :streams:upgrade-system-tests-26:processTestResources NO-SOURCE
> Task :streams:upgrade-system-tests-26:testClasses
> Task :streams:upgrade-system-tests-26:checkstyleTest
> Task :streams:upgrade-system-tests-26:spotbugsMain NO-SOURCE
> Task :streams:upgrade-system-tests-26:test
> Task :streams:upgrade-system-tests-27:compileJava NO-SOURCE
> Task :streams:upgrade-system-tests-27:processResources NO-SOURCE
> Task :streams:upgrade-system-tests-27:classes UP-TO-DATE
> Task :streams:upgrade-system-tests-27:checkstyleMain NO-SOURCE
> Task :streams:upgrade-system-tests-27:compileTestJava
> Task :streams:upgrade-system-tests-27:processTestResources NO-SOURCE
> Task :streams:upgrade-system-tests-27:testClasses
> Task :streams:upgrade-system-tests-27:checkstyleTest
> Task :streams:upgrade-system-tests-27:spotbugsMain NO-SOURCE
> Task :streams:upgrade-system-tests-27:test

FAILURE: Build completed with 3 failures.

1: Task failed with an exception.
-----------
* What went wrong:
Execution failed for task ':core:test'.
> There were failing tests. See the report at: file://<https://ci-builds.apache.org/job/Kafka/job/kafka-trunk-jdk15/ws/core/build/reports/tests/test/index.html>

* Try:
Run with --stacktrace option to get the stack trace. Run with --info or --debug option to get more log output. Run with --scan to get full insights.
==============================================================================

2: Task failed with an exception.
-----------
* What went wrong:
Execution failed for task ':streams:test'.
> There were failing tests. See the report at: file://<https://ci-builds.apache.org/job/Kafka/job/kafka-trunk-jdk15/ws/streams/build/reports/tests/test/index.html>

* Try:
Run with --stacktrace option to get the stack trace. Run with --info or --debug option to get more log output. Run with --scan to get full insights.
==============================================================================

3: Task failed with an exception.
-----------
* What went wrong:
Execution failed for task ':connect:runtime:test'.
> There were failing tests. See the report at: file://<https://ci-builds.apache.org/job/Kafka/job/kafka-trunk-jdk15/ws/connect/runtime/build/reports/tests/test/index.html>

* Try:
Run with --stacktrace option to get the stack trace. Run with --info or --debug option to get more log output. Run with --scan to get full insights.
==============================================================================

* Get more help at https://help.gradle.org

Deprecated Gradle features were used in this build, making it incompatible with Gradle 7.0.
Use '--warning-mode all' to show the individual deprecation warnings.
See https://docs.gradle.org/6.7.1/userguide/command_line_interface.html#sec:command_line_warnings

BUILD FAILED in 2h 42m 26s
250 actionable tasks: 214 executed, 36 up-to-date
Build step 'Execute shell' marked build as failure
Recording test results
Not sending mail to unregistered user github@hugo-hirsch.de

Build failed in Jenkins: Kafka » kafka-trunk-jdk15 #405

Posted by Apache Jenkins Server <je...@builds.apache.org>.
See <https://ci-builds.apache.org/job/Kafka/job/kafka-trunk-jdk15/405/display/redirect?page=changes>

Changes:

[github] KAFKA-12201: Migrate connect:basic-auth-extensio module to JUnit 5 (#9892)

[github] MINOR: Initialize QuorumState lazily in RaftClient.initialize() (#9881)


------------------------------------------
[...truncated 3.65 MB...]
MockProcessorContextStateStoreTest > builder = org.apache.kafka.streams.state.internals.KeyValueStoreBuilder@29abc31, timestamped = false, caching = false, logging = false PASSED

MockProcessorContextStateStoreTest > builder = org.apache.kafka.streams.state.internals.TimestampedWindowStoreBuilder@768ec679, timestamped = true, caching = true, logging = true STARTED

MockProcessorContextStateStoreTest > builder = org.apache.kafka.streams.state.internals.TimestampedWindowStoreBuilder@768ec679, timestamped = true, caching = true, logging = true PASSED

MockProcessorContextStateStoreTest > builder = org.apache.kafka.streams.state.internals.TimestampedWindowStoreBuilder@4bfc27df, timestamped = true, caching = true, logging = true STARTED

MockProcessorContextStateStoreTest > builder = org.apache.kafka.streams.state.internals.TimestampedWindowStoreBuilder@4bfc27df, timestamped = true, caching = true, logging = true PASSED

MockProcessorContextStateStoreTest > builder = org.apache.kafka.streams.state.internals.TimestampedWindowStoreBuilder@4bdf61c9, timestamped = true, caching = true, logging = true STARTED

MockProcessorContextStateStoreTest > builder = org.apache.kafka.streams.state.internals.TimestampedWindowStoreBuilder@4bdf61c9, timestamped = true, caching = true, logging = true PASSED

MockProcessorContextStateStoreTest > builder = org.apache.kafka.streams.state.internals.TimestampedWindowStoreBuilder@3393e4a3, timestamped = true, caching = true, logging = false STARTED

MockProcessorContextStateStoreTest > builder = org.apache.kafka.streams.state.internals.TimestampedWindowStoreBuilder@3393e4a3, timestamped = true, caching = true, logging = false PASSED

MockProcessorContextStateStoreTest > builder = org.apache.kafka.streams.state.internals.TimestampedWindowStoreBuilder@6b52b06f, timestamped = true, caching = true, logging = false STARTED

MockProcessorContextStateStoreTest > builder = org.apache.kafka.streams.state.internals.TimestampedWindowStoreBuilder@6b52b06f, timestamped = true, caching = true, logging = false PASSED

MockProcessorContextStateStoreTest > builder = org.apache.kafka.streams.state.internals.TimestampedWindowStoreBuilder@23d05ff4, timestamped = true, caching = true, logging = false STARTED

MockProcessorContextStateStoreTest > builder = org.apache.kafka.streams.state.internals.TimestampedWindowStoreBuilder@23d05ff4, timestamped = true, caching = true, logging = false PASSED

MockProcessorContextStateStoreTest > builder = org.apache.kafka.streams.state.internals.TimestampedWindowStoreBuilder@4f48f2e5, timestamped = true, caching = false, logging = true STARTED

MockProcessorContextStateStoreTest > builder = org.apache.kafka.streams.state.internals.TimestampedWindowStoreBuilder@4f48f2e5, timestamped = true, caching = false, logging = true PASSED

MockProcessorContextStateStoreTest > builder = org.apache.kafka.streams.state.internals.TimestampedWindowStoreBuilder@6a2f400e, timestamped = true, caching = false, logging = true STARTED

MockProcessorContextStateStoreTest > builder = org.apache.kafka.streams.state.internals.TimestampedWindowStoreBuilder@6a2f400e, timestamped = true, caching = false, logging = true PASSED

MockProcessorContextStateStoreTest > builder = org.apache.kafka.streams.state.internals.TimestampedWindowStoreBuilder@74257e5d, timestamped = true, caching = false, logging = true STARTED

MockProcessorContextStateStoreTest > builder = org.apache.kafka.streams.state.internals.TimestampedWindowStoreBuilder@74257e5d, timestamped = true, caching = false, logging = true PASSED

MockProcessorContextStateStoreTest > builder = org.apache.kafka.streams.state.internals.TimestampedWindowStoreBuilder@30734e02, timestamped = true, caching = false, logging = false STARTED

MockProcessorContextStateStoreTest > builder = org.apache.kafka.streams.state.internals.TimestampedWindowStoreBuilder@30734e02, timestamped = true, caching = false, logging = false PASSED

MockProcessorContextStateStoreTest > builder = org.apache.kafka.streams.state.internals.TimestampedWindowStoreBuilder@1544eb55, timestamped = true, caching = false, logging = false STARTED

MockProcessorContextStateStoreTest > builder = org.apache.kafka.streams.state.internals.TimestampedWindowStoreBuilder@1544eb55, timestamped = true, caching = false, logging = false PASSED

MockProcessorContextStateStoreTest > builder = org.apache.kafka.streams.state.internals.TimestampedWindowStoreBuilder@23b95071, timestamped = true, caching = false, logging = false STARTED

MockProcessorContextStateStoreTest > builder = org.apache.kafka.streams.state.internals.TimestampedWindowStoreBuilder@23b95071, timestamped = true, caching = false, logging = false PASSED

MockProcessorContextStateStoreTest > builder = org.apache.kafka.streams.state.internals.WindowStoreBuilder@636b7be5, timestamped = false, caching = true, logging = true STARTED

MockProcessorContextStateStoreTest > builder = org.apache.kafka.streams.state.internals.WindowStoreBuilder@636b7be5, timestamped = false, caching = true, logging = true PASSED

MockProcessorContextStateStoreTest > builder = org.apache.kafka.streams.state.internals.WindowStoreBuilder@52ec51f0, timestamped = false, caching = true, logging = true STARTED

MockProcessorContextStateStoreTest > builder = org.apache.kafka.streams.state.internals.WindowStoreBuilder@52ec51f0, timestamped = false, caching = true, logging = true PASSED

MockProcessorContextStateStoreTest > builder = org.apache.kafka.streams.state.internals.WindowStoreBuilder@5d063d1d, timestamped = false, caching = true, logging = true STARTED

MockProcessorContextStateStoreTest > builder = org.apache.kafka.streams.state.internals.WindowStoreBuilder@5d063d1d, timestamped = false, caching = true, logging = true PASSED

MockProcessorContextStateStoreTest > builder = org.apache.kafka.streams.state.internals.WindowStoreBuilder@37054a0b, timestamped = false, caching = true, logging = false STARTED

MockProcessorContextStateStoreTest > builder = org.apache.kafka.streams.state.internals.WindowStoreBuilder@37054a0b, timestamped = false, caching = true, logging = false PASSED

MockProcessorContextStateStoreTest > builder = org.apache.kafka.streams.state.internals.WindowStoreBuilder@22018cd3, timestamped = false, caching = true, logging = false STARTED

MockProcessorContextStateStoreTest > builder = org.apache.kafka.streams.state.internals.WindowStoreBuilder@22018cd3, timestamped = false, caching = true, logging = false PASSED

MockProcessorContextStateStoreTest > builder = org.apache.kafka.streams.state.internals.WindowStoreBuilder@4f07aed6, timestamped = false, caching = true, logging = false STARTED

MockProcessorContextStateStoreTest > builder = org.apache.kafka.streams.state.internals.WindowStoreBuilder@4f07aed6, timestamped = false, caching = true, logging = false PASSED

MockProcessorContextStateStoreTest > builder = org.apache.kafka.streams.state.internals.WindowStoreBuilder@1879f60d, timestamped = false, caching = false, logging = true STARTED

MockProcessorContextStateStoreTest > builder = org.apache.kafka.streams.state.internals.WindowStoreBuilder@1879f60d, timestamped = false, caching = false, logging = true PASSED

MockProcessorContextStateStoreTest > builder = org.apache.kafka.streams.state.internals.WindowStoreBuilder@52105819, timestamped = false, caching = false, logging = true STARTED

MockProcessorContextStateStoreTest > builder = org.apache.kafka.streams.state.internals.WindowStoreBuilder@52105819, timestamped = false, caching = false, logging = true PASSED

MockProcessorContextStateStoreTest > builder = org.apache.kafka.streams.state.internals.WindowStoreBuilder@411cacc3, timestamped = false, caching = false, logging = true STARTED

MockProcessorContextStateStoreTest > builder = org.apache.kafka.streams.state.internals.WindowStoreBuilder@411cacc3, timestamped = false, caching = false, logging = true PASSED

MockProcessorContextStateStoreTest > builder = org.apache.kafka.streams.state.internals.WindowStoreBuilder@5b167ff1, timestamped = false, caching = false, logging = false STARTED

MockProcessorContextStateStoreTest > builder = org.apache.kafka.streams.state.internals.WindowStoreBuilder@5b167ff1, timestamped = false, caching = false, logging = false PASSED

MockProcessorContextStateStoreTest > builder = org.apache.kafka.streams.state.internals.WindowStoreBuilder@162f6b98, timestamped = false, caching = false, logging = false STARTED

MockProcessorContextStateStoreTest > builder = org.apache.kafka.streams.state.internals.WindowStoreBuilder@162f6b98, timestamped = false, caching = false, logging = false PASSED

MockProcessorContextStateStoreTest > builder = org.apache.kafka.streams.state.internals.WindowStoreBuilder@16a881c1, timestamped = false, caching = false, logging = false STARTED

MockProcessorContextStateStoreTest > builder = org.apache.kafka.streams.state.internals.WindowStoreBuilder@16a881c1, timestamped = false, caching = false, logging = false PASSED

MockProcessorContextStateStoreTest > builder = org.apache.kafka.streams.state.internals.SessionStoreBuilder@73bc62e2, timestamped = false, caching = true, logging = true STARTED

MockProcessorContextStateStoreTest > builder = org.apache.kafka.streams.state.internals.SessionStoreBuilder@73bc62e2, timestamped = false, caching = true, logging = true PASSED

MockProcessorContextStateStoreTest > builder = org.apache.kafka.streams.state.internals.SessionStoreBuilder@7c76647e, timestamped = false, caching = true, logging = true STARTED

MockProcessorContextStateStoreTest > builder = org.apache.kafka.streams.state.internals.SessionStoreBuilder@7c76647e, timestamped = false, caching = true, logging = true PASSED

MockProcessorContextStateStoreTest > builder = org.apache.kafka.streams.state.internals.SessionStoreBuilder@670760b1, timestamped = false, caching = true, logging = false STARTED

MockProcessorContextStateStoreTest > builder = org.apache.kafka.streams.state.internals.SessionStoreBuilder@670760b1, timestamped = false, caching = true, logging = false PASSED

MockProcessorContextStateStoreTest > builder = org.apache.kafka.streams.state.internals.SessionStoreBuilder@445cd76e, timestamped = false, caching = true, logging = false STARTED

MockProcessorContextStateStoreTest > builder = org.apache.kafka.streams.state.internals.SessionStoreBuilder@445cd76e, timestamped = false, caching = true, logging = false PASSED

MockProcessorContextStateStoreTest > builder = org.apache.kafka.streams.state.internals.SessionStoreBuilder@1f2ccf6, timestamped = false, caching = false, logging = true STARTED

MockProcessorContextStateStoreTest > builder = org.apache.kafka.streams.state.internals.SessionStoreBuilder@1f2ccf6, timestamped = false, caching = false, logging = true PASSED

MockProcessorContextStateStoreTest > builder = org.apache.kafka.streams.state.internals.SessionStoreBuilder@237a5ceb, timestamped = false, caching = false, logging = true STARTED

MockProcessorContextStateStoreTest > builder = org.apache.kafka.streams.state.internals.SessionStoreBuilder@237a5ceb, timestamped = false, caching = false, logging = true PASSED

MockProcessorContextStateStoreTest > builder = org.apache.kafka.streams.state.internals.SessionStoreBuilder@16c93ce8, timestamped = false, caching = false, logging = false STARTED

MockProcessorContextStateStoreTest > builder = org.apache.kafka.streams.state.internals.SessionStoreBuilder@16c93ce8, timestamped = false, caching = false, logging = false PASSED

MockProcessorContextStateStoreTest > builder = org.apache.kafka.streams.state.internals.SessionStoreBuilder@65ebb34d, timestamped = false, caching = false, logging = false STARTED

MockProcessorContextStateStoreTest > builder = org.apache.kafka.streams.state.internals.SessionStoreBuilder@65ebb34d, timestamped = false, caching = false, logging = false PASSED

> Task :streams:upgrade-system-tests-11:processTestResources NO-SOURCE
> Task :streams:upgrade-system-tests-11:testClasses
> Task :streams:upgrade-system-tests-11:checkstyleTest
> Task :streams:upgrade-system-tests-11:spotbugsMain NO-SOURCE
> Task :streams:upgrade-system-tests-11:test
> Task :streams:upgrade-system-tests-20:compileJava NO-SOURCE
> Task :streams:upgrade-system-tests-20:processResources NO-SOURCE
> Task :streams:upgrade-system-tests-20:classes UP-TO-DATE
> Task :streams:upgrade-system-tests-20:checkstyleMain NO-SOURCE
> Task :streams:upgrade-system-tests-20:compileTestJava
> Task :streams:upgrade-system-tests-20:processTestResources NO-SOURCE
> Task :streams:upgrade-system-tests-20:testClasses
> Task :streams:upgrade-system-tests-20:checkstyleTest
> Task :streams:upgrade-system-tests-20:spotbugsMain NO-SOURCE
> Task :streams:upgrade-system-tests-20:test
> Task :streams:upgrade-system-tests-21:compileJava NO-SOURCE
> Task :streams:upgrade-system-tests-21:processResources NO-SOURCE
> Task :streams:upgrade-system-tests-21:classes UP-TO-DATE
> Task :streams:upgrade-system-tests-21:checkstyleMain NO-SOURCE
> Task :streams:upgrade-system-tests-21:compileTestJava
> Task :streams:upgrade-system-tests-21:processTestResources NO-SOURCE
> Task :streams:upgrade-system-tests-21:testClasses
> Task :streams:upgrade-system-tests-21:checkstyleTest
> Task :streams:upgrade-system-tests-21:spotbugsMain NO-SOURCE
> Task :streams:upgrade-system-tests-21:test
> Task :streams:upgrade-system-tests-22:compileJava NO-SOURCE
> Task :streams:upgrade-system-tests-22:processResources NO-SOURCE
> Task :streams:upgrade-system-tests-22:classes UP-TO-DATE
> Task :streams:upgrade-system-tests-22:checkstyleMain NO-SOURCE
> Task :streams:upgrade-system-tests-22:compileTestJava
> Task :streams:upgrade-system-tests-22:processTestResources NO-SOURCE
> Task :streams:upgrade-system-tests-22:testClasses
> Task :streams:upgrade-system-tests-22:checkstyleTest
> Task :streams:upgrade-system-tests-22:spotbugsMain NO-SOURCE
> Task :streams:upgrade-system-tests-22:test
> Task :streams:upgrade-system-tests-23:compileJava NO-SOURCE
> Task :streams:upgrade-system-tests-23:processResources NO-SOURCE
> Task :streams:upgrade-system-tests-23:classes UP-TO-DATE
> Task :streams:upgrade-system-tests-23:checkstyleMain NO-SOURCE
> Task :streams:upgrade-system-tests-23:compileTestJava
> Task :streams:upgrade-system-tests-23:processTestResources NO-SOURCE
> Task :streams:upgrade-system-tests-23:testClasses
> Task :streams:upgrade-system-tests-23:checkstyleTest
> Task :streams:upgrade-system-tests-23:spotbugsMain NO-SOURCE
> Task :streams:upgrade-system-tests-23:test
> Task :streams:upgrade-system-tests-24:compileJava NO-SOURCE
> Task :streams:upgrade-system-tests-24:processResources NO-SOURCE
> Task :streams:upgrade-system-tests-24:classes UP-TO-DATE
> Task :streams:upgrade-system-tests-24:checkstyleMain NO-SOURCE
> Task :streams:upgrade-system-tests-24:compileTestJava
> Task :streams:upgrade-system-tests-24:processTestResources NO-SOURCE
> Task :streams:upgrade-system-tests-24:testClasses
> Task :streams:upgrade-system-tests-24:checkstyleTest
> Task :streams:upgrade-system-tests-24:spotbugsMain NO-SOURCE
> Task :streams:upgrade-system-tests-24:test
> Task :streams:upgrade-system-tests-25:compileJava NO-SOURCE
> Task :streams:upgrade-system-tests-25:processResources NO-SOURCE
> Task :streams:upgrade-system-tests-25:classes UP-TO-DATE
> Task :streams:upgrade-system-tests-25:checkstyleMain NO-SOURCE
> Task :streams:upgrade-system-tests-25:compileTestJava
> Task :streams:upgrade-system-tests-25:processTestResources NO-SOURCE
> Task :streams:upgrade-system-tests-25:testClasses
> Task :streams:upgrade-system-tests-25:checkstyleTest
> Task :streams:upgrade-system-tests-25:spotbugsMain NO-SOURCE
> Task :streams:upgrade-system-tests-25:test
> Task :streams:upgrade-system-tests-26:compileJava NO-SOURCE
> Task :streams:upgrade-system-tests-26:processResources NO-SOURCE
> Task :streams:upgrade-system-tests-26:classes UP-TO-DATE
> Task :streams:upgrade-system-tests-26:checkstyleMain NO-SOURCE
> Task :streams:upgrade-system-tests-26:compileTestJava
> Task :streams:upgrade-system-tests-26:processTestResources NO-SOURCE
> Task :streams:upgrade-system-tests-26:testClasses
> Task :streams:upgrade-system-tests-26:checkstyleTest
> Task :streams:upgrade-system-tests-26:spotbugsMain NO-SOURCE
> Task :streams:upgrade-system-tests-26:test
> Task :streams:upgrade-system-tests-27:compileJava NO-SOURCE
> Task :streams:upgrade-system-tests-27:processResources NO-SOURCE
> Task :streams:upgrade-system-tests-27:classes UP-TO-DATE
> Task :streams:upgrade-system-tests-27:checkstyleMain NO-SOURCE
> Task :streams:upgrade-system-tests-27:compileTestJava
> Task :streams:upgrade-system-tests-27:processTestResources NO-SOURCE
> Task :streams:upgrade-system-tests-27:testClasses
> Task :streams:upgrade-system-tests-27:checkstyleTest
> Task :streams:upgrade-system-tests-27:spotbugsMain NO-SOURCE
> Task :streams:upgrade-system-tests-27:test

FAILURE: Build completed with 2 failures.

1: Task failed with an exception.
-----------
* What went wrong:
Execution failed for task ':core:test'.
> There were failing tests. See the report at: file://<https://ci-builds.apache.org/job/Kafka/job/kafka-trunk-jdk15/ws/core/build/reports/tests/test/index.html>

* Try:
Run with --stacktrace option to get the stack trace. Run with --info or --debug option to get more log output. Run with --scan to get full insights.
==============================================================================

2: Task failed with an exception.
-----------
* What went wrong:
Execution failed for task ':streams:test'.
> There were failing tests. See the report at: file://<https://ci-builds.apache.org/job/Kafka/job/kafka-trunk-jdk15/ws/streams/build/reports/tests/test/index.html>

* Try:
Run with --stacktrace option to get the stack trace. Run with --info or --debug option to get more log output. Run with --scan to get full insights.
==============================================================================

* Get more help at https://help.gradle.org

Deprecated Gradle features were used in this build, making it incompatible with Gradle 7.0.
Use '--warning-mode all' to show the individual deprecation warnings.
See https://docs.gradle.org/6.7.1/userguide/command_line_interface.html#sec:command_line_warnings

BUILD FAILED in 2h 39m 10s
250 actionable tasks: 214 executed, 36 up-to-date
Build step 'Execute shell' marked build as failure
Recording test results
Not sending mail to unregistered user github@hugo-hirsch.de

Build failed in Jenkins: Kafka » kafka-trunk-jdk15 #404

Posted by Apache Jenkins Server <je...@builds.apache.org>.
See <https://ci-builds.apache.org/job/Kafka/job/kafka-trunk-jdk15/404/display/redirect?page=changes>

Changes:

[github] KAFKA-12183: Add the KIP-631 metadata record definitions (#9876)

[github] MINOR: fix typo in TimeIndex (#9834)


------------------------------------------
[...truncated 3.66 MB...]
TopologyTestDriverAtLeastOnceTest > shouldFlushStoreForFirstInput() PASSED

TopologyTestDriverAtLeastOnceTest > shouldProcessFromSourceThatMatchPattern() STARTED

TopologyTestDriverAtLeastOnceTest > shouldProcessFromSourceThatMatchPattern() PASSED

TopologyTestDriverAtLeastOnceTest > shouldCaptureSinkTopicNamesIfWrittenInto() STARTED

TopologyTestDriverAtLeastOnceTest > shouldCaptureSinkTopicNamesIfWrittenInto() PASSED

TopologyTestDriverAtLeastOnceTest > shouldUpdateStoreForNewKey() STARTED

TopologyTestDriverAtLeastOnceTest > shouldUpdateStoreForNewKey() PASSED

TopologyTestDriverAtLeastOnceTest > shouldSendRecordViaCorrectSourceTopicDeprecated() STARTED

TopologyTestDriverAtLeastOnceTest > shouldSendRecordViaCorrectSourceTopicDeprecated() PASSED

TopologyTestDriverAtLeastOnceTest > shouldPunctuateOnWallClockTime() STARTED

TopologyTestDriverAtLeastOnceTest > shouldPunctuateOnWallClockTime() PASSED

TopologyTestDriverAtLeastOnceTest > shouldSetRecordMetadata() STARTED

TopologyTestDriverAtLeastOnceTest > shouldSetRecordMetadata() PASSED

TopologyTestDriverAtLeastOnceTest > shouldNotUpdateStoreForLargerValue() STARTED

TopologyTestDriverAtLeastOnceTest > shouldNotUpdateStoreForLargerValue() PASSED

TopologyTestDriverAtLeastOnceTest > shouldReturnCorrectInMemoryStoreTypeOnly() STARTED

TopologyTestDriverAtLeastOnceTest > shouldReturnCorrectInMemoryStoreTypeOnly() PASSED

TopologyTestDriverAtLeastOnceTest > shouldThrowForMissingTime() STARTED

TopologyTestDriverAtLeastOnceTest > shouldThrowForMissingTime() PASSED

TopologyTestDriverAtLeastOnceTest > shouldCaptureInternalTopicNamesIfWrittenInto() STARTED

TopologyTestDriverAtLeastOnceTest > shouldCaptureInternalTopicNamesIfWrittenInto() PASSED

TopologyTestDriverAtLeastOnceTest > shouldPunctuateOnWallClockTimeDeprecated() STARTED

TopologyTestDriverAtLeastOnceTest > shouldPunctuateOnWallClockTimeDeprecated() PASSED

TopologyTestDriverAtLeastOnceTest > shouldProcessRecordForTopic() STARTED

TopologyTestDriverAtLeastOnceTest > shouldProcessRecordForTopic() PASSED

TopologyTestDriverAtLeastOnceTest > shouldForwardRecordsFromSubtopologyToSubtopology() STARTED

TopologyTestDriverAtLeastOnceTest > shouldForwardRecordsFromSubtopologyToSubtopology() PASSED

TopologyTestDriverAtLeastOnceTest > shouldNotUpdateStoreForSmallerValue() STARTED

TopologyTestDriverAtLeastOnceTest > shouldNotUpdateStoreForSmallerValue() PASSED

TopologyTestDriverAtLeastOnceTest > shouldCreateStateDirectoryForStatefulTopology() STARTED

TopologyTestDriverAtLeastOnceTest > shouldCreateStateDirectoryForStatefulTopology() PASSED

TopologyTestDriverAtLeastOnceTest > shouldNotRequireParameters() STARTED

TopologyTestDriverAtLeastOnceTest > shouldNotRequireParameters() PASSED

TopologyTestDriverAtLeastOnceTest > shouldPunctuateIfWallClockTimeAdvances() STARTED

TopologyTestDriverAtLeastOnceTest > shouldPunctuateIfWallClockTimeAdvances() PASSED

MockTimeTest > shouldGetNanosAsMillis() STARTED

MockTimeTest > shouldGetNanosAsMillis() PASSED

MockTimeTest > shouldSetStartTime() STARTED

MockTimeTest > shouldSetStartTime() PASSED

MockTimeTest > shouldNotAllowNegativeSleep() STARTED

MockTimeTest > shouldNotAllowNegativeSleep() PASSED

MockTimeTest > shouldAdvanceTimeOnSleep() STARTED

MockTimeTest > shouldAdvanceTimeOnSleep() PASSED

KeyValueStoreFacadeTest > shouldReturnIsOpen() STARTED

KeyValueStoreFacadeTest > shouldReturnIsOpen() PASSED

KeyValueStoreFacadeTest > shouldDeleteAndReturnPlainValue() STARTED

KeyValueStoreFacadeTest > shouldDeleteAndReturnPlainValue() PASSED

KeyValueStoreFacadeTest > shouldReturnName() STARTED

KeyValueStoreFacadeTest > shouldReturnName() PASSED

KeyValueStoreFacadeTest > shouldPutWithUnknownTimestamp() STARTED

KeyValueStoreFacadeTest > shouldPutWithUnknownTimestamp() PASSED

KeyValueStoreFacadeTest > shouldPutAllWithUnknownTimestamp() STARTED

KeyValueStoreFacadeTest > shouldPutAllWithUnknownTimestamp() PASSED

KeyValueStoreFacadeTest > shouldReturnIsPersistent() STARTED

KeyValueStoreFacadeTest > shouldReturnIsPersistent() PASSED

KeyValueStoreFacadeTest > shouldForwardDeprecatedInit() STARTED

KeyValueStoreFacadeTest > shouldForwardDeprecatedInit() PASSED

KeyValueStoreFacadeTest > shouldPutIfAbsentWithUnknownTimestamp() STARTED

KeyValueStoreFacadeTest > shouldPutIfAbsentWithUnknownTimestamp() PASSED

KeyValueStoreFacadeTest > shouldForwardClose() STARTED

KeyValueStoreFacadeTest > shouldForwardClose() PASSED

KeyValueStoreFacadeTest > shouldForwardFlush() STARTED

KeyValueStoreFacadeTest > shouldForwardFlush() PASSED

KeyValueStoreFacadeTest > shouldForwardInit() STARTED

KeyValueStoreFacadeTest > shouldForwardInit() PASSED

> Task :streams:upgrade-system-tests-11:processTestResources NO-SOURCE
> Task :streams:upgrade-system-tests-11:testClasses
> Task :streams:upgrade-system-tests-11:checkstyleTest
> Task :streams:upgrade-system-tests-11:spotbugsMain NO-SOURCE
> Task :streams:upgrade-system-tests-11:test
> Task :streams:upgrade-system-tests-20:compileJava NO-SOURCE
> Task :streams:upgrade-system-tests-20:processResources NO-SOURCE
> Task :streams:upgrade-system-tests-20:classes UP-TO-DATE
> Task :streams:upgrade-system-tests-20:checkstyleMain NO-SOURCE
> Task :streams:upgrade-system-tests-20:compileTestJava
> Task :streams:upgrade-system-tests-20:processTestResources NO-SOURCE
> Task :streams:upgrade-system-tests-20:testClasses
> Task :streams:upgrade-system-tests-20:checkstyleTest
> Task :streams:upgrade-system-tests-20:spotbugsMain NO-SOURCE
> Task :streams:upgrade-system-tests-20:test
> Task :streams:upgrade-system-tests-21:compileJava NO-SOURCE
> Task :streams:upgrade-system-tests-21:processResources NO-SOURCE
> Task :streams:upgrade-system-tests-21:classes UP-TO-DATE
> Task :streams:upgrade-system-tests-21:checkstyleMain NO-SOURCE
> Task :streams:upgrade-system-tests-21:compileTestJava
> Task :streams:upgrade-system-tests-21:processTestResources NO-SOURCE
> Task :streams:upgrade-system-tests-21:testClasses
> Task :streams:upgrade-system-tests-21:checkstyleTest
> Task :streams:upgrade-system-tests-21:spotbugsMain NO-SOURCE
> Task :streams:upgrade-system-tests-21:test
> Task :streams:upgrade-system-tests-22:compileJava NO-SOURCE
> Task :streams:upgrade-system-tests-22:processResources NO-SOURCE
> Task :streams:upgrade-system-tests-22:classes UP-TO-DATE
> Task :streams:upgrade-system-tests-22:checkstyleMain NO-SOURCE
> Task :streams:upgrade-system-tests-22:compileTestJava
> Task :streams:upgrade-system-tests-22:processTestResources NO-SOURCE
> Task :streams:upgrade-system-tests-22:testClasses
> Task :streams:upgrade-system-tests-22:checkstyleTest
> Task :streams:upgrade-system-tests-22:spotbugsMain NO-SOURCE
> Task :streams:upgrade-system-tests-22:test
> Task :streams:upgrade-system-tests-23:compileJava NO-SOURCE
> Task :streams:upgrade-system-tests-23:processResources NO-SOURCE
> Task :streams:upgrade-system-tests-23:classes UP-TO-DATE
> Task :streams:upgrade-system-tests-23:checkstyleMain NO-SOURCE
> Task :streams:upgrade-system-tests-23:compileTestJava
> Task :streams:upgrade-system-tests-23:processTestResources NO-SOURCE
> Task :streams:upgrade-system-tests-23:testClasses
> Task :streams:upgrade-system-tests-23:checkstyleTest
> Task :streams:upgrade-system-tests-23:spotbugsMain NO-SOURCE
> Task :streams:upgrade-system-tests-23:test
> Task :streams:upgrade-system-tests-24:compileJava NO-SOURCE
> Task :streams:upgrade-system-tests-24:processResources NO-SOURCE
> Task :streams:upgrade-system-tests-24:classes UP-TO-DATE
> Task :streams:upgrade-system-tests-24:checkstyleMain NO-SOURCE
> Task :streams:upgrade-system-tests-24:compileTestJava
> Task :streams:upgrade-system-tests-24:processTestResources NO-SOURCE
> Task :streams:upgrade-system-tests-24:testClasses
> Task :streams:upgrade-system-tests-24:checkstyleTest
> Task :streams:upgrade-system-tests-24:spotbugsMain NO-SOURCE
> Task :streams:upgrade-system-tests-24:test
> Task :streams:upgrade-system-tests-25:compileJava NO-SOURCE
> Task :streams:upgrade-system-tests-25:processResources NO-SOURCE
> Task :streams:upgrade-system-tests-25:classes UP-TO-DATE
> Task :streams:upgrade-system-tests-25:checkstyleMain NO-SOURCE
> Task :streams:upgrade-system-tests-25:compileTestJava
> Task :streams:upgrade-system-tests-25:processTestResources NO-SOURCE
> Task :streams:upgrade-system-tests-25:testClasses
> Task :streams:upgrade-system-tests-25:checkstyleTest
> Task :streams:upgrade-system-tests-25:spotbugsMain NO-SOURCE
> Task :streams:upgrade-system-tests-25:test
> Task :streams:upgrade-system-tests-26:compileJava NO-SOURCE
> Task :streams:upgrade-system-tests-26:processResources NO-SOURCE
> Task :streams:upgrade-system-tests-26:classes UP-TO-DATE
> Task :streams:upgrade-system-tests-26:checkstyleMain NO-SOURCE
> Task :streams:upgrade-system-tests-26:compileTestJava
> Task :streams:upgrade-system-tests-26:processTestResources NO-SOURCE
> Task :streams:upgrade-system-tests-26:testClasses
> Task :streams:upgrade-system-tests-26:checkstyleTest
> Task :streams:upgrade-system-tests-26:spotbugsMain NO-SOURCE
> Task :streams:upgrade-system-tests-26:test
> Task :streams:upgrade-system-tests-27:compileJava NO-SOURCE
> Task :streams:upgrade-system-tests-27:processResources NO-SOURCE
> Task :streams:upgrade-system-tests-27:classes UP-TO-DATE
> Task :streams:upgrade-system-tests-27:checkstyleMain NO-SOURCE
> Task :streams:upgrade-system-tests-27:compileTestJava
> Task :streams:upgrade-system-tests-27:processTestResources NO-SOURCE
> Task :streams:upgrade-system-tests-27:testClasses
> Task :streams:upgrade-system-tests-27:checkstyleTest
> Task :streams:upgrade-system-tests-27:spotbugsMain NO-SOURCE
> Task :streams:upgrade-system-tests-27:test

FAILURE: Build completed with 2 failures.

1: Task failed with an exception.
-----------
* What went wrong:
Execution failed for task ':clients:test'.
> There were failing tests. See the report at: file://<https://ci-builds.apache.org/job/Kafka/job/kafka-trunk-jdk15/ws/clients/build/reports/tests/test/index.html>

* Try:
Run with --stacktrace option to get the stack trace. Run with --info or --debug option to get more log output. Run with --scan to get full insights.
==============================================================================

2: Task failed with an exception.
-----------
* What went wrong:
Execution failed for task ':streams:test'.
> There were failing tests. See the report at: file://<https://ci-builds.apache.org/job/Kafka/job/kafka-trunk-jdk15/ws/streams/build/reports/tests/test/index.html>

* Try:
Run with --stacktrace option to get the stack trace. Run with --info or --debug option to get more log output. Run with --scan to get full insights.
==============================================================================

* Get more help at https://help.gradle.org

Deprecated Gradle features were used in this build, making it incompatible with Gradle 7.0.
Use '--warning-mode all' to show the individual deprecation warnings.
See https://docs.gradle.org/6.7.1/userguide/command_line_interface.html#sec:command_line_warnings

BUILD FAILED in 1h 43m 4s
250 actionable tasks: 214 executed, 36 up-to-date
Build step 'Execute shell' marked build as failure
Recording test results
Not sending mail to unregistered user github@hugo-hirsch.de

Build failed in Jenkins: Kafka » kafka-trunk-jdk15 #403

Posted by Apache Jenkins Server <je...@builds.apache.org>.
See <https://ci-builds.apache.org/job/Kafka/job/kafka-trunk-jdk15/403/display/redirect?page=changes>

Changes:

[github] MINOR: Make JUnit 5 the default for new projects (#9882)

[github] MINOR: Fix typo in `shouldUseJUnit5` in build.gradle (#9893)

[github] KAFKA-10304: Refactor MM2 integration tests (#9224)


------------------------------------------
[...truncated 3.67 MB...]

TestTopicsTest > testNonUsedOutputTopic() STARTED

TestTopicsTest > testNonUsedOutputTopic() PASSED

TestTopicsTest > testEmptyTopic() STARTED

TestTopicsTest > testEmptyTopic() PASSED

TestTopicsTest > testStartTimestamp() STARTED

TestTopicsTest > testStartTimestamp() PASSED

TestTopicsTest > testNegativeAdvance() STARTED

TestTopicsTest > testNegativeAdvance() PASSED

TestTopicsTest > shouldNotAllowToCreateWithNullDriver() STARTED

TestTopicsTest > shouldNotAllowToCreateWithNullDriver() PASSED

TestTopicsTest > testDuration() STARTED

TestTopicsTest > testDuration() PASSED

TestTopicsTest > testOutputToString() STARTED

TestTopicsTest > testOutputToString() PASSED

TestTopicsTest > testValue() STARTED

TestTopicsTest > testValue() PASSED

TestTopicsTest > testTimestampAutoAdvance() STARTED

TestTopicsTest > testTimestampAutoAdvance() PASSED

TestTopicsTest > testOutputWrongSerde() STARTED

TestTopicsTest > testOutputWrongSerde() PASSED

TestTopicsTest > shouldNotAllowToCreateOutputTopicWithNullTopicName() STARTED

TestTopicsTest > shouldNotAllowToCreateOutputTopicWithNullTopicName() PASSED

TestTopicsTest > testWrongSerde() STARTED

TestTopicsTest > testWrongSerde() PASSED

TestTopicsTest > testKeyValuesToMapWithNull() STARTED

TestTopicsTest > testKeyValuesToMapWithNull() PASSED

TestTopicsTest > testNonExistingOutputTopic() STARTED

TestTopicsTest > testNonExistingOutputTopic() PASSED

TestTopicsTest > testMultipleTopics() STARTED

TestTopicsTest > testMultipleTopics() PASSED

TestTopicsTest > testKeyValueList() STARTED

TestTopicsTest > testKeyValueList() PASSED

TestTopicsTest > shouldNotAllowToCreateOutputWithNullDriver() STARTED

TestTopicsTest > shouldNotAllowToCreateOutputWithNullDriver() PASSED

TestTopicsTest > testValueList() STARTED

TestTopicsTest > testValueList() PASSED

TestTopicsTest > testRecordList() STARTED

TestTopicsTest > testRecordList() PASSED

TestTopicsTest > testNonExistingInputTopic() STARTED

TestTopicsTest > testNonExistingInputTopic() PASSED

TestTopicsTest > testKeyValuesToMap() STARTED

TestTopicsTest > testKeyValuesToMap() PASSED

TestTopicsTest > testRecordsToList() STARTED

TestTopicsTest > testRecordsToList() PASSED

TestTopicsTest > testKeyValueListDuration() STARTED

TestTopicsTest > testKeyValueListDuration() PASSED

TestTopicsTest > testInputToString() STARTED

TestTopicsTest > testInputToString() PASSED

TestTopicsTest > testTimestamp() STARTED

TestTopicsTest > testTimestamp() PASSED

TestTopicsTest > testWithHeaders() STARTED

TestTopicsTest > testWithHeaders() PASSED

TestTopicsTest > testKeyValue() STARTED

TestTopicsTest > testKeyValue() PASSED

TestTopicsTest > shouldNotAllowToCreateTopicWithNullTopicName() STARTED

TestTopicsTest > shouldNotAllowToCreateTopicWithNullTopicName() PASSED

> Task :streams:upgrade-system-tests-10:spotbugsMain NO-SOURCE
> Task :streams:upgrade-system-tests-10:test
> Task :streams:upgrade-system-tests-11:compileJava NO-SOURCE
> Task :streams:upgrade-system-tests-11:processResources NO-SOURCE
> Task :streams:upgrade-system-tests-11:classes UP-TO-DATE
> Task :streams:upgrade-system-tests-11:checkstyleMain NO-SOURCE
> Task :streams:upgrade-system-tests-11:compileTestJava
> Task :streams:upgrade-system-tests-11:processTestResources NO-SOURCE
> Task :streams:upgrade-system-tests-11:testClasses
> Task :streams:upgrade-system-tests-11:checkstyleTest
> Task :streams:upgrade-system-tests-11:spotbugsMain NO-SOURCE
> Task :streams:upgrade-system-tests-11:test
> Task :streams:upgrade-system-tests-20:compileJava NO-SOURCE
> Task :streams:upgrade-system-tests-20:processResources NO-SOURCE
> Task :streams:upgrade-system-tests-20:classes UP-TO-DATE
> Task :streams:upgrade-system-tests-20:checkstyleMain NO-SOURCE
> Task :streams:upgrade-system-tests-20:compileTestJava
> Task :streams:upgrade-system-tests-20:processTestResources NO-SOURCE
> Task :streams:upgrade-system-tests-20:testClasses
> Task :streams:upgrade-system-tests-20:checkstyleTest
> Task :streams:upgrade-system-tests-20:spotbugsMain NO-SOURCE
> Task :streams:upgrade-system-tests-20:test
> Task :streams:upgrade-system-tests-21:compileJava NO-SOURCE
> Task :streams:upgrade-system-tests-21:processResources NO-SOURCE
> Task :streams:upgrade-system-tests-21:classes UP-TO-DATE
> Task :streams:upgrade-system-tests-21:checkstyleMain NO-SOURCE
> Task :streams:upgrade-system-tests-21:compileTestJava
> Task :streams:upgrade-system-tests-21:processTestResources NO-SOURCE
> Task :streams:upgrade-system-tests-21:testClasses
> Task :streams:upgrade-system-tests-21:checkstyleTest
> Task :streams:upgrade-system-tests-21:spotbugsMain NO-SOURCE
> Task :streams:upgrade-system-tests-21:test
> Task :streams:upgrade-system-tests-22:compileJava NO-SOURCE
> Task :streams:upgrade-system-tests-22:processResources NO-SOURCE
> Task :streams:upgrade-system-tests-22:classes UP-TO-DATE
> Task :streams:upgrade-system-tests-22:checkstyleMain NO-SOURCE
> Task :streams:upgrade-system-tests-22:compileTestJava
> Task :streams:upgrade-system-tests-22:processTestResources NO-SOURCE
> Task :streams:upgrade-system-tests-22:testClasses
> Task :streams:upgrade-system-tests-22:checkstyleTest
> Task :streams:upgrade-system-tests-22:spotbugsMain NO-SOURCE
> Task :streams:upgrade-system-tests-22:test
> Task :streams:upgrade-system-tests-23:compileJava NO-SOURCE
> Task :streams:upgrade-system-tests-23:processResources NO-SOURCE
> Task :streams:upgrade-system-tests-23:classes UP-TO-DATE
> Task :streams:upgrade-system-tests-23:checkstyleMain NO-SOURCE
> Task :streams:upgrade-system-tests-23:compileTestJava
> Task :streams:upgrade-system-tests-23:processTestResources NO-SOURCE
> Task :streams:upgrade-system-tests-23:testClasses
> Task :streams:upgrade-system-tests-23:checkstyleTest
> Task :streams:upgrade-system-tests-23:spotbugsMain NO-SOURCE
> Task :streams:upgrade-system-tests-23:test
> Task :streams:upgrade-system-tests-24:compileJava NO-SOURCE
> Task :streams:upgrade-system-tests-24:processResources NO-SOURCE
> Task :streams:upgrade-system-tests-24:classes UP-TO-DATE
> Task :streams:upgrade-system-tests-24:checkstyleMain NO-SOURCE
> Task :streams:upgrade-system-tests-24:compileTestJava
> Task :streams:upgrade-system-tests-24:processTestResources NO-SOURCE
> Task :streams:upgrade-system-tests-24:testClasses
> Task :streams:upgrade-system-tests-24:checkstyleTest
> Task :streams:upgrade-system-tests-24:spotbugsMain NO-SOURCE
> Task :streams:upgrade-system-tests-24:test
> Task :streams:upgrade-system-tests-25:compileJava NO-SOURCE
> Task :streams:upgrade-system-tests-25:processResources NO-SOURCE
> Task :streams:upgrade-system-tests-25:classes UP-TO-DATE
> Task :streams:upgrade-system-tests-25:checkstyleMain NO-SOURCE
> Task :streams:upgrade-system-tests-25:compileTestJava
> Task :streams:upgrade-system-tests-25:processTestResources NO-SOURCE
> Task :streams:upgrade-system-tests-25:testClasses
> Task :streams:upgrade-system-tests-25:checkstyleTest
> Task :streams:upgrade-system-tests-25:spotbugsMain NO-SOURCE
> Task :streams:upgrade-system-tests-25:test
> Task :streams:upgrade-system-tests-26:compileJava NO-SOURCE
> Task :streams:upgrade-system-tests-26:processResources NO-SOURCE
> Task :streams:upgrade-system-tests-26:classes UP-TO-DATE
> Task :streams:upgrade-system-tests-26:checkstyleMain NO-SOURCE
> Task :streams:upgrade-system-tests-26:compileTestJava
> Task :streams:upgrade-system-tests-26:processTestResources NO-SOURCE
> Task :streams:upgrade-system-tests-26:testClasses
> Task :streams:upgrade-system-tests-26:checkstyleTest
> Task :streams:upgrade-system-tests-26:spotbugsMain NO-SOURCE
> Task :streams:upgrade-system-tests-26:test
> Task :streams:upgrade-system-tests-27:compileJava NO-SOURCE
> Task :streams:upgrade-system-tests-27:processResources NO-SOURCE
> Task :streams:upgrade-system-tests-27:classes UP-TO-DATE
> Task :streams:upgrade-system-tests-27:checkstyleMain NO-SOURCE
> Task :streams:upgrade-system-tests-27:compileTestJava
> Task :streams:upgrade-system-tests-27:processTestResources NO-SOURCE
> Task :streams:upgrade-system-tests-27:testClasses
> Task :streams:upgrade-system-tests-27:checkstyleTest
> Task :streams:upgrade-system-tests-27:spotbugsMain NO-SOURCE
> Task :streams:upgrade-system-tests-27:test

FAILURE: Build completed with 3 failures.

1: Task failed with an exception.
-----------
* What went wrong:
Execution failed for task ':clients:test'.
> There were failing tests. See the report at: file://<https://ci-builds.apache.org/job/Kafka/job/kafka-trunk-jdk15/ws/clients/build/reports/tests/test/index.html>

* Try:
Run with --stacktrace option to get the stack trace. Run with --info or --debug option to get more log output. Run with --scan to get full insights.
==============================================================================

2: Task failed with an exception.
-----------
* What went wrong:
Execution failed for task ':streams:test'.
> There were failing tests. See the report at: file://<https://ci-builds.apache.org/job/Kafka/job/kafka-trunk-jdk15/ws/streams/build/reports/tests/test/index.html>

* Try:
Run with --stacktrace option to get the stack trace. Run with --info or --debug option to get more log output. Run with --scan to get full insights.
==============================================================================

3: Task failed with an exception.
-----------
* What went wrong:
Execution failed for task ':connect:mirror:test'.
> There were failing tests. See the report at: file://<https://ci-builds.apache.org/job/Kafka/job/kafka-trunk-jdk15/ws/connect/mirror/build/reports/tests/test/index.html>

* Try:
Run with --stacktrace option to get the stack trace. Run with --info or --debug option to get more log output. Run with --scan to get full insights.
==============================================================================

* Get more help at https://help.gradle.org

Deprecated Gradle features were used in this build, making it incompatible with Gradle 7.0.
Use '--warning-mode all' to show the individual deprecation warnings.
See https://docs.gradle.org/6.7.1/userguide/command_line_interface.html#sec:command_line_warnings

BUILD FAILED in 2h 27m 39s
240 actionable tasks: 205 executed, 35 up-to-date
Build step 'Execute shell' marked build as failure
Recording test results
Not sending mail to unregistered user github@hugo-hirsch.de

Build failed in Jenkins: Kafka » kafka-trunk-jdk15 #402

Posted by Apache Jenkins Server <je...@builds.apache.org>.
See <https://ci-builds.apache.org/job/Kafka/job/kafka-trunk-jdk15/402/display/redirect?page=changes>

Changes:

[github] MINOR: replace NotLeaderForPartitionException with NotLeaderOrFollowerException (#9885)

[github] MINOR: Updating files with release 2.6.1 (#9844)


------------------------------------------
[...truncated 3.66 MB...]

MockProcessorContextStateStoreTest > builder = org.apache.kafka.streams.state.internals.TimestampedWindowStoreBuilder@3673293b, timestamped = true, caching = false, logging = true STARTED

MockProcessorContextStateStoreTest > builder = org.apache.kafka.streams.state.internals.TimestampedWindowStoreBuilder@3673293b, timestamped = true, caching = false, logging = true PASSED

MockProcessorContextStateStoreTest > builder = org.apache.kafka.streams.state.internals.TimestampedWindowStoreBuilder@1d19cd64, timestamped = true, caching = false, logging = true STARTED

MockProcessorContextStateStoreTest > builder = org.apache.kafka.streams.state.internals.TimestampedWindowStoreBuilder@1d19cd64, timestamped = true, caching = false, logging = true PASSED

MockProcessorContextStateStoreTest > builder = org.apache.kafka.streams.state.internals.TimestampedWindowStoreBuilder@755f8ced, timestamped = true, caching = false, logging = false STARTED

MockProcessorContextStateStoreTest > builder = org.apache.kafka.streams.state.internals.TimestampedWindowStoreBuilder@755f8ced, timestamped = true, caching = false, logging = false PASSED

MockProcessorContextStateStoreTest > builder = org.apache.kafka.streams.state.internals.TimestampedWindowStoreBuilder@29ab64de, timestamped = true, caching = false, logging = false STARTED

MockProcessorContextStateStoreTest > builder = org.apache.kafka.streams.state.internals.TimestampedWindowStoreBuilder@29ab64de, timestamped = true, caching = false, logging = false PASSED

MockProcessorContextStateStoreTest > builder = org.apache.kafka.streams.state.internals.TimestampedWindowStoreBuilder@3dc3a570, timestamped = true, caching = false, logging = false STARTED

MockProcessorContextStateStoreTest > builder = org.apache.kafka.streams.state.internals.TimestampedWindowStoreBuilder@3dc3a570, timestamped = true, caching = false, logging = false PASSED

MockProcessorContextStateStoreTest > builder = org.apache.kafka.streams.state.internals.WindowStoreBuilder@2c482d4d, timestamped = false, caching = true, logging = true STARTED

MockProcessorContextStateStoreTest > builder = org.apache.kafka.streams.state.internals.WindowStoreBuilder@2c482d4d, timestamped = false, caching = true, logging = true PASSED

MockProcessorContextStateStoreTest > builder = org.apache.kafka.streams.state.internals.WindowStoreBuilder@26cb30e3, timestamped = false, caching = true, logging = true STARTED

MockProcessorContextStateStoreTest > builder = org.apache.kafka.streams.state.internals.WindowStoreBuilder@26cb30e3, timestamped = false, caching = true, logging = true PASSED

MockProcessorContextStateStoreTest > builder = org.apache.kafka.streams.state.internals.WindowStoreBuilder@4207e1c9, timestamped = false, caching = true, logging = true STARTED

MockProcessorContextStateStoreTest > builder = org.apache.kafka.streams.state.internals.WindowStoreBuilder@4207e1c9, timestamped = false, caching = true, logging = true PASSED

MockProcessorContextStateStoreTest > builder = org.apache.kafka.streams.state.internals.WindowStoreBuilder@2385583a, timestamped = false, caching = true, logging = false STARTED

MockProcessorContextStateStoreTest > builder = org.apache.kafka.streams.state.internals.WindowStoreBuilder@2385583a, timestamped = false, caching = true, logging = false PASSED

MockProcessorContextStateStoreTest > builder = org.apache.kafka.streams.state.internals.WindowStoreBuilder@4bdf61c9, timestamped = false, caching = true, logging = false STARTED

MockProcessorContextStateStoreTest > builder = org.apache.kafka.streams.state.internals.WindowStoreBuilder@4bdf61c9, timestamped = false, caching = true, logging = false PASSED

MockProcessorContextStateStoreTest > builder = org.apache.kafka.streams.state.internals.WindowStoreBuilder@3393e4a3, timestamped = false, caching = true, logging = false STARTED

MockProcessorContextStateStoreTest > builder = org.apache.kafka.streams.state.internals.WindowStoreBuilder@3393e4a3, timestamped = false, caching = true, logging = false PASSED

MockProcessorContextStateStoreTest > builder = org.apache.kafka.streams.state.internals.WindowStoreBuilder@6b52b06f, timestamped = false, caching = false, logging = true STARTED

MockProcessorContextStateStoreTest > builder = org.apache.kafka.streams.state.internals.WindowStoreBuilder@6b52b06f, timestamped = false, caching = false, logging = true PASSED

MockProcessorContextStateStoreTest > builder = org.apache.kafka.streams.state.internals.WindowStoreBuilder@23d05ff4, timestamped = false, caching = false, logging = true STARTED

MockProcessorContextStateStoreTest > builder = org.apache.kafka.streams.state.internals.WindowStoreBuilder@23d05ff4, timestamped = false, caching = false, logging = true PASSED

MockProcessorContextStateStoreTest > builder = org.apache.kafka.streams.state.internals.WindowStoreBuilder@4f48f2e5, timestamped = false, caching = false, logging = true STARTED

MockProcessorContextStateStoreTest > builder = org.apache.kafka.streams.state.internals.WindowStoreBuilder@4f48f2e5, timestamped = false, caching = false, logging = true PASSED

MockProcessorContextStateStoreTest > builder = org.apache.kafka.streams.state.internals.WindowStoreBuilder@6a2f400e, timestamped = false, caching = false, logging = false STARTED

MockProcessorContextStateStoreTest > builder = org.apache.kafka.streams.state.internals.WindowStoreBuilder@6a2f400e, timestamped = false, caching = false, logging = false PASSED

MockProcessorContextStateStoreTest > builder = org.apache.kafka.streams.state.internals.WindowStoreBuilder@74257e5d, timestamped = false, caching = false, logging = false STARTED

MockProcessorContextStateStoreTest > builder = org.apache.kafka.streams.state.internals.WindowStoreBuilder@74257e5d, timestamped = false, caching = false, logging = false PASSED

MockProcessorContextStateStoreTest > builder = org.apache.kafka.streams.state.internals.WindowStoreBuilder@154022ab, timestamped = false, caching = false, logging = false STARTED

MockProcessorContextStateStoreTest > builder = org.apache.kafka.streams.state.internals.WindowStoreBuilder@154022ab, timestamped = false, caching = false, logging = false PASSED

MockProcessorContextStateStoreTest > builder = org.apache.kafka.streams.state.internals.SessionStoreBuilder@37681333, timestamped = false, caching = true, logging = true STARTED

MockProcessorContextStateStoreTest > builder = org.apache.kafka.streams.state.internals.SessionStoreBuilder@37681333, timestamped = false, caching = true, logging = true PASSED

MockProcessorContextStateStoreTest > builder = org.apache.kafka.streams.state.internals.SessionStoreBuilder@6cc4063d, timestamped = false, caching = true, logging = true STARTED

MockProcessorContextStateStoreTest > builder = org.apache.kafka.streams.state.internals.SessionStoreBuilder@6cc4063d, timestamped = false, caching = true, logging = true PASSED

MockProcessorContextStateStoreTest > builder = org.apache.kafka.streams.state.internals.SessionStoreBuilder@7a4ca735, timestamped = false, caching = true, logging = false STARTED

MockProcessorContextStateStoreTest > builder = org.apache.kafka.streams.state.internals.SessionStoreBuilder@7a4ca735, timestamped = false, caching = true, logging = false PASSED

MockProcessorContextStateStoreTest > builder = org.apache.kafka.streams.state.internals.SessionStoreBuilder@70567e4b, timestamped = false, caching = true, logging = false STARTED

MockProcessorContextStateStoreTest > builder = org.apache.kafka.streams.state.internals.SessionStoreBuilder@70567e4b, timestamped = false, caching = true, logging = false PASSED

MockProcessorContextStateStoreTest > builder = org.apache.kafka.streams.state.internals.SessionStoreBuilder@1f742195, timestamped = false, caching = false, logging = true STARTED

MockProcessorContextStateStoreTest > builder = org.apache.kafka.streams.state.internals.SessionStoreBuilder@1f742195, timestamped = false, caching = false, logging = true PASSED

MockProcessorContextStateStoreTest > builder = org.apache.kafka.streams.state.internals.SessionStoreBuilder@22018cd3, timestamped = false, caching = false, logging = true STARTED

MockProcessorContextStateStoreTest > builder = org.apache.kafka.streams.state.internals.SessionStoreBuilder@22018cd3, timestamped = false, caching = false, logging = true PASSED

MockProcessorContextStateStoreTest > builder = org.apache.kafka.streams.state.internals.SessionStoreBuilder@5bc19e0c, timestamped = false, caching = false, logging = false STARTED

MockProcessorContextStateStoreTest > builder = org.apache.kafka.streams.state.internals.SessionStoreBuilder@5bc19e0c, timestamped = false, caching = false, logging = false PASSED

MockProcessorContextStateStoreTest > builder = org.apache.kafka.streams.state.internals.SessionStoreBuilder@130a63eb, timestamped = false, caching = false, logging = false STARTED

MockProcessorContextStateStoreTest > builder = org.apache.kafka.streams.state.internals.SessionStoreBuilder@130a63eb, timestamped = false, caching = false, logging = false PASSED

TestRecordTest > testConsumerRecord() STARTED

TestRecordTest > testConsumerRecord() PASSED

TestRecordTest > testToString() STARTED

TestRecordTest > testToString() PASSED

TestRecordTest > testInvalidRecords() STARTED

TestRecordTest > testInvalidRecords() PASSED

TestRecordTest > testPartialConstructorEquals() STARTED

TestRecordTest > testPartialConstructorEquals() PASSED

TestRecordTest > testMultiFieldMatcher() STARTED

TestRecordTest > testMultiFieldMatcher() PASSED

TestRecordTest > testFields() STARTED

TestRecordTest > testFields() PASSED

TestRecordTest > testProducerRecord() STARTED

TestRecordTest > testProducerRecord() PASSED

TestRecordTest > testEqualsAndHashCode() STARTED

TestRecordTest > testEqualsAndHashCode() PASSED

> Task :streams:upgrade-system-tests-11:spotbugsMain NO-SOURCE
> Task :streams:upgrade-system-tests-11:test
> Task :streams:upgrade-system-tests-20:compileJava NO-SOURCE
> Task :streams:upgrade-system-tests-20:processResources NO-SOURCE
> Task :streams:upgrade-system-tests-20:classes UP-TO-DATE
> Task :streams:upgrade-system-tests-20:checkstyleMain NO-SOURCE
> Task :streams:upgrade-system-tests-20:compileTestJava
> Task :streams:upgrade-system-tests-20:processTestResources NO-SOURCE
> Task :streams:upgrade-system-tests-20:testClasses
> Task :streams:upgrade-system-tests-20:checkstyleTest
> Task :streams:upgrade-system-tests-20:spotbugsMain NO-SOURCE
> Task :streams:upgrade-system-tests-20:test
> Task :streams:upgrade-system-tests-21:compileJava NO-SOURCE
> Task :streams:upgrade-system-tests-21:processResources NO-SOURCE
> Task :streams:upgrade-system-tests-21:classes UP-TO-DATE
> Task :streams:upgrade-system-tests-21:checkstyleMain NO-SOURCE
> Task :streams:upgrade-system-tests-21:compileTestJava
> Task :streams:upgrade-system-tests-21:processTestResources NO-SOURCE
> Task :streams:upgrade-system-tests-21:testClasses
> Task :streams:upgrade-system-tests-21:checkstyleTest
> Task :streams:upgrade-system-tests-21:spotbugsMain NO-SOURCE
> Task :streams:upgrade-system-tests-21:test
> Task :streams:upgrade-system-tests-22:compileJava NO-SOURCE
> Task :streams:upgrade-system-tests-22:processResources NO-SOURCE
> Task :streams:upgrade-system-tests-22:classes UP-TO-DATE
> Task :streams:upgrade-system-tests-22:checkstyleMain NO-SOURCE
> Task :streams:upgrade-system-tests-22:compileTestJava
> Task :streams:upgrade-system-tests-22:processTestResources NO-SOURCE
> Task :streams:upgrade-system-tests-22:testClasses
> Task :streams:upgrade-system-tests-22:checkstyleTest
> Task :streams:upgrade-system-tests-22:spotbugsMain NO-SOURCE
> Task :streams:upgrade-system-tests-22:test
> Task :streams:upgrade-system-tests-23:compileJava NO-SOURCE
> Task :streams:upgrade-system-tests-23:processResources NO-SOURCE
> Task :streams:upgrade-system-tests-23:classes UP-TO-DATE
> Task :streams:upgrade-system-tests-23:checkstyleMain NO-SOURCE
> Task :streams:upgrade-system-tests-23:compileTestJava
> Task :streams:upgrade-system-tests-23:processTestResources NO-SOURCE
> Task :streams:upgrade-system-tests-23:testClasses
> Task :streams:upgrade-system-tests-23:checkstyleTest
> Task :streams:upgrade-system-tests-23:spotbugsMain NO-SOURCE
> Task :streams:upgrade-system-tests-23:test
> Task :streams:upgrade-system-tests-24:compileJava NO-SOURCE
> Task :streams:upgrade-system-tests-24:processResources NO-SOURCE
> Task :streams:upgrade-system-tests-24:classes UP-TO-DATE
> Task :streams:upgrade-system-tests-24:checkstyleMain NO-SOURCE
> Task :streams:upgrade-system-tests-24:compileTestJava
> Task :streams:upgrade-system-tests-24:processTestResources NO-SOURCE
> Task :streams:upgrade-system-tests-24:testClasses
> Task :streams:upgrade-system-tests-24:checkstyleTest
> Task :streams:upgrade-system-tests-24:spotbugsMain NO-SOURCE
> Task :streams:upgrade-system-tests-24:test
> Task :streams:upgrade-system-tests-25:compileJava NO-SOURCE
> Task :streams:upgrade-system-tests-25:processResources NO-SOURCE
> Task :streams:upgrade-system-tests-25:classes UP-TO-DATE
> Task :streams:upgrade-system-tests-25:checkstyleMain NO-SOURCE
> Task :streams:upgrade-system-tests-25:compileTestJava
> Task :streams:upgrade-system-tests-25:processTestResources NO-SOURCE
> Task :streams:upgrade-system-tests-25:testClasses
> Task :streams:upgrade-system-tests-25:checkstyleTest
> Task :streams:upgrade-system-tests-25:spotbugsMain NO-SOURCE
> Task :streams:upgrade-system-tests-25:test
> Task :streams:upgrade-system-tests-26:compileJava NO-SOURCE
> Task :streams:upgrade-system-tests-26:processResources NO-SOURCE
> Task :streams:upgrade-system-tests-26:classes UP-TO-DATE
> Task :streams:upgrade-system-tests-26:checkstyleMain NO-SOURCE
> Task :streams:upgrade-system-tests-26:compileTestJava
> Task :streams:upgrade-system-tests-26:processTestResources NO-SOURCE
> Task :streams:upgrade-system-tests-26:testClasses
> Task :streams:upgrade-system-tests-26:checkstyleTest
> Task :streams:upgrade-system-tests-26:spotbugsMain NO-SOURCE
> Task :streams:upgrade-system-tests-26:test
> Task :streams:upgrade-system-tests-27:compileJava NO-SOURCE
> Task :streams:upgrade-system-tests-27:processResources NO-SOURCE
> Task :streams:upgrade-system-tests-27:classes UP-TO-DATE
> Task :streams:upgrade-system-tests-27:checkstyleMain NO-SOURCE
> Task :streams:upgrade-system-tests-27:compileTestJava
> Task :streams:upgrade-system-tests-27:processTestResources NO-SOURCE
> Task :streams:upgrade-system-tests-27:testClasses
> Task :streams:upgrade-system-tests-27:checkstyleTest
> Task :streams:upgrade-system-tests-27:spotbugsMain NO-SOURCE
> Task :streams:upgrade-system-tests-27:test

FAILURE: Build completed with 2 failures.

1: Task failed with an exception.
-----------
* What went wrong:
Execution failed for task ':core:test'.
> There were failing tests. See the report at: file://<https://ci-builds.apache.org/job/Kafka/job/kafka-trunk-jdk15/ws/core/build/reports/tests/test/index.html>

* Try:
Run with --stacktrace option to get the stack trace. Run with --info or --debug option to get more log output. Run with --scan to get full insights.
==============================================================================

2: Task failed with an exception.
-----------
* What went wrong:
Execution failed for task ':streams:test'.
> There were failing tests. See the report at: file://<https://ci-builds.apache.org/job/Kafka/job/kafka-trunk-jdk15/ws/streams/build/reports/tests/test/index.html>

* Try:
Run with --stacktrace option to get the stack trace. Run with --info or --debug option to get more log output. Run with --scan to get full insights.
==============================================================================

* Get more help at https://help.gradle.org

Deprecated Gradle features were used in this build, making it incompatible with Gradle 7.0.
Use '--warning-mode all' to show the individual deprecation warnings.
See https://docs.gradle.org/6.7.1/userguide/command_line_interface.html#sec:command_line_warnings

BUILD FAILED in 2h 27m 43s
240 actionable tasks: 205 executed, 35 up-to-date
Build step 'Execute shell' marked build as failure
Recording test results
Not sending mail to unregistered user github@hugo-hirsch.de

Build failed in Jenkins: Kafka » kafka-trunk-jdk15 #401

Posted by Apache Jenkins Server <je...@builds.apache.org>.
See <https://ci-builds.apache.org/job/Kafka/job/kafka-trunk-jdk15/401/display/redirect?page=changes>

Changes:

[github] MINOR: Rename examples to example (#9886)


------------------------------------------
[...truncated 3.66 MB...]
MockProcessorContextStateStoreTest > builder = org.apache.kafka.streams.state.internals.TimestampedWindowStoreBuilder@4a5e5dd, timestamped = true, caching = false, logging = true STARTED

MockProcessorContextStateStoreTest > builder = org.apache.kafka.streams.state.internals.TimestampedWindowStoreBuilder@4a5e5dd, timestamped = true, caching = false, logging = true PASSED

MockProcessorContextStateStoreTest > builder = org.apache.kafka.streams.state.internals.TimestampedWindowStoreBuilder@3673293b, timestamped = true, caching = false, logging = true STARTED

MockProcessorContextStateStoreTest > builder = org.apache.kafka.streams.state.internals.TimestampedWindowStoreBuilder@3673293b, timestamped = true, caching = false, logging = true PASSED

MockProcessorContextStateStoreTest > builder = org.apache.kafka.streams.state.internals.TimestampedWindowStoreBuilder@1d19cd64, timestamped = true, caching = false, logging = true STARTED

MockProcessorContextStateStoreTest > builder = org.apache.kafka.streams.state.internals.TimestampedWindowStoreBuilder@1d19cd64, timestamped = true, caching = false, logging = true PASSED

MockProcessorContextStateStoreTest > builder = org.apache.kafka.streams.state.internals.TimestampedWindowStoreBuilder@755f8ced, timestamped = true, caching = false, logging = false STARTED

MockProcessorContextStateStoreTest > builder = org.apache.kafka.streams.state.internals.TimestampedWindowStoreBuilder@755f8ced, timestamped = true, caching = false, logging = false PASSED

MockProcessorContextStateStoreTest > builder = org.apache.kafka.streams.state.internals.TimestampedWindowStoreBuilder@29ab64de, timestamped = true, caching = false, logging = false STARTED

MockProcessorContextStateStoreTest > builder = org.apache.kafka.streams.state.internals.TimestampedWindowStoreBuilder@29ab64de, timestamped = true, caching = false, logging = false PASSED

MockProcessorContextStateStoreTest > builder = org.apache.kafka.streams.state.internals.TimestampedWindowStoreBuilder@3dc3a570, timestamped = true, caching = false, logging = false STARTED

MockProcessorContextStateStoreTest > builder = org.apache.kafka.streams.state.internals.TimestampedWindowStoreBuilder@3dc3a570, timestamped = true, caching = false, logging = false PASSED

MockProcessorContextStateStoreTest > builder = org.apache.kafka.streams.state.internals.WindowStoreBuilder@2c482d4d, timestamped = false, caching = true, logging = true STARTED

MockProcessorContextStateStoreTest > builder = org.apache.kafka.streams.state.internals.WindowStoreBuilder@2c482d4d, timestamped = false, caching = true, logging = true PASSED

MockProcessorContextStateStoreTest > builder = org.apache.kafka.streams.state.internals.WindowStoreBuilder@26cb30e3, timestamped = false, caching = true, logging = true STARTED

MockProcessorContextStateStoreTest > builder = org.apache.kafka.streams.state.internals.WindowStoreBuilder@26cb30e3, timestamped = false, caching = true, logging = true PASSED

MockProcessorContextStateStoreTest > builder = org.apache.kafka.streams.state.internals.WindowStoreBuilder@4207e1c9, timestamped = false, caching = true, logging = true STARTED

MockProcessorContextStateStoreTest > builder = org.apache.kafka.streams.state.internals.WindowStoreBuilder@4207e1c9, timestamped = false, caching = true, logging = true PASSED

MockProcessorContextStateStoreTest > builder = org.apache.kafka.streams.state.internals.WindowStoreBuilder@2385583a, timestamped = false, caching = true, logging = false STARTED

MockProcessorContextStateStoreTest > builder = org.apache.kafka.streams.state.internals.WindowStoreBuilder@2385583a, timestamped = false, caching = true, logging = false PASSED

MockProcessorContextStateStoreTest > builder = org.apache.kafka.streams.state.internals.WindowStoreBuilder@4bdf61c9, timestamped = false, caching = true, logging = false STARTED

MockProcessorContextStateStoreTest > builder = org.apache.kafka.streams.state.internals.WindowStoreBuilder@4bdf61c9, timestamped = false, caching = true, logging = false PASSED

MockProcessorContextStateStoreTest > builder = org.apache.kafka.streams.state.internals.WindowStoreBuilder@3393e4a3, timestamped = false, caching = true, logging = false STARTED

MockProcessorContextStateStoreTest > builder = org.apache.kafka.streams.state.internals.WindowStoreBuilder@3393e4a3, timestamped = false, caching = true, logging = false PASSED

MockProcessorContextStateStoreTest > builder = org.apache.kafka.streams.state.internals.WindowStoreBuilder@6b52b06f, timestamped = false, caching = false, logging = true STARTED

MockProcessorContextStateStoreTest > builder = org.apache.kafka.streams.state.internals.WindowStoreBuilder@6b52b06f, timestamped = false, caching = false, logging = true PASSED

MockProcessorContextStateStoreTest > builder = org.apache.kafka.streams.state.internals.WindowStoreBuilder@23d05ff4, timestamped = false, caching = false, logging = true STARTED

MockProcessorContextStateStoreTest > builder = org.apache.kafka.streams.state.internals.WindowStoreBuilder@23d05ff4, timestamped = false, caching = false, logging = true PASSED

MockProcessorContextStateStoreTest > builder = org.apache.kafka.streams.state.internals.WindowStoreBuilder@4f48f2e5, timestamped = false, caching = false, logging = true STARTED

MockProcessorContextStateStoreTest > builder = org.apache.kafka.streams.state.internals.WindowStoreBuilder@4f48f2e5, timestamped = false, caching = false, logging = true PASSED

MockProcessorContextStateStoreTest > builder = org.apache.kafka.streams.state.internals.WindowStoreBuilder@6a2f400e, timestamped = false, caching = false, logging = false STARTED

MockProcessorContextStateStoreTest > builder = org.apache.kafka.streams.state.internals.WindowStoreBuilder@6a2f400e, timestamped = false, caching = false, logging = false PASSED

MockProcessorContextStateStoreTest > builder = org.apache.kafka.streams.state.internals.WindowStoreBuilder@74257e5d, timestamped = false, caching = false, logging = false STARTED

MockProcessorContextStateStoreTest > builder = org.apache.kafka.streams.state.internals.WindowStoreBuilder@74257e5d, timestamped = false, caching = false, logging = false PASSED

MockProcessorContextStateStoreTest > builder = org.apache.kafka.streams.state.internals.WindowStoreBuilder@154022ab, timestamped = false, caching = false, logging = false STARTED

MockProcessorContextStateStoreTest > builder = org.apache.kafka.streams.state.internals.WindowStoreBuilder@154022ab, timestamped = false, caching = false, logging = false PASSED

MockProcessorContextStateStoreTest > builder = org.apache.kafka.streams.state.internals.SessionStoreBuilder@37681333, timestamped = false, caching = true, logging = true STARTED

MockProcessorContextStateStoreTest > builder = org.apache.kafka.streams.state.internals.SessionStoreBuilder@37681333, timestamped = false, caching = true, logging = true PASSED

MockProcessorContextStateStoreTest > builder = org.apache.kafka.streams.state.internals.SessionStoreBuilder@6cc4063d, timestamped = false, caching = true, logging = true STARTED

MockProcessorContextStateStoreTest > builder = org.apache.kafka.streams.state.internals.SessionStoreBuilder@6cc4063d, timestamped = false, caching = true, logging = true PASSED

MockProcessorContextStateStoreTest > builder = org.apache.kafka.streams.state.internals.SessionStoreBuilder@7a4ca735, timestamped = false, caching = true, logging = false STARTED

MockProcessorContextStateStoreTest > builder = org.apache.kafka.streams.state.internals.SessionStoreBuilder@7a4ca735, timestamped = false, caching = true, logging = false PASSED

MockProcessorContextStateStoreTest > builder = org.apache.kafka.streams.state.internals.SessionStoreBuilder@70567e4b, timestamped = false, caching = true, logging = false STARTED

MockProcessorContextStateStoreTest > builder = org.apache.kafka.streams.state.internals.SessionStoreBuilder@70567e4b, timestamped = false, caching = true, logging = false PASSED

MockProcessorContextStateStoreTest > builder = org.apache.kafka.streams.state.internals.SessionStoreBuilder@1f742195, timestamped = false, caching = false, logging = true STARTED

MockProcessorContextStateStoreTest > builder = org.apache.kafka.streams.state.internals.SessionStoreBuilder@1f742195, timestamped = false, caching = false, logging = true PASSED

MockProcessorContextStateStoreTest > builder = org.apache.kafka.streams.state.internals.SessionStoreBuilder@22018cd3, timestamped = false, caching = false, logging = true STARTED

MockProcessorContextStateStoreTest > builder = org.apache.kafka.streams.state.internals.SessionStoreBuilder@22018cd3, timestamped = false, caching = false, logging = true PASSED

MockProcessorContextStateStoreTest > builder = org.apache.kafka.streams.state.internals.SessionStoreBuilder@5bc19e0c, timestamped = false, caching = false, logging = false STARTED

MockProcessorContextStateStoreTest > builder = org.apache.kafka.streams.state.internals.SessionStoreBuilder@5bc19e0c, timestamped = false, caching = false, logging = false PASSED

MockProcessorContextStateStoreTest > builder = org.apache.kafka.streams.state.internals.SessionStoreBuilder@130a63eb, timestamped = false, caching = false, logging = false STARTED

MockProcessorContextStateStoreTest > builder = org.apache.kafka.streams.state.internals.SessionStoreBuilder@130a63eb, timestamped = false, caching = false, logging = false PASSED

TestRecordTest > testConsumerRecord() STARTED

TestRecordTest > testConsumerRecord() PASSED

TestRecordTest > testToString() STARTED

TestRecordTest > testToString() PASSED

TestRecordTest > testInvalidRecords() STARTED

TestRecordTest > testInvalidRecords() PASSED

TestRecordTest > testPartialConstructorEquals() STARTED

TestRecordTest > testPartialConstructorEquals() PASSED

TestRecordTest > testMultiFieldMatcher() STARTED

TestRecordTest > testMultiFieldMatcher() PASSED

TestRecordTest > testFields() STARTED

TestRecordTest > testFields() PASSED

TestRecordTest > testProducerRecord() STARTED

TestRecordTest > testProducerRecord() PASSED

TestRecordTest > testEqualsAndHashCode() STARTED

TestRecordTest > testEqualsAndHashCode() PASSED

> Task :streams:upgrade-system-tests-10:spotbugsMain NO-SOURCE
> Task :streams:upgrade-system-tests-10:test
> Task :streams:upgrade-system-tests-11:compileJava NO-SOURCE
> Task :streams:upgrade-system-tests-11:processResources NO-SOURCE
> Task :streams:upgrade-system-tests-11:classes UP-TO-DATE
> Task :streams:upgrade-system-tests-11:checkstyleMain NO-SOURCE
> Task :streams:upgrade-system-tests-11:compileTestJava
> Task :streams:upgrade-system-tests-11:processTestResources NO-SOURCE
> Task :streams:upgrade-system-tests-11:testClasses
> Task :streams:upgrade-system-tests-11:checkstyleTest
> Task :streams:upgrade-system-tests-11:spotbugsMain NO-SOURCE
> Task :streams:upgrade-system-tests-11:test
> Task :streams:upgrade-system-tests-20:compileJava NO-SOURCE
> Task :streams:upgrade-system-tests-20:processResources NO-SOURCE
> Task :streams:upgrade-system-tests-20:classes UP-TO-DATE
> Task :streams:upgrade-system-tests-20:checkstyleMain NO-SOURCE
> Task :streams:upgrade-system-tests-20:compileTestJava
> Task :streams:upgrade-system-tests-20:processTestResources NO-SOURCE
> Task :streams:upgrade-system-tests-20:testClasses
> Task :streams:upgrade-system-tests-20:checkstyleTest
> Task :streams:upgrade-system-tests-20:spotbugsMain NO-SOURCE
> Task :streams:upgrade-system-tests-20:test
> Task :streams:upgrade-system-tests-21:compileJava NO-SOURCE
> Task :streams:upgrade-system-tests-21:processResources NO-SOURCE
> Task :streams:upgrade-system-tests-21:classes UP-TO-DATE
> Task :streams:upgrade-system-tests-21:checkstyleMain NO-SOURCE
> Task :streams:upgrade-system-tests-21:compileTestJava
> Task :streams:upgrade-system-tests-21:processTestResources NO-SOURCE
> Task :streams:upgrade-system-tests-21:testClasses
> Task :streams:upgrade-system-tests-21:checkstyleTest
> Task :streams:upgrade-system-tests-21:spotbugsMain NO-SOURCE
> Task :streams:upgrade-system-tests-21:test
> Task :streams:upgrade-system-tests-22:compileJava NO-SOURCE
> Task :streams:upgrade-system-tests-22:processResources NO-SOURCE
> Task :streams:upgrade-system-tests-22:classes UP-TO-DATE
> Task :streams:upgrade-system-tests-22:checkstyleMain NO-SOURCE
> Task :streams:upgrade-system-tests-22:compileTestJava
> Task :streams:upgrade-system-tests-22:processTestResources NO-SOURCE
> Task :streams:upgrade-system-tests-22:testClasses
> Task :streams:upgrade-system-tests-22:checkstyleTest
> Task :streams:upgrade-system-tests-22:spotbugsMain NO-SOURCE
> Task :streams:upgrade-system-tests-22:test
> Task :streams:upgrade-system-tests-23:compileJava NO-SOURCE
> Task :streams:upgrade-system-tests-23:processResources NO-SOURCE
> Task :streams:upgrade-system-tests-23:classes UP-TO-DATE
> Task :streams:upgrade-system-tests-23:checkstyleMain NO-SOURCE
> Task :streams:upgrade-system-tests-23:compileTestJava
> Task :streams:upgrade-system-tests-23:processTestResources NO-SOURCE
> Task :streams:upgrade-system-tests-23:testClasses
> Task :streams:upgrade-system-tests-23:checkstyleTest
> Task :streams:upgrade-system-tests-23:spotbugsMain NO-SOURCE
> Task :streams:upgrade-system-tests-23:test
> Task :streams:upgrade-system-tests-24:compileJava NO-SOURCE
> Task :streams:upgrade-system-tests-24:processResources NO-SOURCE
> Task :streams:upgrade-system-tests-24:classes UP-TO-DATE
> Task :streams:upgrade-system-tests-24:checkstyleMain NO-SOURCE
> Task :streams:upgrade-system-tests-24:compileTestJava
> Task :streams:upgrade-system-tests-24:processTestResources NO-SOURCE
> Task :streams:upgrade-system-tests-24:testClasses
> Task :streams:upgrade-system-tests-24:checkstyleTest
> Task :streams:upgrade-system-tests-24:spotbugsMain NO-SOURCE
> Task :streams:upgrade-system-tests-24:test
> Task :streams:upgrade-system-tests-25:compileJava NO-SOURCE
> Task :streams:upgrade-system-tests-25:processResources NO-SOURCE
> Task :streams:upgrade-system-tests-25:classes UP-TO-DATE
> Task :streams:upgrade-system-tests-25:checkstyleMain NO-SOURCE
> Task :streams:upgrade-system-tests-25:compileTestJava
> Task :streams:upgrade-system-tests-25:processTestResources NO-SOURCE
> Task :streams:upgrade-system-tests-25:testClasses
> Task :streams:upgrade-system-tests-25:checkstyleTest
> Task :streams:upgrade-system-tests-25:spotbugsMain NO-SOURCE
> Task :streams:upgrade-system-tests-25:test
> Task :streams:upgrade-system-tests-26:compileJava NO-SOURCE
> Task :streams:upgrade-system-tests-26:processResources NO-SOURCE
> Task :streams:upgrade-system-tests-26:classes UP-TO-DATE
> Task :streams:upgrade-system-tests-26:checkstyleMain NO-SOURCE
> Task :streams:upgrade-system-tests-26:compileTestJava
> Task :streams:upgrade-system-tests-26:processTestResources NO-SOURCE
> Task :streams:upgrade-system-tests-26:testClasses
> Task :streams:upgrade-system-tests-26:checkstyleTest
> Task :streams:upgrade-system-tests-26:spotbugsMain NO-SOURCE
> Task :streams:upgrade-system-tests-26:test
> Task :streams:upgrade-system-tests-27:compileJava NO-SOURCE
> Task :streams:upgrade-system-tests-27:processResources NO-SOURCE
> Task :streams:upgrade-system-tests-27:classes UP-TO-DATE
> Task :streams:upgrade-system-tests-27:checkstyleMain NO-SOURCE
> Task :streams:upgrade-system-tests-27:compileTestJava
> Task :streams:upgrade-system-tests-27:processTestResources NO-SOURCE
> Task :streams:upgrade-system-tests-27:testClasses
> Task :streams:upgrade-system-tests-27:checkstyleTest
> Task :streams:upgrade-system-tests-27:spotbugsMain NO-SOURCE
> Task :streams:upgrade-system-tests-27:test

FAILURE: Build failed with an exception.

* What went wrong:
Execution failed for task ':streams:test'.
> There were failing tests. See the report at: file://<https://ci-builds.apache.org/job/Kafka/job/kafka-trunk-jdk15/ws/streams/build/reports/tests/test/index.html>

* Try:
Run with --stacktrace option to get the stack trace. Run with --info or --debug option to get more log output. Run with --scan to get full insights.

* Get more help at https://help.gradle.org

Deprecated Gradle features were used in this build, making it incompatible with Gradle 7.0.
Use '--warning-mode all' to show the individual deprecation warnings.
See https://docs.gradle.org/6.7.1/userguide/command_line_interface.html#sec:command_line_warnings

BUILD FAILED in 2h 22m 18s
240 actionable tasks: 205 executed, 35 up-to-date
Build step 'Execute shell' marked build as failure
Recording test results
Not sending mail to unregistered user github@hugo-hirsch.de

Build failed in Jenkins: Kafka » kafka-trunk-jdk15 #400

Posted by Apache Jenkins Server <je...@builds.apache.org>.
See <https://ci-builds.apache.org/job/Kafka/job/kafka-trunk-jdk15/400/display/redirect?page=changes>

Changes:

[github] KAFKA-12171: Migrate streams:test-utils module to JUnit 5 (#9856)


------------------------------------------
[...truncated 3.67 MB...]
TopologyTestDriverEosTest > shouldReturnAllStoresNames() PASSED

TopologyTestDriverEosTest > shouldPassRecordHeadersIntoSerializersAndDeserializers() STARTED

TopologyTestDriverEosTest > shouldPassRecordHeadersIntoSerializersAndDeserializers() PASSED

TopologyTestDriverEosTest > shouldProcessConsumerRecordList() STARTED

TopologyTestDriverEosTest > shouldProcessConsumerRecordList() PASSED

TopologyTestDriverEosTest > shouldUseSinkSpecificSerializers() STARTED

TopologyTestDriverEosTest > shouldUseSinkSpecificSerializers() PASSED

TopologyTestDriverEosTest > shouldFlushStoreForFirstInput() STARTED

TopologyTestDriverEosTest > shouldFlushStoreForFirstInput() PASSED

TopologyTestDriverEosTest > shouldProcessFromSourceThatMatchPattern() STARTED

TopologyTestDriverEosTest > shouldProcessFromSourceThatMatchPattern() PASSED

TopologyTestDriverEosTest > shouldCaptureSinkTopicNamesIfWrittenInto() STARTED

TopologyTestDriverEosTest > shouldCaptureSinkTopicNamesIfWrittenInto() PASSED

TopologyTestDriverEosTest > shouldUpdateStoreForNewKey() STARTED

TopologyTestDriverEosTest > shouldUpdateStoreForNewKey() PASSED

TopologyTestDriverEosTest > shouldSendRecordViaCorrectSourceTopicDeprecated() STARTED

TopologyTestDriverEosTest > shouldSendRecordViaCorrectSourceTopicDeprecated() PASSED

TopologyTestDriverEosTest > shouldPunctuateOnWallClockTime() STARTED

TopologyTestDriverEosTest > shouldPunctuateOnWallClockTime() PASSED

TopologyTestDriverEosTest > shouldSetRecordMetadata() STARTED

TopologyTestDriverEosTest > shouldSetRecordMetadata() PASSED

TopologyTestDriverEosTest > shouldNotUpdateStoreForLargerValue() STARTED

TopologyTestDriverEosTest > shouldNotUpdateStoreForLargerValue() PASSED

TopologyTestDriverEosTest > shouldReturnCorrectInMemoryStoreTypeOnly() STARTED

TopologyTestDriverEosTest > shouldReturnCorrectInMemoryStoreTypeOnly() PASSED

TopologyTestDriverEosTest > shouldThrowForMissingTime() STARTED

TopologyTestDriverEosTest > shouldThrowForMissingTime() PASSED

TopologyTestDriverEosTest > shouldCaptureInternalTopicNamesIfWrittenInto() STARTED

TopologyTestDriverEosTest > shouldCaptureInternalTopicNamesIfWrittenInto() PASSED

TopologyTestDriverEosTest > shouldPunctuateOnWallClockTimeDeprecated() STARTED

TopologyTestDriverEosTest > shouldPunctuateOnWallClockTimeDeprecated() PASSED

TopologyTestDriverEosTest > shouldProcessRecordForTopic() STARTED

TopologyTestDriverEosTest > shouldProcessRecordForTopic() PASSED

TopologyTestDriverEosTest > shouldForwardRecordsFromSubtopologyToSubtopology() STARTED

TopologyTestDriverEosTest > shouldForwardRecordsFromSubtopologyToSubtopology() PASSED

TopologyTestDriverEosTest > shouldNotUpdateStoreForSmallerValue() STARTED

TopologyTestDriverEosTest > shouldNotUpdateStoreForSmallerValue() PASSED

TopologyTestDriverEosTest > shouldCreateStateDirectoryForStatefulTopology() STARTED

TopologyTestDriverEosTest > shouldCreateStateDirectoryForStatefulTopology() PASSED

TopologyTestDriverEosTest > shouldNotRequireParameters() STARTED

TopologyTestDriverEosTest > shouldNotRequireParameters() PASSED

TopologyTestDriverEosTest > shouldPunctuateIfWallClockTimeAdvances() STARTED

TopologyTestDriverEosTest > shouldPunctuateIfWallClockTimeAdvances() PASSED

KeyValueStoreFacadeTest > shouldReturnIsOpen() STARTED

KeyValueStoreFacadeTest > shouldReturnIsOpen() PASSED

KeyValueStoreFacadeTest > shouldDeleteAndReturnPlainValue() STARTED

KeyValueStoreFacadeTest > shouldDeleteAndReturnPlainValue() PASSED

KeyValueStoreFacadeTest > shouldReturnName() STARTED

KeyValueStoreFacadeTest > shouldReturnName() PASSED

KeyValueStoreFacadeTest > shouldPutWithUnknownTimestamp() STARTED

KeyValueStoreFacadeTest > shouldPutWithUnknownTimestamp() PASSED

KeyValueStoreFacadeTest > shouldPutAllWithUnknownTimestamp() STARTED

KeyValueStoreFacadeTest > shouldPutAllWithUnknownTimestamp() PASSED

KeyValueStoreFacadeTest > shouldReturnIsPersistent() STARTED

KeyValueStoreFacadeTest > shouldReturnIsPersistent() PASSED

KeyValueStoreFacadeTest > shouldForwardDeprecatedInit() STARTED

KeyValueStoreFacadeTest > shouldForwardDeprecatedInit() PASSED

KeyValueStoreFacadeTest > shouldPutIfAbsentWithUnknownTimestamp() STARTED

KeyValueStoreFacadeTest > shouldPutIfAbsentWithUnknownTimestamp() PASSED

KeyValueStoreFacadeTest > shouldForwardClose() STARTED

KeyValueStoreFacadeTest > shouldForwardClose() PASSED

KeyValueStoreFacadeTest > shouldForwardFlush() STARTED

KeyValueStoreFacadeTest > shouldForwardFlush() PASSED

KeyValueStoreFacadeTest > shouldForwardInit() STARTED

KeyValueStoreFacadeTest > shouldForwardInit() PASSED

> Task :streams:upgrade-system-tests-11:processTestResources NO-SOURCE
> Task :streams:upgrade-system-tests-11:testClasses
> Task :streams:upgrade-system-tests-11:checkstyleTest
> Task :streams:upgrade-system-tests-11:spotbugsMain NO-SOURCE
> Task :streams:upgrade-system-tests-11:test
> Task :streams:upgrade-system-tests-20:compileJava NO-SOURCE
> Task :streams:upgrade-system-tests-20:processResources NO-SOURCE
> Task :streams:upgrade-system-tests-20:classes UP-TO-DATE
> Task :streams:upgrade-system-tests-20:checkstyleMain NO-SOURCE
> Task :streams:upgrade-system-tests-20:compileTestJava
> Task :streams:upgrade-system-tests-20:processTestResources NO-SOURCE
> Task :streams:upgrade-system-tests-20:testClasses
> Task :streams:upgrade-system-tests-20:checkstyleTest
> Task :streams:upgrade-system-tests-20:spotbugsMain NO-SOURCE
> Task :streams:upgrade-system-tests-20:test
> Task :streams:upgrade-system-tests-21:compileJava NO-SOURCE
> Task :streams:upgrade-system-tests-21:processResources NO-SOURCE
> Task :streams:upgrade-system-tests-21:classes UP-TO-DATE
> Task :streams:upgrade-system-tests-21:checkstyleMain NO-SOURCE
> Task :streams:upgrade-system-tests-21:compileTestJava
> Task :streams:upgrade-system-tests-21:processTestResources NO-SOURCE
> Task :streams:upgrade-system-tests-21:testClasses
> Task :streams:upgrade-system-tests-21:checkstyleTest
> Task :streams:upgrade-system-tests-21:spotbugsMain NO-SOURCE
> Task :streams:upgrade-system-tests-21:test
> Task :streams:upgrade-system-tests-22:compileJava NO-SOURCE
> Task :streams:upgrade-system-tests-22:processResources NO-SOURCE
> Task :streams:upgrade-system-tests-22:classes UP-TO-DATE
> Task :streams:upgrade-system-tests-22:checkstyleMain NO-SOURCE
> Task :streams:upgrade-system-tests-22:compileTestJava
> Task :streams:upgrade-system-tests-22:processTestResources NO-SOURCE
> Task :streams:upgrade-system-tests-22:testClasses
> Task :streams:upgrade-system-tests-22:checkstyleTest
> Task :streams:upgrade-system-tests-22:spotbugsMain NO-SOURCE
> Task :streams:upgrade-system-tests-22:test
> Task :streams:upgrade-system-tests-23:compileJava NO-SOURCE
> Task :streams:upgrade-system-tests-23:processResources NO-SOURCE
> Task :streams:upgrade-system-tests-23:classes UP-TO-DATE
> Task :streams:upgrade-system-tests-23:checkstyleMain NO-SOURCE
> Task :streams:upgrade-system-tests-23:compileTestJava
> Task :streams:upgrade-system-tests-23:processTestResources NO-SOURCE
> Task :streams:upgrade-system-tests-23:testClasses
> Task :streams:upgrade-system-tests-23:checkstyleTest
> Task :streams:upgrade-system-tests-23:spotbugsMain NO-SOURCE
> Task :streams:upgrade-system-tests-23:test
> Task :streams:upgrade-system-tests-24:compileJava NO-SOURCE
> Task :streams:upgrade-system-tests-24:processResources NO-SOURCE
> Task :streams:upgrade-system-tests-24:classes UP-TO-DATE
> Task :streams:upgrade-system-tests-24:checkstyleMain NO-SOURCE
> Task :streams:upgrade-system-tests-24:compileTestJava
> Task :streams:upgrade-system-tests-24:processTestResources NO-SOURCE
> Task :streams:upgrade-system-tests-24:testClasses
> Task :streams:upgrade-system-tests-24:checkstyleTest
> Task :streams:upgrade-system-tests-24:spotbugsMain NO-SOURCE
> Task :streams:upgrade-system-tests-24:test
> Task :streams:upgrade-system-tests-25:compileJava NO-SOURCE
> Task :streams:upgrade-system-tests-25:processResources NO-SOURCE
> Task :streams:upgrade-system-tests-25:classes UP-TO-DATE
> Task :streams:upgrade-system-tests-25:checkstyleMain NO-SOURCE
> Task :streams:upgrade-system-tests-25:compileTestJava
> Task :streams:upgrade-system-tests-25:processTestResources NO-SOURCE
> Task :streams:upgrade-system-tests-25:testClasses
> Task :streams:upgrade-system-tests-25:checkstyleTest
> Task :streams:upgrade-system-tests-25:spotbugsMain NO-SOURCE
> Task :streams:upgrade-system-tests-25:test
> Task :streams:upgrade-system-tests-26:compileJava NO-SOURCE
> Task :streams:upgrade-system-tests-26:processResources NO-SOURCE
> Task :streams:upgrade-system-tests-26:classes UP-TO-DATE
> Task :streams:upgrade-system-tests-26:checkstyleMain NO-SOURCE
> Task :streams:upgrade-system-tests-26:compileTestJava
> Task :streams:upgrade-system-tests-26:processTestResources NO-SOURCE
> Task :streams:upgrade-system-tests-26:testClasses
> Task :streams:upgrade-system-tests-26:checkstyleTest
> Task :streams:upgrade-system-tests-26:spotbugsMain NO-SOURCE
> Task :streams:upgrade-system-tests-26:test
> Task :streams:upgrade-system-tests-27:compileJava NO-SOURCE
> Task :streams:upgrade-system-tests-27:processResources NO-SOURCE
> Task :streams:upgrade-system-tests-27:classes UP-TO-DATE
> Task :streams:upgrade-system-tests-27:checkstyleMain NO-SOURCE
> Task :streams:upgrade-system-tests-27:compileTestJava
> Task :streams:upgrade-system-tests-27:processTestResources NO-SOURCE
> Task :streams:upgrade-system-tests-27:testClasses
> Task :streams:upgrade-system-tests-27:checkstyleTest
> Task :streams:upgrade-system-tests-27:spotbugsMain NO-SOURCE
> Task :streams:upgrade-system-tests-27:test

FAILURE: Build completed with 2 failures.

1: Task failed with an exception.
-----------
* What went wrong:
Execution failed for task ':core:test'.
> There were failing tests. See the report at: file://<https://ci-builds.apache.org/job/Kafka/job/kafka-trunk-jdk15/ws/core/build/reports/tests/test/index.html>

* Try:
Run with --stacktrace option to get the stack trace. Run with --info or --debug option to get more log output. Run with --scan to get full insights.
==============================================================================

2: Task failed with an exception.
-----------
* What went wrong:
Execution failed for task ':streams:test'.
> There were failing tests. See the report at: file://<https://ci-builds.apache.org/job/Kafka/job/kafka-trunk-jdk15/ws/streams/build/reports/tests/test/index.html>

* Try:
Run with --stacktrace option to get the stack trace. Run with --info or --debug option to get more log output. Run with --scan to get full insights.
==============================================================================

* Get more help at https://help.gradle.org

Deprecated Gradle features were used in this build, making it incompatible with Gradle 7.0.
Use '--warning-mode all' to show the individual deprecation warnings.
See https://docs.gradle.org/6.7.1/userguide/command_line_interface.html#sec:command_line_warnings

BUILD FAILED in 2h 59m 50s
240 actionable tasks: 205 executed, 35 up-to-date
Build step 'Execute shell' marked build as failure
Recording test results
Not sending mail to unregistered user github@hugo-hirsch.de