You are viewing a plain text version of this content. The canonical link for it is here.
Posted to commits@flex.apache.org by fl...@gmail.com on 2014/05/11 16:25:47 UTC

flex-sdk_mustella-mobile - Build # 716 - Failure!

flex-sdk_mustella-mobile - Build # 716 - Failure:

http://flex-mustella.cloudapp.net/job/flex-sdk_mustella-mobile/716/

Changes for Build #715

Changes for Build #716


--------------------------------

Started by user flexpmc
[EnvInject] - Loading node environment variables.
Building remotely on WindowsSlave in workspace c:\jenkins_slave\workspace\flex-sdk_mustella-mobile
 > C:\Program Files (x86)\Git\bin\git.exe rev-parse --is-inside-work-tree
Fetching changes from the remote Git repository
 > C:\Program Files (x86)\Git\bin\git.exe config remote.origin.url https://git-wip-us.apache.org/repos/asf/flex-sdk.git
Fetching upstream changes from https://git-wip-us.apache.org/repos/asf/flex-sdk.git
 > C:\Program Files (x86)\Git\bin\git.exe --version
 > C:\Program Files (x86)\Git\bin\git.exe fetch --tags --progress https://git-wip-us.apache.org/repos/asf/flex-sdk.git +refs/heads/*:refs/remotes/origin/*
 > C:\Program Files (x86)\Git\bin\git.exe rev-parse "origin/develop^{commit}"
Checking out Revision 6fc0cfaa4c477ac16f32418f4e611b9ba6a8348a (origin/develop)
 > C:\Program Files (x86)\Git\bin\git.exe config core.sparsecheckout
 > C:\Program Files (x86)\Git\bin\git.exe checkout -f 6fc0cfaa4c477ac16f32418f4e611b9ba6a8348a
java.io.IOException: Could not checkout 6fc0cfaa4c477ac16f32418f4e611b9ba6a8348a
	at hudson.plugins.git.GitSCM.checkout(GitSCM.java:899)
	at hudson.model.AbstractProject.checkout(AbstractProject.java:1251)
	at hudson.model.AbstractBuild$AbstractBuildExecution.defaultCheckout(AbstractBuild.java:604)
	at jenkins.scm.SCMCheckoutStrategy.checkout(SCMCheckoutStrategy.java:86)
	at hudson.model.AbstractBuild$AbstractBuildExecution.run(AbstractBuild.java:513)
	at hudson.model.Run.execute(Run.java:1704)
	at hudson.model.FreeStyleBuild.run(FreeStyleBuild.java:43)
	at hudson.model.ResourceController.execute(ResourceController.java:88)
	at hudson.model.Executor.run(Executor.java:231)
Caused by: hudson.plugins.git.GitLockFailedException: Could not lock repository. Please try again
	at org.jenkinsci.plugins.gitclient.CliGitAPIImpl$8.execute(CliGitAPIImpl.java:1477)
	at org.jenkinsci.plugins.gitclient.RemoteGitImpl$CommandInvocationHandler$1.call(RemoteGitImpl.java:153)
	at org.jenkinsci.plugins.gitclient.RemoteGitImpl$CommandInvocationHandler$1.call(RemoteGitImpl.java:146)
	at hudson.remoting.UserRequest.perform(UserRequest.java:118)
	at hudson.remoting.UserRequest.perform(UserRequest.java:48)
	at hudson.remoting.Request$2.run(Request.java:328)
	at hudson.remoting.InterceptingExecutorService$1.call(InterceptingExecutorService.java:72)
	at java.util.concurrent.FutureTask$Sync.innerRun(FutureTask.java:303)
	at java.util.concurrent.FutureTask.run(FutureTask.java:138)
	at java.util.concurrent.ThreadPoolExecutor$Worker.runTask(ThreadPoolExecutor.java:885)
	at java.util.concurrent.ThreadPoolExecutor$Worker.run(ThreadPoolExecutor.java:907)
	at hudson.remoting.Engine$1$1.run(Engine.java:63)
	at java.lang.Thread.run(Thread.java:619)
Caused by: hudson.plugins.git.GitException: Command "C:\Program Files (x86)\Git\bin\git.exe checkout -f 6fc0cfaa4c477ac16f32418f4e611b9ba6a8348a" returned status code 128:
stdout: 
stderr: fatal: Unable to create 'c:/jenkins_slave/workspace/flex-sdk_mustella-mobile/.git/index.lock': File exists.

If no other git process is currently running, this probably means a
git process crashed in this repository earlier. Make sure no other git
process is running and remove the file manually to continue.

	at org.jenkinsci.plugins.gitclient.CliGitAPIImpl.launchCommandIn(CliGitAPIImpl.java:1307)
	at org.jenkinsci.plugins.gitclient.CliGitAPIImpl.launchCommandIn(CliGitAPIImpl.java:1283)
	at org.jenkinsci.plugins.gitclient.CliGitAPIImpl.launchCommandIn(CliGitAPIImpl.java:1279)
	at org.jenkinsci.plugins.gitclient.CliGitAPIImpl.launchCommand(CliGitAPIImpl.java:1084)
	at org.jenkinsci.plugins.gitclient.CliGitAPIImpl.launchCommand(CliGitAPIImpl.java:1094)
	at org.jenkinsci.plugins.gitclient.CliGitAPIImpl$8.execute(CliGitAPIImpl.java:1474)
	... 12 more
Email was triggered for: Failure
Sending email for trigger: Failure


(sent from ext-email)

flex-sdk_mustella-mobile - Build # 719 - Fixed!

Posted by fl...@gmail.com.
flex-sdk_mustella-mobile - Build # 719 - Fixed:

http://flex-mustella.cloudapp.net/job/flex-sdk_mustella-mobile/719/

Changes for Build #715

Changes for Build #716

Changes for Build #717

Changes for Build #718

Changes for Build #719
[aharui] forgot to update this variable when switching versions



--------------------------------

[...truncated 12834 lines...]
     [java] Loading configuration file C:\jenkins_slave\workspace\flex-sdk_mustella-mobile\frameworks\airmobile-config.xml
     [java] C:\jenkins_slave\workspace\flex-sdk_mustella-mobile\mustella\tests\mobile\SkinnablePopUpContainer\swfs\SkinnablePopUpContainerApp.swf (2351234 bytes)
     [java] All done with the compile
     [java] leaving the compile, elapsed: 43
     [java] ...via exit
     [echo] compileswfs jreturn is 0

do_fail:

compileswfs:

getExcludes:

getExcludeIds:

populateExcludeTable:
     [echo] populate exclude, got this for db time: 2014/05/12 08:44:10

justrun:

delete_cache:
     [echo] delete cache: /Users/ApacheFlex/Library/Caches/Adobe/Flash Player/AssetCache

delete_cache:
     [echo] delete cache: /Users/ApacheFlex/AppData/Roaming/Adobe/Flash Player/AssetCache
   [delete] Deleting directory C:\Users\ApacheFlex\AppData\Roaming\Adobe\Flash Player\AssetCache\XGDFPGTC
   [delete] Deleting directory C:\Users\ApacheFlex\AppData\Roaming\Adobe\Flash Player\AssetCache

delete_cache:
     [echo] delete cache: C:\Users\ApacheFlex/Application Data/Adobe/Flash Player/AssetCache

android_runner:

ios_runner:

qnx_runner:

desktop_runner:
     [echo] **** Willkommen auf Runner ****
     [java] the apollo situation: C:\ApacheFlex\dependencies\AdobeAIRSDK\13_beta/adl.exe -runtime C:\ApacheFlex\dependencies\AdobeAIRSDK\13_beta\runtimes\air\win
     [java] starting results server
     [java] starting baseline server
     [java] test script count: 3
     [java] starting the baseline server: Mon May 12 08:45:00 ACT 2014
     [java] apollo adj with : C:\jenkins_slave\workspace\flex-sdk_mustella-mobile\mustella\tests\mobile\SkinnablePopUpContainer\swfs\SkinnablePopUpContainerApp.swf
     [java] apollo adj thinks it's a swf
     [java] writing Apollo file!
     [java] full swf is C:\jenkins_slave\workspace\flex-sdk_mustella-mobile\mustella\tests\mobile\SkinnablePopUpContainer\swfs\SkinnablePopUpContainerApp.swf
     [java] post ApolloAdjuster: C:\jenkins_slave\workspace\flex-sdk_mustella-mobile\mustella\tests\mobile\SkinnablePopUpContainer\swfs\SkinnablePopUpContainerApp.xml
     [java] new test file: C:\jenkins_slave\workspace\flex-sdk_mustella-mobile\mustella\tests\mobile\SkinnablePopUpContainer\swfs\SkinnablePopUpContainerApp.xml
     [java] ******** cmdArr before: 
     [java] 	C:\ApacheFlex\dependencies\AdobeAIRSDK\13_beta\bin\adl.exe
     [java] 	C:\jenkins_slave\workspace\flex-sdk_mustella-mobile\mustella\tests\mobile\SkinnablePopUpContainer\swfs\SkinnablePopUpContainerApp.xml
     [java] ******** moreParameters before: 
     [java] 	-screensize
     [java] 	640x960:640x960
     [java] 	-profile
     [java] 	mobileDevice
     [java] 	-XscreenDPI
     [java] 	240
     [java] ******** cmdArr after: 
     [java] 	C:\ApacheFlex\dependencies\AdobeAIRSDK\13_beta\bin\adl.exe
     [java] 	C:\jenkins_slave\workspace\flex-sdk_mustella-mobile\mustella\tests\mobile\SkinnablePopUpContainer\swfs\SkinnablePopUpContainerApp.xml
     [java] 	-screensize
     [java] 	640x960:640x960
     [java] 	-profile
     [java] 	mobileDevice
     [java] 	-XscreenDPI
     [java] 	240
     [java] getting directory from the swf file
     [java] derived directory: C:\jenkins_slave\workspace\flex-sdk_mustella-mobile\mustella\tests\mobile\SkinnablePopUpContainer\swfs
     [java] Launching: 
     [java]  C:\ApacheFlex\dependencies\AdobeAIRSDK\13_beta\bin\adl.exe C:\jenkins_slave\workspace\flex-sdk_mustella-mobile\mustella\tests\mobile\SkinnablePopUpContainer\swfs\SkinnablePopUpContainerApp.xml -screensize 640x960:640x960 -profile mobileDevice -XscreenDPI 240 Launching: C:\ApacheFlex\dependencies\AdobeAIRSDK\13_beta\bin\adl.exe C:\jenkins_slave\workspace\flex-sdk_mustella-mobile\mustella\tests\mobile\SkinnablePopUpContainer\swfs\SkinnablePopUpContainerApp.xml
     [java] USING directory: C:\jenkins_slave\workspace\flex-sdk_mustella-mobile\mustella\tests\mobile\SkinnablePopUpContainer\swfs
     [java] time: 08:45:00.722
     [java] SCRIPTDONE! 08:45:06.577
     [java] GET /ScriptComplete?0 HTTP/1.1
     [java] Before Wait loop 08:45:06.577 waiting = 0
     [java] After Wait loop 08:45:06.577 waiting = 0
     [java] clobberProcess false
     [java] Total Results so far: 1
     [java] removing the xml app file
     [java] Grab log, do parse = false
     [java] Grabbing the log from: C:\Users\ApacheFlex\AppData/Roaming\Macromedia/Flash Player/Logs/flashlog.txt to: C:\jenkins_slave\workspace\flex-sdk_mustella-mobile\mustella\tests\mobile\SkinnablePopUpContainer\swfs\SkinnablePopUpContainerApp.log
     [java] waited 1500
     [java] ClobberProcess, it was already null
     [java] apollo adj with : C:\jenkins_slave\workspace\flex-sdk_mustella-mobile\mustella\tests\mobile\ViewAndViewNavigator\swfs\ViewAndViewNavigatorMainTabbed.swf
     [java] apollo adj thinks it's a swf
     [java] writing Apollo file!
     [java] full swf is C:\jenkins_slave\workspace\flex-sdk_mustella-mobile\mustella\tests\mobile\ViewAndViewNavigator\swfs\ViewAndViewNavigatorMainTabbed.swf
     [java] post ApolloAdjuster: C:\jenkins_slave\workspace\flex-sdk_mustella-mobile\mustella\tests\mobile\ViewAndViewNavigator\swfs\ViewAndViewNavigatorMainTabbed.xml
     [java] new test file: C:\jenkins_slave\workspace\flex-sdk_mustella-mobile\mustella\tests\mobile\ViewAndViewNavigator\swfs\ViewAndViewNavigatorMainTabbed.xml
     [java] ******** cmdArr before: 
     [java] 	C:\ApacheFlex\dependencies\AdobeAIRSDK\13_beta\bin\adl.exe
     [java] 	C:\jenkins_slave\workspace\flex-sdk_mustella-mobile\mustella\tests\mobile\ViewAndViewNavigator\swfs\ViewAndViewNavigatorMainTabbed.xml
     [java] ******** moreParameters before: 
     [java] 	-screensize
     [java] 	640x960:640x960
     [java] 	-profile
     [java] 	mobileDevice
     [java] 	-XscreenDPI
     [java] 	240
     [java] ******** cmdArr after: 
     [java] 	C:\ApacheFlex\dependencies\AdobeAIRSDK\13_beta\bin\adl.exe
     [java] 	C:\jenkins_slave\workspace\flex-sdk_mustella-mobile\mustella\tests\mobile\ViewAndViewNavigator\swfs\ViewAndViewNavigatorMainTabbed.xml
     [java] 	-screensize
     [java] 	640x960:640x960
     [java] 	-profile
     [java] 	mobileDevice
     [java] 	-XscreenDPI
     [java] 	240
     [java] getting directory from the swf file
     [java] derived directory: C:\jenkins_slave\workspace\flex-sdk_mustella-mobile\mustella\tests\mobile\ViewAndViewNavigator\swfs
     [java] Launching: 
     [java]  C:\ApacheFlex\dependencies\AdobeAIRSDK\13_beta\bin\adl.exe C:\jenkins_slave\workspace\flex-sdk_mustella-mobile\mustella\tests\mobile\ViewAndViewNavigator\swfs\ViewAndViewNavigatorMainTabbed.xml -screensize 640x960:640x960 -profile mobileDevice -XscreenDPI 240 Launching: C:\ApacheFlex\dependencies\AdobeAIRSDK\13_beta\bin\adl.exe C:\jenkins_slave\workspace\flex-sdk_mustella-mobile\mustella\tests\mobile\ViewAndViewNavigator\swfs\ViewAndViewNavigatorMainTabbed.xml
     [java] USING directory: C:\jenkins_slave\workspace\flex-sdk_mustella-mobile\mustella\tests\mobile\ViewAndViewNavigator\swfs
     [java] time: 08:45:08.418
     [java] SCRIPTDONE! 08:45:14.507
     [java] GET /ScriptComplete?0 HTTP/1.1
     [java] Before Wait loop 08:45:14.507 waiting = 0
     [java] After Wait loop 08:45:14.507 waiting = 0
     [java] clobberProcess false
     [java] Total Results so far: 3
     [java] removing the xml app file
     [java] Grab log, do parse = false
     [java] Grabbing the log from: C:\Users\ApacheFlex\AppData/Roaming\Macromedia/Flash Player/Logs/flashlog.txt to: C:\jenkins_slave\workspace\flex-sdk_mustella-mobile\mustella\tests\mobile\ViewAndViewNavigator\swfs\ViewAndViewNavigatorMainTabbed.log
     [java] apollo adj with : C:\jenkins_slave\workspace\flex-sdk_mustella-mobile\mustella\tests\mobile\components\ActionBar\swfs\ActionBarTest.swf
     [java] apollo adj thinks it's a swf
     [java] writing Apollo file!
     [java] full swf is C:\jenkins_slave\workspace\flex-sdk_mustella-mobile\mustella\tests\mobile\components\ActionBar\swfs\ActionBarTest.swf
     [java] post ApolloAdjuster: C:\jenkins_slave\workspace\flex-sdk_mustella-mobile\mustella\tests\mobile\components\ActionBar\swfs\ActionBarTest.xml
     [java] new test file: C:\jenkins_slave\workspace\flex-sdk_mustella-mobile\mustella\tests\mobile\components\ActionBar\swfs\ActionBarTest.xml
     [java] ******** cmdArr before: 
     [java] 	C:\ApacheFlex\dependencies\AdobeAIRSDK\13_beta\bin\adl.exe
     [java] 	C:\jenkins_slave\workspace\flex-sdk_mustella-mobile\mustella\tests\mobile\components\ActionBar\swfs\ActionBarTest.xml
     [java] ******** moreParameters before: 
     [java] 	-screensize
     [java] 	640x960:640x960
     [java] 	-profile
     [java] 	mobileDevice
     [java] 	-XscreenDPI
     [java] 	240
     [java] ******** cmdArr after: 
     [java] 	C:\ApacheFlex\dependencies\AdobeAIRSDK\13_beta\bin\adl.exe
     [java] 	C:\jenkins_slave\workspace\flex-sdk_mustella-mobile\mustella\tests\mobile\components\ActionBar\swfs\ActionBarTest.xml
     [java] 	-screensize
     [java] 	640x960:640x960
     [java] 	-profile
     [java] 	mobileDevice
     [java] 	-XscreenDPI
     [java] 	240
     [java] getting directory from the swf file
     [java] derived directory: C:\jenkins_slave\workspace\flex-sdk_mustella-mobile\mustella\tests\mobile\components\ActionBar\swfs
     [java] Launching: 
     [java]  C:\ApacheFlex\dependencies\AdobeAIRSDK\13_beta\bin\adl.exe C:\jenkins_slave\workspace\flex-sdk_mustella-mobile\mustella\tests\mobile\components\ActionBar\swfs\ActionBarTest.xml -screensize 640x960:640x960 -profile mobileDevice -XscreenDPI 240 Launching: C:\ApacheFlex\dependencies\AdobeAIRSDK\13_beta\bin\adl.exe C:\jenkins_slave\workspace\flex-sdk_mustella-mobile\mustella\tests\mobile\components\ActionBar\swfs\ActionBarTest.xml
     [java] USING directory: C:\jenkins_slave\workspace\flex-sdk_mustella-mobile\mustella\tests\mobile\components\ActionBar\swfs
     [java] time: 08:45:16.233
     [java] waited 1400
     [java] ClobberProcess, it was already null
     [java] SCRIPTDONE! 08:45:23.405
     [java] GET /ScriptComplete?0 HTTP/1.1
     [java] Before Wait loop 08:45:23.405 waiting = 0
     [java] After Wait loop 08:45:23.405 waiting = 0
     [java] clobberProcess false
     [java] Total Results so far: 6
     [java] waited 1400
     [java] ClobberProcess, it was already null
     [java] removing the xml app file
     [java] Grab log, do parse = false
     [java] Grabbing the log from: C:\Users\ApacheFlex\AppData/Roaming\Macromedia/Flash Player/Logs/flashlog.txt to: C:\jenkins_slave\workspace\flex-sdk_mustella-mobile\mustella\tests\mobile\components\ActionBar\swfs\ActionBarTest.log
     [java] at the end of main
     [java] Shutting down the results server
     [java] shutting down the baseline server
     [java] done waiting for results...bye
     [java] =====================================================
     [java]     Passes: 6
     [java]     Fails: 0
     [java] =====================================================
     [java] 
     [java] =====================================================
     [java] =====================================================
     [java] 	Passed: 
     [java] =====================================================
     [java] mobile/SkinnablePopUpContainer/tests/SpucProperties isModal Passed  
     [java] mobile/ViewAndViewNavigator/tests/ViewAndViewNavigator_orientationTabbed orientationStatesUnDefinedActionBarOverlayLeftTabbed Passed  
     [java] mobile/ViewAndViewNavigator/tests/ViewAndViewNavigator_orientationTabbed orientationStatesUnDefinedActionBarOverlayRightTabbed Passed  
     [java] mobile/components/ActionBar/properties/ActionBar_ViewNavigator_Properties ActionBar_ViewNavigator_titleLayout_vertical Passed  
     [java] mobile/components/ActionBar/properties/ActionBar_ViewNavigator_Properties ActionBar_ViewNavigator_titleLayout_tile Passed  
     [java] mobile/components/ActionBar/properties/ActionBar_ViewNavigator_Properties ActionBar_ViewNavigator_titleLayout_basic Passed  
     [java] =====================================================
     [java] 	Failed: 
     [java] =====================================================
     [java] 
     [java] 
     [java] =====================================================
     [java]     Passes: 6
     [java]     Fails: 0
     [java] =====================================================
     [java] 
     [java] 
     [java] Wrote summary to results.txt
     [java] Wrote failures to failures.txt

call_runners:

run:

BUILD SUCCESSFUL
Total time: 1 minute 18 seconds



============ JENKINS MUSTELLA RUN REPORT ============

Date/Time: 05-12-2014 13:45

Run duration: 0 days 1 hours 41 mins 24 seconds

Settings:
player.version = 13.0
air.version = 13
FLASHPLAYER_DEBUGGER = C:\ApacheFlex\dependencies\FlashPlayer_Debug\flashplayer13_debugsa_win_32.exe
AIR_HOME = C:\ApacheFlex\dependencies\AdobeAIRSDK\13_beta

Build: 
  type = mobile
  command = -mobile
  set = tests/mobile

Log:
- Made Cygwin ignore carriage returns
- Set FLASH_VERSION to '13.0' and AIR_VERSION to '13'
- Set AIR_HOME to 'C:\ApacheFlex\dependencies\AdobeAIRSDK\13_beta'
- Set FLASHPLAYER_DEBUGGER to 'C:\ApacheFlex\dependencies\FlashPlayer_Debug\flashplayer13_debugsa_win_32.exe'
- Cleaned up 'local.properties' files from previous runs
- Created fresh 'local.properties' files with containing run specific values
- Ran 'clean', 'main' and 'other.locales' ant targets to prepare the SDK for testing
- Ran Mustella on the SDK with these parameters: '-mobile tests/mobile'
- Some tests failed: running '-failures'
- All tests passed after running '-failures'


=====================================================



Email was triggered for: Fixed
Trigger Success was overridden by another trigger and will not send an email.
Sending email for trigger: Fixed


(sent from ext-email)

flex-sdk_mustella-mobile - Build # 718 - Still Failing!

Posted by fl...@gmail.com.
flex-sdk_mustella-mobile - Build # 718 - Still Failing:

http://flex-mustella.cloudapp.net/job/flex-sdk_mustella-mobile/718/

Changes for Build #715

Changes for Build #716

Changes for Build #717

Changes for Build #718


--------------------------------

Started by timer
Started by timer
Started by timer
Started by timer
Started by timer
Started by timer
Started by timer
Started by timer
Started by timer
Started by timer
Started by timer
[EnvInject] - Loading node environment variables.
Building remotely on WindowsSlave in workspace c:\jenkins_slave\workspace\flex-sdk_mustella-mobile
 > C:\Program Files (x86)\Git\bin\git.exe rev-parse --is-inside-work-tree
Fetching changes from the remote Git repository
 > C:\Program Files (x86)\Git\bin\git.exe config remote.origin.url https://git-wip-us.apache.org/repos/asf/flex-sdk.git
Fetching upstream changes from https://git-wip-us.apache.org/repos/asf/flex-sdk.git
 > C:\Program Files (x86)\Git\bin\git.exe --version
 > C:\Program Files (x86)\Git\bin\git.exe fetch --tags --progress https://git-wip-us.apache.org/repos/asf/flex-sdk.git +refs/heads/*:refs/remotes/origin/*
 > C:\Program Files (x86)\Git\bin\git.exe rev-parse "origin/develop^{commit}"
Checking out Revision 6fc0cfaa4c477ac16f32418f4e611b9ba6a8348a (origin/develop)
 > C:\Program Files (x86)\Git\bin\git.exe config core.sparsecheckout
 > C:\Program Files (x86)\Git\bin\git.exe checkout -f 6fc0cfaa4c477ac16f32418f4e611b9ba6a8348a
java.io.IOException: Could not checkout 6fc0cfaa4c477ac16f32418f4e611b9ba6a8348a
	at hudson.plugins.git.GitSCM.checkout(GitSCM.java:899)
	at hudson.model.AbstractProject.checkout(AbstractProject.java:1251)
	at hudson.model.AbstractBuild$AbstractBuildExecution.defaultCheckout(AbstractBuild.java:604)
	at jenkins.scm.SCMCheckoutStrategy.checkout(SCMCheckoutStrategy.java:86)
	at hudson.model.AbstractBuild$AbstractBuildExecution.run(AbstractBuild.java:513)
	at hudson.model.Run.execute(Run.java:1704)
	at hudson.model.FreeStyleBuild.run(FreeStyleBuild.java:43)
	at hudson.model.ResourceController.execute(ResourceController.java:88)
	at hudson.model.Executor.run(Executor.java:231)
Caused by: hudson.plugins.git.GitLockFailedException: Could not lock repository. Please try again
	at org.jenkinsci.plugins.gitclient.CliGitAPIImpl$8.execute(CliGitAPIImpl.java:1477)
	at org.jenkinsci.plugins.gitclient.RemoteGitImpl$CommandInvocationHandler$1.call(RemoteGitImpl.java:153)
	at org.jenkinsci.plugins.gitclient.RemoteGitImpl$CommandInvocationHandler$1.call(RemoteGitImpl.java:146)
	at hudson.remoting.UserRequest.perform(UserRequest.java:118)
	at hudson.remoting.UserRequest.perform(UserRequest.java:48)
	at hudson.remoting.Request$2.run(Request.java:328)
	at hudson.remoting.InterceptingExecutorService$1.call(InterceptingExecutorService.java:72)
	at java.util.concurrent.FutureTask$Sync.innerRun(FutureTask.java:303)
	at java.util.concurrent.FutureTask.run(FutureTask.java:138)
	at java.util.concurrent.ThreadPoolExecutor$Worker.runTask(ThreadPoolExecutor.java:885)
	at java.util.concurrent.ThreadPoolExecutor$Worker.run(ThreadPoolExecutor.java:907)
	at hudson.remoting.Engine$1$1.run(Engine.java:63)
	at java.lang.Thread.run(Thread.java:619)
Caused by: hudson.plugins.git.GitException: Command "C:\Program Files (x86)\Git\bin\git.exe checkout -f 6fc0cfaa4c477ac16f32418f4e611b9ba6a8348a" returned status code 128:
stdout: 
stderr: fatal: Unable to create 'c:/jenkins_slave/workspace/flex-sdk_mustella-mobile/.git/index.lock': File exists.

If no other git process is currently running, this probably means a
git process crashed in this repository earlier. Make sure no other git
process is running and remove the file manually to continue.

	at org.jenkinsci.plugins.gitclient.CliGitAPIImpl.launchCommandIn(CliGitAPIImpl.java:1307)
	at org.jenkinsci.plugins.gitclient.CliGitAPIImpl.launchCommandIn(CliGitAPIImpl.java:1283)
	at org.jenkinsci.plugins.gitclient.CliGitAPIImpl.launchCommandIn(CliGitAPIImpl.java:1279)
	at org.jenkinsci.plugins.gitclient.CliGitAPIImpl.launchCommand(CliGitAPIImpl.java:1084)
	at org.jenkinsci.plugins.gitclient.CliGitAPIImpl.launchCommand(CliGitAPIImpl.java:1094)
	at org.jenkinsci.plugins.gitclient.CliGitAPIImpl$8.execute(CliGitAPIImpl.java:1474)
	... 12 more
Email was triggered for: Failure
Sending email for trigger: Failure


(sent from ext-email)

flex-sdk_mustella-mobile - Build # 717 - Still Failing!

Posted by fl...@gmail.com.
flex-sdk_mustella-mobile - Build # 717 - Still Failing:

http://flex-mustella.cloudapp.net/job/flex-sdk_mustella-mobile/717/

Changes for Build #715

Changes for Build #716

Changes for Build #717


--------------------------------

Started by timer
[EnvInject] - Loading node environment variables.
Building remotely on WindowsSlave in workspace c:\jenkins_slave\workspace\flex-sdk_mustella-mobile
 > C:\Program Files (x86)\Git\bin\git.exe rev-parse --is-inside-work-tree
Fetching changes from the remote Git repository
 > C:\Program Files (x86)\Git\bin\git.exe config remote.origin.url https://git-wip-us.apache.org/repos/asf/flex-sdk.git
Fetching upstream changes from https://git-wip-us.apache.org/repos/asf/flex-sdk.git
 > C:\Program Files (x86)\Git\bin\git.exe --version
 > C:\Program Files (x86)\Git\bin\git.exe fetch --tags --progress https://git-wip-us.apache.org/repos/asf/flex-sdk.git +refs/heads/*:refs/remotes/origin/*
 > C:\Program Files (x86)\Git\bin\git.exe rev-parse "origin/develop^{commit}"
Checking out Revision 6fc0cfaa4c477ac16f32418f4e611b9ba6a8348a (origin/develop)
 > C:\Program Files (x86)\Git\bin\git.exe config core.sparsecheckout
 > C:\Program Files (x86)\Git\bin\git.exe checkout -f 6fc0cfaa4c477ac16f32418f4e611b9ba6a8348a
java.io.IOException: Could not checkout 6fc0cfaa4c477ac16f32418f4e611b9ba6a8348a
	at hudson.plugins.git.GitSCM.checkout(GitSCM.java:899)
	at hudson.model.AbstractProject.checkout(AbstractProject.java:1251)
	at hudson.model.AbstractBuild$AbstractBuildExecution.defaultCheckout(AbstractBuild.java:604)
	at jenkins.scm.SCMCheckoutStrategy.checkout(SCMCheckoutStrategy.java:86)
	at hudson.model.AbstractBuild$AbstractBuildExecution.run(AbstractBuild.java:513)
	at hudson.model.Run.execute(Run.java:1704)
	at hudson.model.FreeStyleBuild.run(FreeStyleBuild.java:43)
	at hudson.model.ResourceController.execute(ResourceController.java:88)
	at hudson.model.Executor.run(Executor.java:231)
Caused by: hudson.plugins.git.GitLockFailedException: Could not lock repository. Please try again
	at org.jenkinsci.plugins.gitclient.CliGitAPIImpl$8.execute(CliGitAPIImpl.java:1477)
	at org.jenkinsci.plugins.gitclient.RemoteGitImpl$CommandInvocationHandler$1.call(RemoteGitImpl.java:153)
	at org.jenkinsci.plugins.gitclient.RemoteGitImpl$CommandInvocationHandler$1.call(RemoteGitImpl.java:146)
	at hudson.remoting.UserRequest.perform(UserRequest.java:118)
	at hudson.remoting.UserRequest.perform(UserRequest.java:48)
	at hudson.remoting.Request$2.run(Request.java:328)
	at hudson.remoting.InterceptingExecutorService$1.call(InterceptingExecutorService.java:72)
	at java.util.concurrent.FutureTask$Sync.innerRun(FutureTask.java:303)
	at java.util.concurrent.FutureTask.run(FutureTask.java:138)
	at java.util.concurrent.ThreadPoolExecutor$Worker.runTask(ThreadPoolExecutor.java:885)
	at java.util.concurrent.ThreadPoolExecutor$Worker.run(ThreadPoolExecutor.java:907)
	at hudson.remoting.Engine$1$1.run(Engine.java:63)
	at java.lang.Thread.run(Thread.java:619)
Caused by: hudson.plugins.git.GitException: Command "C:\Program Files (x86)\Git\bin\git.exe checkout -f 6fc0cfaa4c477ac16f32418f4e611b9ba6a8348a" returned status code 128:
stdout: 
stderr: fatal: Unable to create 'c:/jenkins_slave/workspace/flex-sdk_mustella-mobile/.git/index.lock': File exists.

If no other git process is currently running, this probably means a
git process crashed in this repository earlier. Make sure no other git
process is running and remove the file manually to continue.

	at org.jenkinsci.plugins.gitclient.CliGitAPIImpl.launchCommandIn(CliGitAPIImpl.java:1307)
	at org.jenkinsci.plugins.gitclient.CliGitAPIImpl.launchCommandIn(CliGitAPIImpl.java:1283)
	at org.jenkinsci.plugins.gitclient.CliGitAPIImpl.launchCommandIn(CliGitAPIImpl.java:1279)
	at org.jenkinsci.plugins.gitclient.CliGitAPIImpl.launchCommand(CliGitAPIImpl.java:1084)
	at org.jenkinsci.plugins.gitclient.CliGitAPIImpl.launchCommand(CliGitAPIImpl.java:1094)
	at org.jenkinsci.plugins.gitclient.CliGitAPIImpl$8.execute(CliGitAPIImpl.java:1474)
	... 12 more
Email was triggered for: Failure
Sending email for trigger: Failure


(sent from ext-email)