You are viewing a plain text version of this content. The canonical link for it is here.
Posted to builds@beam.apache.org by Apache Jenkins Server <je...@builds.apache.org> on 2022/09/06 09:02:43 UTC

Build failed in Jenkins: beam_PostCommit_XVR_Spark3 #2101

See <https://ci-beam.apache.org/job/beam_PostCommit_XVR_Spark3/2101/display/redirect>

Changes:


------------------------------------------
[...truncated 610.01 KB...]
        urn: "beam:coders:javasdk:0.1"
        payload: "\202SNAPPY\000\000\000\000\001\000\000\000\001\000\000\001?\315\003\270\254\355\000\005sr\000Aorg.apache.beam.sdk.values.TimestampedV\001\022\000$>\021\000LCoder\364\376\202p\274iX-\002\000\001L\000\nv\001)\005\030\034t\000\"Lorg/\t]\000/\001],/sdk/coders/\005$\020;xr\000*N\202\000\t%(.Structured\005/8s\277\022\016\325\3246\021\002\000\000xr\000 j9\000\005/\034C\335\325\211\256\274~\370\001/\020psr\000,j1\000(Serializabl\t\277\034\010\364 \216\305ynl\005\327\\\004typet\000\021Ljava/lang/Class\001\300\000&jV\000\024Custom\005\215Pj\260\010\235\013;\035\013\002\000\000xq\000~\000\003vr\000;N;\000Pio.BoundedReadFromUnb\t\021`Source$Shardd\236\240U\205\000j\363\002\000\000xp"
      >
    >
  >
  coders: <
    key: "WYPyXcfQwlValueWithRecordIdCoder"
    value: <
      spec: <
        urn: "beam:coders:javasdk:0.1"
        payload: "\202SNAPPY\000\000\000\000\001\000\000\000\001\000\000\001\213\311\005\320\254\355\000\005sr\000Corg.apache.beam.sdk.values.ValueWithRecordId$B\022\000LCoder{\343\376bQ\014\204>\002\000\002L\000\007i\t\025\034t\000+Lorg/\t\\\000/\001\\\024/sdk/c\0012(s/ByteArray\005B\014;L\000\n\005u\005\016\010t\000\"n;\000\005$\020;xr\000*N\274\000\t`(.Structured\005/8s\277\022\016\325\3246\021\002\000\000xr\000 j9\000\005/\034C\335\325\211\256\274~\370\001/\020psr\000)j1\0006\312\000\034\351\277\005|\263\3746\333\001:\010r\000&j8\000\024Atomic\005o\034\307\354\265\314\205tPF\0015 q\000~\000\003sr\000-N;\000$io.kafka.K\001\006\000R%\227\005B<I\320\251Y\032\341{#\002\000\001L\000\007kv\005\025\010t\000$nH\001\000K\t&\000;\025s\000\"Ns\000-P\r- j\000\275\271\035\243\3126\002!\353\010\010ke)\277\001\264\000\0022\303\001\005\022\025Y\000(jY\000\030Nullabl)\372\034E\333\0336>\220\247\007\005\307]\022.O\000\001\014,\006sq\000~\000\016q\000~\000\020"
      >
    >
  >
  coders: <
    key: "WYPyXcfQwlVarIntCoder"
    value: <
      spec: <
        urn: "beam:coders:javasdk:0.1"
        payload: "\202SNAPPY\000\000\000\000\001\000\000\000\001\000\000\000\210\330\001\350\254\355\000\005sr\000&org.apache.beam.sdk.coders.VarIntCoder\300K2\332\251KVh\002\000\000xrr5\000\024Atomic\0055 \307\354\265\314\205tPF\002\0055\000*jj\000$Structured\0059\034s\277\022\016\325\3246\021\t9\000 j9\000\005/0C\335\325\211\256\274~\370\002\000\000xp"
      >
    >
  >
  coders: <
    key: "WYPyXcfQwlVoidCoder"
    value: <
      spec: <
        urn: "beam:coders:javasdk:0.1"
        payload: "\202SNAPPY\000\000\000\000\001\000\000\000\001\000\000\000\210\326\001\350\254\355\000\005sr\000$org.apache.beam.sdk.coders.VoidCoder\271\277U\233\350\r\257U\002\000\000xr\000&j3\000\024Atomic\0055 \307\354\265\314\205tPF\002\0055\000*j5\000$Structured\0059\034s\277\022\016\325\3246\021\t9\000 j9\000\005/0C\335\325\211\256\274~\370\002\000\000xp"
      >
    >
  >
  coders: <
    key: "c0"
    value: <
      spec: <
        urn: "beam:coder:bytes:v1"
      >
    >
  >
  coders: <
    key: "c1"
    value: <
      spec: <
        urn: "beam:coder:global_window:v1"
      >
    >
  >
  coders: <
    key: "c2"
    value: <
      spec: <
        urn: "beam:go:coder:custom:v1"
        payload: "Cgd2YXJpbnR6EgIIAhpdCklnaXRodWIuY29tL2FwYWNoZS9iZWFtL3Nka3MvdjIvZ28vcGtnL2JlYW0vY29yZS9ydW50aW1lL2NvZGVyeC5lbmNWYXJJbnRaEhAIFiIECBlADyoGCBQSAggIImkKSWdpdGh1Yi5jb20vYXBhY2hlL2JlYW0vc2Rrcy92Mi9nby9wa2cvYmVhbS9jb3JlL3J1bnRpbWUvY29kZXJ4LmRlY1ZhckludFoSHAgWIgQIGUADIgYIFBICCAgqBAgZQA8qBAgZQAE="
      >
    >
  >
  coders: <
    key: "c3"
    value: <
      spec: <
        urn: "beam:coder:length_prefix:v1"
      >
      component_coder_ids: "c2"
    >
  >
  coders: <
    key: "c4"
    value: <
      spec: <
        urn: "beam:coder:kv:v1"
      >
      component_coder_ids: "c0"
      component_coder_ids: "c0"
    >
  >
  environments: <
    key: "WYPyXcfQwlbeam:env:docker:v1"
    value: <
      urn: "beam:env:docker:v1"
      payload: "\n apache/beam_java8_sdk:2.42.0.dev"
      capabilities: "beam:coder:bytes:v1"
      capabilities: "beam:coder:bool:v1"
      capabilities: "beam:coder:varint:v1"
      capabilities: "beam:coder:string_utf8:v1"
      capabilities: "beam:coder:iterable:v1"
      capabilities: "beam:coder:timer:v1"
      capabilities: "beam:coder:kv:v1"
      capabilities: "beam:coder:length_prefix:v1"
      capabilities: "beam:coder:global_window:v1"
      capabilities: "beam:coder:interval_window:v1"
      capabilities: "beam:coder:custom_window:v1"
      capabilities: "beam:coder:windowed_value:v1"
      capabilities: "beam:coder:double:v1"
      capabilities: "beam:coder:row:v1"
      capabilities: "beam:coder:param_windowed_value:v1"
      capabilities: "beam:coder:state_backed_iterable:v1"
      capabilities: "beam:coder:sharded_key:v1"
      capabilities: "beam:coder:nullable:v1"
      capabilities: "beam:protocol:multi_core_bundle_processing:v1"
      capabilities: "beam:protocol:progress_reporting:v1"
      capabilities: "beam:protocol:harness_monitoring_infos:v1"
      capabilities: "beam:protocol:control_request_elements_embedding:v1"
      capabilities: "beam:protocol:state_caching:v1"
      capabilities: "beam:version:sdk_base:apache/beam_java8_sdk:2.42.0.dev"
      capabilities: "beam:transform:sdf_truncate_sized_restrictions:v1"
      capabilities: "beam:transform:to_string:v1"
      dependencies: <
        type_urn: "beam:artifact:type:file:v1"
        type_payload: "\nL/tmp/artifacts/icedtea-sound-CGRxIE9edPHnbxQhM-L5mp8h21H-ySB79uQtSquPV_Q.jar\022@086471204f5e74f1e76f142133e2f99a9f21db51fec9207bf6e42d4aab8f57f4"
        role_urn: "beam:artifact:role:staging_to:v1"
        role_payload: "\n=icedtea-sound-CGRxIE9edPHnbxQhM-L5mp8h21H-ySB79uQtSquPV_Q.jar"
      >
      dependencies: <
        type_urn: "beam:artifact:type:file:v1"
        type_payload: "\nF/tmp/artifacts/jaccess-FBI0Bb27lF3oEBieWAi7SP8X1zBR8k4BJQOVpsoK9a0.jar\022@14123405bdbb945de810189e5808bb48ff17d73051f24e01250395a6ca0af5ad"
        role_urn: "beam:artifact:role:staging_to:v1"
        role_payload: "\n7jaccess-FBI0Bb27lF3oEBieWAi7SP8X1zBR8k4BJQOVpsoK9a0.jar"
      >
      dependencies: <
        type_urn: "beam:artifact:type:file:v1"
        type_payload: "\nI/tmp/artifacts/localedata-kJ2mc8rBH5-IklhfR1XzNotlIQ_mnVMA-pgaXv2r8Ag.jar\022@909da673cac11f9f8892585f4755f3368b65210fe69d5300fa981a5efdabf008"
        role_urn: "beam:artifact:role:staging_to:v1"
        role_payload: "\n:localedata-kJ2mc8rBH5-IklhfR1XzNotlIQ_mnVMA-pgaXv2r8Ag.jar"
      >
      dependencies: <
        type_urn: "beam:artifact:type:file:v1"
        type_payload: "\nF/tmp/artifacts/nashorn-B0CAb3QpJET_6VsT3hcC_89VtvhV616H8N2bHAIaqWo.jar\022@0740806f74292444ffe95b13de1702ffcf55b6f855eb5e87f0dd9b1c021aa96a"
        role_urn: "beam:artifact:role:staging_to:v1"
        role_payload: "\n7nashorn-B0CAb3QpJET_6VsT3hcC_89VtvhV616H8N2bHAIaqWo.jar"
      >
      dependencies: <
        type_urn: "beam:artifact:type:file:v1"
        type_payload: "\nG/tmp/artifacts/cldrdata-gclqV9lOGqQOKesG-a6TAUTGEYlyIDqpyd4M_k7gtWo.jar\022@81c96a57d94e1aa40e29eb06f9ae930144c6118972203aa9c9de0cfe4ee0b56a"
        role_urn: "beam:artifact:role:staging_to:v1"
        role_payload: "\n8cldrdata-gclqV9lOGqQOKesG-a6TAUTGEYlyIDqpyd4M_k7gtWo.jar"
      >
      dependencies: <
        type_urn: "beam:artifact:type:file:v1"
        type_payload: "\nD/tmp/artifacts/dnsns-byzoQxdXengTvA5IlbH9gSIzfhNQElRYltuMJN0vjcc.jar\022@6f2ce84317577a7813bc0e4895b1fd8122337e135012545896db8c24dd2f8dc7"
        role_urn: "beam:artifact:role:staging_to:v1"
        role_payload: "\n5dnsns-byzoQxdXengTvA5IlbH9gSIzfhNQElRYltuMJN0vjcc.jar"
      >
      dependencies: <
        type_urn: "beam:artifact:type:file:v1"
        type_payload: "\nr/tmp/artifacts/beam-sdks-java-io-expansion-service-2.42.0-SNAPSHOT-qq9V3cGWeROmNUd4B4V_eQQ24eZ7XoXekIpnw5hoXPY.jar\022@aaaf55ddc1967913a635477807857f790436e1e67b5e85de908a67c398685cf6"
        role_urn: "beam:artifact:role:staging_to:v1"
        role_payload: "\ncbeam-sdks-java-io-expansion-service-2.42.0-SNAPSHOT-qq9V3cGWeROmNUd4B4V_eQQ24eZ7XoXekIpnw5hoXPY.jar"
      >
    >
  >
  environments: <
    key: "go"
    value: <
      urn: "beam:env:docker:v1"
      payload: "\n\026apache/beam_go_sdk:dev"
      capabilities: "beam:protocol:progress_reporting:v1"
      capabilities: "beam:protocol:multi_core_bundle_processing:v1"
      capabilities: "beam:transform:sdf_truncate_sized_restrictions:v1"
      capabilities: "beam:protocol:worker_status:v1"
      capabilities: "beam:protocol:monitoring_info_short_ids:v1"
      capabilities: "beam:version:sdk_base:go"
      capabilities: "beam:coder:bytes:v1"
      capabilities: "beam:coder:bool:v1"
      capabilities: "beam:coder:varint:v1"
      capabilities: "beam:coder:double:v1"
      capabilities: "beam:coder:string_utf8:v1"
      capabilities: "beam:coder:length_prefix:v1"
      capabilities: "beam:coder:kv:v1"
      capabilities: "beam:coder:iterable:v1"
      capabilities: "beam:coder:state_backed_iterable:v1"
      capabilities: "beam:coder:windowed_value:v1"
      capabilities: "beam:coder:global_window:v1"
      capabilities: "beam:coder:interval_window:v1"
      capabilities: "beam:coder:row:v1"
      capabilities: "beam:coder:nullable:v1"
      dependencies: <
        type_urn: "beam:artifact:type:file:v1"
        role_urn: "beam:artifact:role:go_worker_binary:v1"
      >
    >
  >
>
root_transform_ids: "e4"
root_transform_ids: "s1"
root_transform_ids: "e5"
root_transform_ids: "s3"
requirements: "beam:requirement:pardo:splittable_dofn:v1"
2022/09/06 08:38:20 Cross-compiling <https://ci-beam.apache.org/job/beam_PostCommit_XVR_Spark3/ws/src/sdks/go/test/integration/io/xlang/kafka/kafka_test.go> as /tmp/worker-2-1662453500203125177
2022/09/06 08:38:21 Prepared job with id: go-testkafkaio_basicreadwrite-908_c9bffe9f-c02c-491f-90bd-c8115f00d309 and staging token: go-testkafkaio_basicreadwrite-908_c9bffe9f-c02c-491f-90bd-c8115f00d309
2022/09/06 08:38:21 Staged binary artifact with token: 
2022/09/06 08:38:22 Submitted job: go0testkafkaio0basicreadwrite0908-jenkins-0906083822-c14c0e2f_319c795b-debd-4dc1-8b3a-099e09ce8309
2022/09/06 08:38:22 Job state: STOPPED
2022/09/06 08:38:22 Job state: STARTING
2022/09/06 08:38:22 Job state: RUNNING
2022/09/06 08:38:44 Job state: DONE
2022/09/06 08:38:44 Warning: 6 errors during metrics processing: [failed to deduce Step from MonitoringInfo: urn:"beam:metric:element_count:v1" type:"beam:metrics:sum_int64:v1" payload:"\x01" labels:{key:"PCOLLECTION" value:"WYPyXcfQwlExternal/KafkaIO.Read/KafkaIO.Read.ReadFromKafkaViaUnbounded/Read(KafkaUnboundedSource)/Create/Read(CreateSource)/ParDo(OutputSingleSource)/ParMultiDo(OutputSingleSource).output/PairWithRestriction0"} failed to deduce Step from MonitoringInfo: urn:"beam:metric:element_count:v1" type:"beam:metrics:sum_int64:v1" payload:"\x01" labels:{key:"PCOLLECTION" value:"WYPyXcfQwlExternal/KafkaIO.Read/KafkaIO.Read.ReadFromKafkaViaUnbounded/Read(KafkaUnboundedSource)/Create/Read(CreateSource)/ParDo(OutputSingleSource)/ParMultiDo(OutputSingleSource).output/SplitAndSize0"} failed to deduce Step from MonitoringInfo: urn:"beam:metric:sampled_byte_size:v1" type:"beam:metrics:distribution_int64:v1" payload:"\x01\xf0\"\xf0\"\xf0\"" labels:{key:"PCOLLECTION" value:"WYPyXcfQwlExternal/KafkaIO.Read/KafkaIO.Read.ReadFromKafkaViaUnbounded/Read(KafkaUnboundedSource)/Create/Read(CreateSource)/ParDo(OutputSingleSource)/ParMultiDo(OutputSingleSource).output/PairWithRestriction0"} failed to deduce Step from MonitoringInfo: urn:"beam:metric:sampled_byte_size:v1" type:"beam:metrics:distribution_int64:v1" payload:"\x01\xf8\"\xf8\"\xf8\"" labels:{key:"PCOLLECTION" value:"WYPyXcfQwlExternal/KafkaIO.Read/KafkaIO.Read.ReadFromKafkaViaUnbounded/Read(KafkaUnboundedSource)/Create/Read(CreateSource)/ParDo(OutputSingleSource)/ParMultiDo(OutputSingleSource).output/SplitAndSize0"} failed to deduce Step from MonitoringInfo: urn:"beam:metric:element_count:v1" type:"beam:metrics:sum_int64:v1" payload:"\x01" labels:{key:"PCOLLECTION" value:"WYPyXcfQwlExternal/KafkaIO.Read/KafkaIO.Read.ReadFromKafkaViaUnbounded/Read(KafkaUnboundedSource)/Create/Read(CreateSource)/ParDo(OutputSingleSource)/ParMultiDo(OutputSingleSource).output/SplitAndSize0"} failed to deduce Step from MonitoringInfo: urn:"beam:metric:sampled_byte_size:v1" type:"beam:metrics:distribution_int64:v1" payload:"\x01\xfd\"\xfd\"\xfd\"" labels:{key:"PCOLLECTION" value:"WYPyXcfQwlExternal/KafkaIO.Read/KafkaIO.Read.ReadFromKafkaViaUnbounded/Read(KafkaUnboundedSource)/Create/Read(CreateSource)/ParDo(OutputSingleSource)/ParMultiDo(OutputSingleSource).output/SplitAndSize0"}]
--- PASS: TestKafkaIO_BasicReadWrite (37.48s)
PASS
ok  	github.com/apache/beam/sdks/v2/go/test/integration/io/xlang/kafka	43.506s

> Task :runners:spark:3:job-server:validatesCrossLanguageRunnerJavaUsingPython

org.apache.beam.sdk.extensions.python.transforms.RunInferenceTransformTest > testRunInferenceWithKVs FAILED
    java.lang.IllegalStateException at RunInferenceTransformTest.java:108
    java.lang.NullPointerException at Preconditions.java:980

org.apache.beam.sdk.extensions.python.transforms.RunInferenceTransformTest > testRunInference FAILED
    java.lang.IllegalStateException at RunInferenceTransformTest.java:60
    java.lang.NullPointerException at Preconditions.java:980

16 tests completed, 2 failed, 2 skipped

> Task :runners:spark:3:job-server:validatesCrossLanguageRunnerJavaUsingPython FAILED
> Task :runners:spark:3:job-server:validatesCrossLanguageRunnerPythonUsingJava
> Task :runners:spark:3:job-server:validatesCrossLanguageRunnerPythonUsingSql
> Task :runners:spark:3:job-server:validatesCrossLanguageRunnerCleanup
> Task :runners:spark:3:job-server:sparkJobServerCleanup

FAILURE: Build failed with an exception.

* What went wrong:
Execution failed for task ':runners:spark:3:job-server:validatesCrossLanguageRunnerJavaUsingPython'.
> There were failing tests. See the report at: file://<https://ci-beam.apache.org/job/beam_PostCommit_XVR_Spark3/ws/src/runners/spark/3/job-server/build/reports/tests/validatesCrossLanguageRunnerJavaUsingPython/index.html>

* Try:
> Run with --stacktrace option to get the stack trace.
> Run with --info or --debug option to get more log output.
> Run with --scan to get full insights.

* Get more help at https://help.gradle.org

Deprecated Gradle features were used in this build, making it incompatible with Gradle 8.0.

You can use '--warning-mode all' to show the individual deprecation warnings and determine if they come from your own scripts or plugins.

See https://docs.gradle.org/7.4/userguide/command_line_interface.html#sec:command_line_warnings

Execution optimizations have been disabled for 1 invalid unit(s) of work during this build to ensure correctness.
Please consult deprecation warnings for more details.

BUILD FAILED in 36m 28s
263 actionable tasks: 173 executed, 78 from cache, 12 up-to-date

Publishing build scan...
https://gradle.com/s/xnjafaivmmmdk

Build step 'Invoke Gradle script' changed build result to FAILURE
Build step 'Invoke Gradle script' marked build as failure

---------------------------------------------------------------------
To unsubscribe, e-mail: builds-unsubscribe@beam.apache.org
For additional commands, e-mail: builds-help@beam.apache.org


Jenkins build is back to normal : beam_PostCommit_XVR_Spark3 #2106

Posted by Apache Jenkins Server <je...@builds.apache.org>.
See <https://ci-beam.apache.org/job/beam_PostCommit_XVR_Spark3/2106/display/redirect?page=changes>


---------------------------------------------------------------------
To unsubscribe, e-mail: builds-unsubscribe@beam.apache.org
For additional commands, e-mail: builds-help@beam.apache.org


Build failed in Jenkins: beam_PostCommit_XVR_Spark3 #2105

Posted by Apache Jenkins Server <je...@builds.apache.org>.
See <https://ci-beam.apache.org/job/beam_PostCommit_XVR_Spark3/2105/display/redirect?page=changes>

Changes:

[Kenneth Knowles] Cosmetic checkstyle fix to TextRowCountEstimator

[Kenneth Knowles] Upgrade to Gradle 7.5.1

[chamikaramj] Fixes RunInference test failure


------------------------------------------
[...truncated 445.03 KB...]
        payload: "\202SNAPPY\000\000\000\000\001\000\000\000\001\000\000\006]\313\026\270\254\355\000\005sr\000Aorg.apache.beam.sdk.values.TimestampedV\001\022\000$>\021\000HCoder\364\376\202p\274iX-\002\000\001L\000\n\005;\005\030\034t\000\"Lorg/\t]\000/\001]\024/sdk/c\0015\004s/\005$\020;xr\000*N\202\000\t%(.Structured\005/8s\277\022\016\325\3246\021\002\000\000xr\000 j9\000\005/\034C\335\325\211\256\274~\370\001/\020psr\000#j1\000\010Row\0054\034\254\236\213\244M\203\363\250\0014\010r\000'N2\000 schemas.S\005\010\0056|\023\226L\354\244P\260l\002\000\004L\000\017fromRowFunctiont\0005R\t\001Xtransforms/Serializable\0217\014;L\000\006\tk\010t\000$RA\000\t\036\004s/\t\211\024;L\000\rto\035x`q\000~\000\007L\000\016typeDescriptort\000+RM\000%\271\010s/T2-\000!\240\000&N\004\001-\240\024Custom%\003\034j\260\010\235\013;\035\013!9\001z\020\003sr\000=N;\000\031\367\000.N\367\000Ds$Identity\033n\367C9'S\320\001R!\277\000\"NN\000-\004-\215d7\242\227\362z%\204e\002\000\007Z\000\033encodingPosi!\211DsOverriddenI\000\010hash\001\272\010L\000\021B)\000\220t\000\017Ljava/util/Map;L\000\014fieldIndicest\000HL>\335\002 vendor/gu\0019Lv26_0_jre/com/google\001\0134mon/collect/Bi\tZ\000\006\005Z\014st\000\020\035u$List;L\000\007op\005\273\010t\000,R\267\001-\000M\004\004$O\t.\034;L\000\004uuid6S\000<UUID;xp\000N\235T\255sr\000\021\001\342\000.\001\342\360I.HashMap\005\007\332\301\303\026`\321\003\000\002F\000\nloadFactorI\000\tthresholdxp?@\000\000\000\000\000\014w\010\000\000\000\020\000\000\000\001t\000\007role_id\025Wdlang.Integer\022\342\240\244\367\201\2078\002\000\001I\000\005Ei\014xr\000\020\005\177\005(4Number\206\254\225\035\013\224\340\213%\360\001b\020xsr\000J>\365\001)f\000.%f\000.5f\020.com.)f\001\013\014mon.-f\000.\001\334%j\001S\001\001(\003\000\000xpw\004\000\000\000\001A\251\000\027\001\005\000\032\001l\000\023\005\222%\021\020Array!\203 x\201\322\035\231\307a\235\003\001\274\024\004sizex\001I\000\001\t@\014sr\0002>\241\000\241A-\226\024.AutoV\241;\000_i\244\004_FAD\034\303\343i\345\363l$\364\205.\004\013dm\233\205*\000\022I\002!\026\030/String!\313\014name\001\246\010 L\000Q\020\001\017\014\022L\000\004a\335\010t\000.\216\034\002\005|a\340a\326\000(n\267\000\t\255\t1\034\263\021\225\3324!\217\246%\226\010t\000\000\001y\004\027sZ\267\005\021\370\rA\000OI\216\034\367\031\n\2336X\271\227\305\".\301\000\014\017xps\001P\004\025?IS\004\000wQS%\374\0006n\244\000V[\001\001\33749\304m\364S\243\227P\002\000\010L\000\025M\007$ionElement\001#\001u(!L\000\013logical\001\023\010t\0000\216E\001\000L\0312$;L\000\nmapKey\001@\rS\014\014map%\362\035\024 \010metadata\001$\034\017L\000\010null\241\353\010t\000\023=\3604Boolean;L\000\trow)C\0012\014\010L\000\010!\347\030Namet\000-\216\246\000\001}\001/!\352\000,nF\001\tf)\352\0015\034\013PLl[\357\3103%\356\001\001\014sr\000\036y\027\000C\211\272Lions$EmptyMapY6\024\205Z\334\347\265\247\211WA\302\000.\r\3224\315 r\200\325\234\372\356\002\000\001Z\000\005\211\000\030p\000p~r\000+\212\234\000\001\227\001\314a\273\001\001\000\022\345\375\000\016\005\225\005f\014Enum\001\031\001\001\001\035$pt\000\005INT64xE]\000%\005\006Zc\002\tGe\363\241\036x\274\231\003\367\230m\205/\002\000\002J\000\014leastSigBitsJ\000\013mo\025\016Dxp\2259\300\003\001xY\"\341l\300\000\010CL\327\005e\014\014sr\000Ro\001\005\364\004s.\001\313\371\212(s$9z\2164\213\005/\271\347!o\010r\000)N\016\001R;\000\034x\237G[\330\210\240{eR \005tokent\000LB\032\002\251,\212\222\006\010ref\305\222\001\241\000T\001N\000;\345r\000Z>\221\000\tQ\212}\005\rQ\005\362\005Q\024$Simple\026\005\020!\255\001\001\t\372\346\346\005Bi\000\0342{#\261\276\3768|%\033\030\013runtim\005w\010t\000\030}m\r8\005\362\030;xpvr\000\036>\355\000\241\311-~(Row\032Q\006\2060\230\247\034\005X4\006schemaq\000~\000\010xp"
      >
    >
  >
  coders: <
    key: "GmyrOWVqWvVarIntCoder"
    value: <
      spec: <
        urn: "beam:coders:javasdk:0.1"
        payload: "\202SNAPPY\000\000\000\000\001\000\000\000\001\000\000\000\210\330\001\350\254\355\000\005sr\000&org.apache.beam.sdk.coders.VarIntCoder\300K2\332\251KVh\002\000\000xrr5\000\024Atomic\0055 \307\354\265\314\205tPF\002\0055\000*jj\000$Structured\0059\034s\277\022\016\325\3246\021\t9\000 j9\000\005/0C\335\325\211\256\274~\370\002\000\000xp"
      >
    >
  >
  coders: <
    key: "GmyrOWVqWvVoidCoder"
    value: <
      spec: <
        urn: "beam:coders:javasdk:0.1"
        payload: "\202SNAPPY\000\000\000\000\001\000\000\000\001\000\000\000\210\326\001\350\254\355\000\005sr\000$org.apache.beam.sdk.coders.VoidCoder\271\277U\233\350\r\257U\002\000\000xr\000&j3\000\024Atomic\0055 \307\354\265\314\205tPF\002\0055\000*j5\000$Structured\0059\034s\277\022\016\325\3246\021\t9\000 j9\000\005/0C\335\325\211\256\274~\370\002\000\000xp"
      >
    >
  >
  coders: <
    key: "c0"
    value: <
      spec: <
        urn: "beam:coder:bytes:v1"
      >
    >
  >
  coders: <
    key: "c1"
    value: <
      spec: <
        urn: "beam:coder:global_window:v1"
      >
    >
  >
  coders: <
    key: "c2"
    value: <
      spec: <
        urn: "beam:coder:row:v1"
        payload: "\n\r\n\007role_id\032\002\020\003\022$abc5e222-ab8f-4f6f-800a-a58bb0f45675"
      >
    >
  >
  environments: <
    key: "GmyrOWVqWvbeam:env:docker:v1"
    value: <
      urn: "beam:env:docker:v1"
      payload: "\n apache/beam_java8_sdk:2.42.0.dev"
      capabilities: "beam:coder:bytes:v1"
      capabilities: "beam:coder:bool:v1"
      capabilities: "beam:coder:varint:v1"
      capabilities: "beam:coder:string_utf8:v1"
      capabilities: "beam:coder:iterable:v1"
      capabilities: "beam:coder:timer:v1"
      capabilities: "beam:coder:kv:v1"
      capabilities: "beam:coder:length_prefix:v1"
      capabilities: "beam:coder:global_window:v1"
      capabilities: "beam:coder:interval_window:v1"
      capabilities: "beam:coder:custom_window:v1"
      capabilities: "beam:coder:windowed_value:v1"
      capabilities: "beam:coder:double:v1"
      capabilities: "beam:coder:row:v1"
      capabilities: "beam:coder:param_windowed_value:v1"
      capabilities: "beam:coder:state_backed_iterable:v1"
      capabilities: "beam:coder:sharded_key:v1"
      capabilities: "beam:coder:nullable:v1"
      capabilities: "beam:protocol:multi_core_bundle_processing:v1"
      capabilities: "beam:protocol:progress_reporting:v1"
      capabilities: "beam:protocol:harness_monitoring_infos:v1"
      capabilities: "beam:protocol:control_request_elements_embedding:v1"
      capabilities: "beam:protocol:state_caching:v1"
      capabilities: "beam:version:sdk_base:apache/beam_java8_sdk:2.42.0.dev"
      capabilities: "beam:transform:sdf_truncate_sized_restrictions:v1"
      capabilities: "beam:transform:to_string:v1"
      dependencies: <
        type_urn: "beam:artifact:type:file:v1"
        type_payload: "\nL/tmp/artifacts/icedtea-sound-CGRxIE9edPHnbxQhM-L5mp8h21H-ySB79uQtSquPV_Q.jar\022@086471204f5e74f1e76f142133e2f99a9f21db51fec9207bf6e42d4aab8f57f4"
        role_urn: "beam:artifact:role:staging_to:v1"
        role_payload: "\n=icedtea-sound-CGRxIE9edPHnbxQhM-L5mp8h21H-ySB79uQtSquPV_Q.jar"
      >
      dependencies: <
        type_urn: "beam:artifact:type:file:v1"
        type_payload: "\nF/tmp/artifacts/jaccess-FBI0Bb27lF3oEBieWAi7SP8X1zBR8k4BJQOVpsoK9a0.jar\022@14123405bdbb945de810189e5808bb48ff17d73051f24e01250395a6ca0af5ad"
        role_urn: "beam:artifact:role:staging_to:v1"
        role_payload: "\n7jaccess-FBI0Bb27lF3oEBieWAi7SP8X1zBR8k4BJQOVpsoK9a0.jar"
      >
      dependencies: <
        type_urn: "beam:artifact:type:file:v1"
        type_payload: "\nI/tmp/artifacts/localedata-kJ2mc8rBH5-IklhfR1XzNotlIQ_mnVMA-pgaXv2r8Ag.jar\022@909da673cac11f9f8892585f4755f3368b65210fe69d5300fa981a5efdabf008"
        role_urn: "beam:artifact:role:staging_to:v1"
        role_payload: "\n:localedata-kJ2mc8rBH5-IklhfR1XzNotlIQ_mnVMA-pgaXv2r8Ag.jar"
      >
      dependencies: <
        type_urn: "beam:artifact:type:file:v1"
        type_payload: "\nF/tmp/artifacts/nashorn-B0CAb3QpJET_6VsT3hcC_89VtvhV616H8N2bHAIaqWo.jar\022@0740806f74292444ffe95b13de1702ffcf55b6f855eb5e87f0dd9b1c021aa96a"
        role_urn: "beam:artifact:role:staging_to:v1"
        role_payload: "\n7nashorn-B0CAb3QpJET_6VsT3hcC_89VtvhV616H8N2bHAIaqWo.jar"
      >
      dependencies: <
        type_urn: "beam:artifact:type:file:v1"
        type_payload: "\nG/tmp/artifacts/cldrdata-gclqV9lOGqQOKesG-a6TAUTGEYlyIDqpyd4M_k7gtWo.jar\022@81c96a57d94e1aa40e29eb06f9ae930144c6118972203aa9c9de0cfe4ee0b56a"
        role_urn: "beam:artifact:role:staging_to:v1"
        role_payload: "\n8cldrdata-gclqV9lOGqQOKesG-a6TAUTGEYlyIDqpyd4M_k7gtWo.jar"
      >
      dependencies: <
        type_urn: "beam:artifact:type:file:v1"
        type_payload: "\nD/tmp/artifacts/dnsns-byzoQxdXengTvA5IlbH9gSIzfhNQElRYltuMJN0vjcc.jar\022@6f2ce84317577a7813bc0e4895b1fd8122337e135012545896db8c24dd2f8dc7"
        role_urn: "beam:artifact:role:staging_to:v1"
        role_payload: "\n5dnsns-byzoQxdXengTvA5IlbH9gSIzfhNQElRYltuMJN0vjcc.jar"
      >
      dependencies: <
        type_urn: "beam:artifact:type:file:v1"
        type_payload: "\n\203\001/tmp/artifacts/beam-sdks-java-extensions-schemaio-expansion-service-2.42.0-SNAPSHOT-6wxh-IlguJ_nLvvu6aLYm4k8xaS2REjfC0gXPKjAZmE.jar\022@eb0c61f88960b89fe72efbeee9a2d89b893cc5a4b64448df0b48173ca8c06661"
        role_urn: "beam:artifact:role:staging_to:v1"
        role_payload: "\ntbeam-sdks-java-extensions-schemaio-expansion-service-2.42.0-SNAPSHOT-6wxh-IlguJ_nLvvu6aLYm4k8xaS2REjfC0gXPKjAZmE.jar"
      >
    >
  >
  environments: <
    key: "go"
    value: <
      urn: "beam:env:docker:v1"
      payload: "\n\026apache/beam_go_sdk:dev"
      capabilities: "beam:protocol:progress_reporting:v1"
      capabilities: "beam:protocol:multi_core_bundle_processing:v1"
      capabilities: "beam:transform:sdf_truncate_sized_restrictions:v1"
      capabilities: "beam:protocol:worker_status:v1"
      capabilities: "beam:protocol:monitoring_info_short_ids:v1"
      capabilities: "beam:version:sdk_base:go"
      capabilities: "beam:coder:bytes:v1"
      capabilities: "beam:coder:bool:v1"
      capabilities: "beam:coder:varint:v1"
      capabilities: "beam:coder:double:v1"
      capabilities: "beam:coder:string_utf8:v1"
      capabilities: "beam:coder:length_prefix:v1"
      capabilities: "beam:coder:kv:v1"
      capabilities: "beam:coder:iterable:v1"
      capabilities: "beam:coder:state_backed_iterable:v1"
      capabilities: "beam:coder:windowed_value:v1"
      capabilities: "beam:coder:global_window:v1"
      capabilities: "beam:coder:interval_window:v1"
      capabilities: "beam:coder:row:v1"
      capabilities: "beam:coder:nullable:v1"
      dependencies: <
        type_urn: "beam:artifact:type:file:v1"
        role_urn: "beam:artifact:role:go_worker_binary:v1"
      >
    >
  >
>
root_transform_ids: "s1"
root_transform_ids: "e2"
root_transform_ids: "e3"
root_transform_ids: "s3"
requirements: "beam:requirement:pardo:splittable_dofn:v1"
2022/09/07 08:46:06 Cross-compiling <https://ci-beam.apache.org/job/beam_PostCommit_XVR_Spark3/ws/src/sdks/go/test/integration/io/xlang/jdbc/jdbc_test.go> as /tmp/worker-4-1662540366865158007
2022/09/07 08:46:13 Prepared job with id: go-testjdbcio_postgresreadwrite-915_5c05db27-8614-428c-9cb9-c4cb62ebbd06 and staging token: go-testjdbcio_postgresreadwrite-915_5c05db27-8614-428c-9cb9-c4cb62ebbd06
2022/09/07 08:46:13 Staged binary artifact with token: 
2022/09/07 08:46:13 Submitted job: go0testjdbcio0postgresreadwrite0915-jenkins-0907084613-85214bc3_e4af8151-7e43-4aa7-a71c-0b64d631e3ce
2022/09/07 08:46:13 Job state: STOPPED
2022/09/07 08:46:13 Job state: STARTING
2022/09/07 08:46:13 Job state: RUNNING
2022/09/07 08:47:19 Job state: DONE
2022/09/07 08:47:19 Warning: 6 errors during metrics processing: [failed to deduce Step from MonitoringInfo: urn:"beam:metric:element_count:v1" type:"beam:metrics:sum_int64:v1" payload:"\x01" labels:{key:"PCOLLECTION" value:"GmyrOWVqWvExternal/JdbcIO.ReadRows/JdbcIO.Read/Create.Values/Read(CreateSource)/ParDo(OutputSingleSource)/ParMultiDo(OutputSingleSource).output/SplitAndSize0"} failed to deduce Step from MonitoringInfo: urn:"beam:metric:sampled_byte_size:v1" type:"beam:metrics:distribution_int64:v1" payload:"\x01\x83\t\x83\t\x83\t" labels:{key:"PCOLLECTION" value:"GmyrOWVqWvExternal/JdbcIO.ReadRows/JdbcIO.Read/Create.Values/Read(CreateSource)/ParDo(OutputSingleSource)/ParMultiDo(OutputSingleSource).output/SplitAndSize0"} failed to deduce Step from MonitoringInfo: urn:"beam:metric:element_count:v1" type:"beam:metrics:sum_int64:v1" payload:"\x01" labels:{key:"PCOLLECTION" value:"GmyrOWVqWvExternal/JdbcIO.ReadRows/JdbcIO.Read/Create.Values/Read(CreateSource)/ParDo(OutputSingleSource)/ParMultiDo(OutputSingleSource).output/PairWithRestriction0"} failed to deduce Step from MonitoringInfo: urn:"beam:metric:element_count:v1" type:"beam:metrics:sum_int64:v1" payload:"\x01" labels:{key:"PCOLLECTION" value:"GmyrOWVqWvExternal/JdbcIO.ReadRows/JdbcIO.Read/Create.Values/Read(CreateSource)/ParDo(OutputSingleSource)/ParMultiDo(OutputSingleSource).output/SplitAndSize0"} failed to deduce Step from MonitoringInfo: urn:"beam:metric:sampled_byte_size:v1" type:"beam:metrics:distribution_int64:v1" payload:"\x01\xf6\x08\xf6\x08\xf6\x08" labels:{key:"PCOLLECTION" value:"GmyrOWVqWvExternal/JdbcIO.ReadRows/JdbcIO.Read/Create.Values/Read(CreateSource)/ParDo(OutputSingleSource)/ParMultiDo(OutputSingleSource).output/PairWithRestriction0"} failed to deduce Step from MonitoringInfo: urn:"beam:metric:sampled_byte_size:v1" type:"beam:metrics:distribution_int64:v1" payload:"\x01\xfe\x08\xfe\x08\xfe\x08" labels:{key:"PCOLLECTION" value:"GmyrOWVqWvExternal/JdbcIO.ReadRows/JdbcIO.Read/Create.Values/Read(CreateSource)/ParDo(OutputSingleSource)/ParMultiDo(OutputSingleSource).output/SplitAndSize0"}]
--- PASS: TestJDBCIO_PostgresReadWrite (106.79s)
PASS
ok  	github.com/apache/beam/sdks/v2/go/test/integration/io/xlang/jdbc	280.411s
=== RUN   TestKafkaIO_BasicReadWrite
--- FAIL: TestKafkaIO_BasicReadWrite (0.01s)
panic: 	tried cross-language for beam:transform:org.apache.beam:kafka_write:v1 against localhost:37989 and failed
	expanding external transform
	expanding transform with ExpansionRequest: components:{pcollections:{key:"n4" value:{unique_name:"n4" coder_id:"c1@yGyhniCwXI" is_bounded:BOUNDED windowing_strategy_id:"w0@yGyhniCwXI"}} windowing_strategies:{key:"w0@yGyhniCwXI" value:{window_fn:{urn:"beam:window_fn:global_windows:v1"} merge_status:NON_MERGING window_coder_id:"c2@yGyhniCwXI" trigger:{default:{}} accumulation_mode:DISCARDING output_time:END_OF_WINDOW closing_behavior:EMIT_IF_NONEMPTY on_time_behavior:FIRE_IF_NONEMPTY environment_id:"go"}} coders:{key:"c0@yGyhniCwXI" value:{spec:{urn:"beam:coder:bytes:v1"}}} coders:{key:"c1@yGyhniCwXI" value:{spec:{urn:"beam:coder:kv:v1"} component_coder_ids:"c0@yGyhniCwXI" component_coder_ids:"c0@yGyhniCwXI"}} coders:{key:"c2@yGyhniCwXI" value:{spec:{urn:"beam:coder:global_window:v1"}}} environments:{key:"go" value:{}}} transform:{unique_name:"External" spec:{urn:"beam:transform:org.apache.beam:kafka_write:v1" payload:"\n}\n\x1c\n\x0eProducerConfig\x1a\n*\x08\n\x02\x10\x07\x12\x02\x10\x07\n\x0b\n\x05Topic\x1a\x02\x10\x07\n\x13\n\rKeySerializer\x1a\x02\x10\x07\n\x15\n\x0fValueSerializer\x1a\x02\x10\x07\x12$d97fbd8d-dde2-46d8-babd-f5372b6ab5e6\x12\xda\x01\x04\x00\x00\x00\x00\x01\x11bootstrap.servers\x0flocalhost:36291=xlang_kafkaio_basic_test_44a8278f-85db-4452-afda-48059c92bc6d9org.apache.kafka.common.serialization.ByteArraySerializer9org.apache.kafka.common.serialization.ByteArraySerializer"} inputs:{key:"i0" value:"n4"} environment_id:"go"} namespace:"yGyhniCwXI"
expansion failed
	caused by:
rpc error: code = Unavailable desc = connection error: desc = "transport: Error while dialing dial tcp 127.0.0.1:37989: connect: connection refused" [recovered]
	panic: 	tried cross-language for beam:transform:org.apache.beam:kafka_write:v1 against localhost:37989 and failed
	expanding external transform
	expanding transform with ExpansionRequest: components:{pcollections:{key:"n4" value:{unique_name:"n4" coder_id:"c1@yGyhniCwXI" is_bounded:BOUNDED windowing_strategy_id:"w0@yGyhniCwXI"}} windowing_strategies:{key:"w0@yGyhniCwXI" value:{window_fn:{urn:"beam:window_fn:global_windows:v1"} merge_status:NON_MERGING window_coder_id:"c2@yGyhniCwXI" trigger:{default:{}} accumulation_mode:DISCARDING output_time:END_OF_WINDOW closing_behavior:EMIT_IF_NONEMPTY on_time_behavior:FIRE_IF_NONEMPTY environment_id:"go"}} coders:{key:"c0@yGyhniCwXI" value:{spec:{urn:"beam:coder:bytes:v1"}}} coders:{key:"c1@yGyhniCwXI" value:{spec:{urn:"beam:coder:kv:v1"} component_coder_ids:"c0@yGyhniCwXI" component_coder_ids:"c0@yGyhniCwXI"}} coders:{key:"c2@yGyhniCwXI" value:{spec:{urn:"beam:coder:global_window:v1"}}} environments:{key:"go" value:{}}} transform:{unique_name:"External" spec:{urn:"beam:transform:org.apache.beam:kafka_write:v1" payload:"\n}\n\x1c\n\x0eProducerConfig\x1a\n*\x08\n\x02\x10\x07\x12\x02\x10\x07\n\x0b\n\x05Topic\x1a\x02\x10\x07\n\x13\n\rKeySerializer\x1a\x02\x10\x07\n\x15\n\x0fValueSerializer\x1a\x02\x10\x07\x12$d97fbd8d-dde2-46d8-babd-f5372b6ab5e6\x12\xda\x01\x04\x00\x00\x00\x00\x01\x11bootstrap.servers\x0flocalhost:36291=xlang_kafkaio_basic_test_44a8278f-85db-4452-afda-48059c92bc6d9org.apache.kafka.common.serialization.ByteArraySerializer9org.apache.kafka.common.serialization.ByteArraySerializer"} inputs:{key:"i0" value:"n4"} environment_id:"go"} namespace:"yGyhniCwXI"
expansion failed
	caused by:
rpc error: code = Unavailable desc = connection error: desc = "transport: Error while dialing dial tcp 127.0.0.1:37989: connect: connection refused"

goroutine 50 [running]:
testing.tRunner.func1.2({0xd754a0, 0xc0002f8100})
	/home/jenkins/sdk/go1.18.1/src/testing/testing.go:1389 +0x24e
testing.tRunner.func1()
	/home/jenkins/sdk/go1.18.1/src/testing/testing.go:1392 +0x39f
panic({0xd754a0, 0xc0002f8100})
	/home/jenkins/sdk/go1.18.1/src/runtime/panic.go:838 +0x207
github.com/apache/beam/sdks/v2/go/pkg/beam.CrossLanguage({0xc0000a2780?, 0xc0005557c0?}, {0xeac7a4, 0x2d}, {0xc00013c6e0?, 0xc0001a5a70?, 0xccdc40?}, {0xc0000400e0, 0xf}, 0xc000017c60, ...)
	<https://ci-beam.apache.org/job/beam_PostCommit_XVR_Spark3/ws/src/sdks/go/pkg/beam/xlang.go>:162 +0x136
github.com/apache/beam/sdks/v2/go/pkg/beam/io/xlang/kafkaio.Write({0xc0000a2520?, 0xc0005557c0?}, {0xc0000400e0, 0xf}, {0xc0000400a0, 0xf}, {0xc00004ed40, 0x3d}, {0xc000017e60?}, {0x0, ...})
	<https://ci-beam.apache.org/job/beam_PostCommit_XVR_Spark3/ws/src/sdks/go/pkg/beam/io/xlang/kafkaio/kafka.go>:278 +0x4ad
github.com/apache/beam/sdks/v2/go/test/integration/io/xlang/kafka.writeInts({0xc0000a2500?, 0xc0005557c0?}, {0xc0000400e0, 0xf}, {0xc0000400a0, 0xf}, {0xc00004ed40, 0x3d}, {0xc0006fe000, 0x3e8, ...})
	<https://ci-beam.apache.org/job/beam_PostCommit_XVR_Spark3/ws/src/sdks/go/test/integration/io/xlang/kafka/kafka.go>:48 +0x24b
github.com/apache/beam/sdks/v2/go/test/integration/io/xlang/kafka.WritePipeline({0xc0000400e0, 0xf}, {0xc0000400a0, 0xf}, {0xc00004ed40, 0x3d}, {0xc0006fe000, 0x3e8, 0x3e8})
	<https://ci-beam.apache.org/job/beam_PostCommit_XVR_Spark3/ws/src/sdks/go/test/integration/io/xlang/kafka/kafka.go>:70 +0x157
github.com/apache/beam/sdks/v2/go/test/integration/io/xlang/kafka.TestKafkaIO_BasicReadWrite(0xc000003860)
	<https://ci-beam.apache.org/job/beam_PostCommit_XVR_Spark3/ws/src/sdks/go/test/integration/io/xlang/kafka/kafka_test.go>:61 +0xed
testing.tRunner(0xc000003860, 0xee4568)
	/home/jenkins/sdk/go1.18.1/src/testing/testing.go:1439 +0x102
created by testing.(*T).Run
	/home/jenkins/sdk/go1.18.1/src/testing/testing.go:1486 +0x35f
FAIL	github.com/apache/beam/sdks/v2/go/test/integration/io/xlang/kafka	6.091s
FAIL

> Task :runners:spark:3:job-server:validatesCrossLanguageRunnerGoUsingJava FAILED
> Task :runners:spark:3:job-server:validatesCrossLanguageRunnerJavaUsingPython
> Task :runners:spark:3:job-server:validatesCrossLanguageRunnerPythonUsingJava
> Task :runners:spark:3:job-server:validatesCrossLanguageRunnerPythonUsingSql
> Task :runners:spark:3:job-server:sparkJobServerCleanup
> Task :runners:spark:3:job-server:validatesCrossLanguageRunnerCleanup

FAILURE: Build failed with an exception.

* Where:
Build file '<https://ci-beam.apache.org/job/beam_PostCommit_XVR_Spark3/ws/src/sdks/go/test/build.gradle'> line: 199

* What went wrong:
Execution failed for task ':runners:spark:3:job-server:validatesCrossLanguageRunnerGoUsingJava'.
> Process 'command 'sh'' finished with non-zero exit value 1

* Try:
> Run with --stacktrace option to get the stack trace.
> Run with --info or --debug option to get more log output.

* Get more help at https://help.gradle.org

Deprecated Gradle features were used in this build, making it incompatible with Gradle 8.0.

You can use '--warning-mode all' to show the individual deprecation warnings and determine if they come from your own scripts or plugins.

See https://docs.gradle.org/7.5.1/userguide/command_line_interface.html#sec:command_line_warnings

Execution optimizations have been disabled for 1 invalid unit(s) of work during this build to ensure correctness.
Please consult deprecation warnings for more details.

BUILD FAILED in 50m 32s
263 actionable tasks: 200 executed, 53 from cache, 10 up-to-date

Publishing build scan...
https://gradle.com/s/sz6bp2bcu2cdc

Build step 'Invoke Gradle script' changed build result to FAILURE
Build step 'Invoke Gradle script' marked build as failure

---------------------------------------------------------------------
To unsubscribe, e-mail: builds-unsubscribe@beam.apache.org
For additional commands, e-mail: builds-help@beam.apache.org


Build failed in Jenkins: beam_PostCommit_XVR_Spark3 #2104

Posted by Apache Jenkins Server <je...@builds.apache.org>.
See <https://ci-beam.apache.org/job/beam_PostCommit_XVR_Spark3/2104/display/redirect?page=changes>

Changes:

[Robert Bradshaw] Allow expansion service to choose pickler.

[Robert Bradshaw] Accept "default" as pickler library.

[Robert Bradshaw] Clarifying comment.

[Heejong Lee] [BEAM-22856] PythonService Beam version compatibility


------------------------------------------
[...truncated 1.03 MB...]
      component_coder_ids: "wMWdRzRRAyTimestampedValueCoder"
    >
  >
  coders: <
    key: "wMWdRzRRAyKvCoder4"
    value: <
      spec: <
        urn: "beam:coder:kv:v1"
      >
      component_coder_ids: "wMWdRzRRAyVarIntCoder"
      component_coder_ids: "wMWdRzRRAyIterableCoder"
    >
  >
  coders: <
    key: "wMWdRzRRAyNullableCoder"
    value: <
      spec: <
        urn: "beam:coder:nullable:v1"
      >
      component_coder_ids: "wMWdRzRRAyByteArrayCoder"
    >
  >
  coders: <
    key: "wMWdRzRRAySerializableCoder"
    value: <
      spec: <
        urn: "beam:coders:javasdk:0.1"
        payload: "\202SNAPPY\000\000\000\000\001\000\000\000\001\000\000\000\312\214\002\360^\254\355\000\005sr\000,org.apache.beam.sdk.coders.SerializableCoder\010\364 \216\305ynl\002\000\001L\000\004typet\000\021Ljava/lang/Class;xr\000&ofV\000\024Custom\005P8j\260\010\235\013;\035\013\002\000\000xr\000 j\213\000\005/\034C\335\325\211\256\274~\370\001/\020pvr\000;N1\000Pio.BoundedReadFromUnb\t\021`Source$Shardd\236\240U\205\000j\363\002\000\000xp"
      >
    >
  >
  coders: <
    key: "wMWdRzRRAySnappyCoder"
    value: <
      spec: <
        urn: "beam:coders:javasdk:0.1"
        payload: "\202SNAPPY\000\000\000\000\001\000\000\000\001\000\000\001.\307\003\360@\254\355\000\005sr\000&org.apache.beam.sdk.coders.SnappyCoder1\033\243\356\177\362\366,\002\000\001L\000\ninner\005\030 t\000\"Lorg/a\005B\000/\001B\020/sdk/\tB\000/\005$\020;xr\000*ng\000 tructured\005/8s\277\022\016\325\3246\021\002\000\000xr\000 j9\000\005/\034C\335\325\211\256\274~\370\001/\020psr\000,j1\000,Serializable\005= \010\364 \216\305ynl\002\001\327\\\004typet\000\021Ljava/lang/Class\001\300n'\001\024Custom\005PPj\260\010\235\013;\035\013\002\000\000xq\000~\000\003vr\000$N\221\000\\io.BoundedSource!`v\023\177\370QA\0019\010r\000\035Z3\000\t,0\020\213\372\020Y\214\347\323\002\000\000xp"
      >
    >
  >
  coders: <
    key: "wMWdRzRRAyTimestampedValueCoder"
    value: <
      spec: <
        urn: "beam:coders:javasdk:0.1"
        payload: "\202SNAPPY\000\000\000\000\001\000\000\000\001\000\000\001?\315\003\270\254\355\000\005sr\000Aorg.apache.beam.sdk.values.TimestampedV\001\022\000$>\021\000LCoder\364\376\202p\274iX-\002\000\001L\000\nv\001)\005\030\034t\000\"Lorg/\t]\000/\001],/sdk/coders/\005$\020;xr\000*N\202\000\t%(.Structured\005/8s\277\022\016\325\3246\021\002\000\000xr\000 j9\000\005/\034C\335\325\211\256\274~\370\001/\020psr\000,j1\000(Serializabl\t\277\034\010\364 \216\305ynl\005\327\\\004typet\000\021Ljava/lang/Class\001\300\000&jV\000\024Custom\005\215Pj\260\010\235\013;\035\013\002\000\000xq\000~\000\003vr\000;N;\000Pio.BoundedReadFromUnb\t\021`Source$Shardd\236\240U\205\000j\363\002\000\000xp"
      >
    >
  >
  coders: <
    key: "wMWdRzRRAyValueWithRecordIdCoder"
    value: <
      spec: <
        urn: "beam:coders:javasdk:0.1"
        payload: "\202SNAPPY\000\000\000\000\001\000\000\000\001\000\000\001\213\311\005\320\254\355\000\005sr\000Corg.apache.beam.sdk.values.ValueWithRecordId$B\022\000LCoder{\343\376bQ\014\204>\002\000\002L\000\007i\t\025\034t\000+Lorg/\t\\\000/\001\\\024/sdk/c\0012(s/ByteArray\005B\014;L\000\n\005u\005\016\010t\000\"n;\000\005$\020;xr\000*N\274\000\t`(.Structured\005/8s\277\022\016\325\3246\021\002\000\000xr\000 j9\000\005/\034C\335\325\211\256\274~\370\001/\020psr\000)j1\0006\312\000\034\351\277\005|\263\3746\333\001:\010r\000&j8\000\024Atomic\005o\034\307\354\265\314\205tPF\0015 q\000~\000\003sr\000-N;\000$io.kafka.K\001\006\000R%\227\005B<I\320\251Y\032\341{#\002\000\001L\000\007kv\005\025\010t\000$nH\001\000K\t&\000;\025s\000\"Ns\000-P\r- j\000\275\271\035\243\3126\002!\353\010\010ke)\277\001\264\000\0022\303\001\005\022\025Y\000(jY\000\030Nullabl)\372\034E\333\0336>\220\247\007\005\307]\022.O\000\001\014,\006sq\000~\000\016q\000~\000\020"
      >
    >
  >
  coders: <
    key: "wMWdRzRRAyVarIntCoder"
    value: <
      spec: <
        urn: "beam:coders:javasdk:0.1"
        payload: "\202SNAPPY\000\000\000\000\001\000\000\000\001\000\000\000\210\330\001\350\254\355\000\005sr\000&org.apache.beam.sdk.coders.VarIntCoder\300K2\332\251KVh\002\000\000xrr5\000\024Atomic\0055 \307\354\265\314\205tPF\002\0055\000*jj\000$Structured\0059\034s\277\022\016\325\3246\021\t9\000 j9\000\005/0C\335\325\211\256\274~\370\002\000\000xp"
      >
    >
  >
  coders: <
    key: "wMWdRzRRAyVoidCoder"
    value: <
      spec: <
        urn: "beam:coders:javasdk:0.1"
        payload: "\202SNAPPY\000\000\000\000\001\000\000\000\001\000\000\000\210\326\001\350\254\355\000\005sr\000$org.apache.beam.sdk.coders.VoidCoder\271\277U\233\350\r\257U\002\000\000xr\000&j3\000\024Atomic\0055 \307\354\265\314\205tPF\002\0055\000*j5\000$Structured\0059\034s\277\022\016\325\3246\021\t9\000 j9\000\005/0C\335\325\211\256\274~\370\002\000\000xp"
      >
    >
  >
  environments: <
    key: "go"
    value: <
      urn: "beam:env:docker:v1"
      payload: "\n\026apache/beam_go_sdk:dev"
      capabilities: "beam:protocol:progress_reporting:v1"
      capabilities: "beam:protocol:multi_core_bundle_processing:v1"
      capabilities: "beam:transform:sdf_truncate_sized_restrictions:v1"
      capabilities: "beam:protocol:worker_status:v1"
      capabilities: "beam:protocol:monitoring_info_short_ids:v1"
      capabilities: "beam:version:sdk_base:go"
      capabilities: "beam:coder:bytes:v1"
      capabilities: "beam:coder:bool:v1"
      capabilities: "beam:coder:varint:v1"
      capabilities: "beam:coder:double:v1"
      capabilities: "beam:coder:string_utf8:v1"
      capabilities: "beam:coder:length_prefix:v1"
      capabilities: "beam:coder:kv:v1"
      capabilities: "beam:coder:iterable:v1"
      capabilities: "beam:coder:state_backed_iterable:v1"
      capabilities: "beam:coder:windowed_value:v1"
      capabilities: "beam:coder:global_window:v1"
      capabilities: "beam:coder:interval_window:v1"
      capabilities: "beam:coder:row:v1"
      capabilities: "beam:coder:nullable:v1"
      dependencies: <
        type_urn: "beam:artifact:type:file:v1"
        role_urn: "beam:artifact:role:go_worker_binary:v1"
      >
    >
  >
  environments: <
    key: "wMWdRzRRAybeam:env:docker:v1"
    value: <
      urn: "beam:env:docker:v1"
      payload: "\n apache/beam_java8_sdk:2.42.0.dev"
      capabilities: "beam:coder:bytes:v1"
      capabilities: "beam:coder:bool:v1"
      capabilities: "beam:coder:varint:v1"
      capabilities: "beam:coder:string_utf8:v1"
      capabilities: "beam:coder:iterable:v1"
      capabilities: "beam:coder:timer:v1"
      capabilities: "beam:coder:kv:v1"
      capabilities: "beam:coder:length_prefix:v1"
      capabilities: "beam:coder:global_window:v1"
      capabilities: "beam:coder:interval_window:v1"
      capabilities: "beam:coder:custom_window:v1"
      capabilities: "beam:coder:windowed_value:v1"
      capabilities: "beam:coder:double:v1"
      capabilities: "beam:coder:row:v1"
      capabilities: "beam:coder:param_windowed_value:v1"
      capabilities: "beam:coder:state_backed_iterable:v1"
      capabilities: "beam:coder:sharded_key:v1"
      capabilities: "beam:coder:nullable:v1"
      capabilities: "beam:protocol:multi_core_bundle_processing:v1"
      capabilities: "beam:protocol:progress_reporting:v1"
      capabilities: "beam:protocol:harness_monitoring_infos:v1"
      capabilities: "beam:protocol:control_request_elements_embedding:v1"
      capabilities: "beam:protocol:state_caching:v1"
      capabilities: "beam:version:sdk_base:apache/beam_java8_sdk:2.42.0.dev"
      capabilities: "beam:transform:sdf_truncate_sized_restrictions:v1"
      capabilities: "beam:transform:to_string:v1"
      dependencies: <
        type_urn: "beam:artifact:type:file:v1"
        type_payload: "\nL/tmp/artifacts/icedtea-sound-CGRxIE9edPHnbxQhM-L5mp8h21H-ySB79uQtSquPV_Q.jar\022@086471204f5e74f1e76f142133e2f99a9f21db51fec9207bf6e42d4aab8f57f4"
        role_urn: "beam:artifact:role:staging_to:v1"
        role_payload: "\n=icedtea-sound-CGRxIE9edPHnbxQhM-L5mp8h21H-ySB79uQtSquPV_Q.jar"
      >
      dependencies: <
        type_urn: "beam:artifact:type:file:v1"
        type_payload: "\nF/tmp/artifacts/jaccess-FBI0Bb27lF3oEBieWAi7SP8X1zBR8k4BJQOVpsoK9a0.jar\022@14123405bdbb945de810189e5808bb48ff17d73051f24e01250395a6ca0af5ad"
        role_urn: "beam:artifact:role:staging_to:v1"
        role_payload: "\n7jaccess-FBI0Bb27lF3oEBieWAi7SP8X1zBR8k4BJQOVpsoK9a0.jar"
      >
      dependencies: <
        type_urn: "beam:artifact:type:file:v1"
        type_payload: "\nI/tmp/artifacts/localedata-kJ2mc8rBH5-IklhfR1XzNotlIQ_mnVMA-pgaXv2r8Ag.jar\022@909da673cac11f9f8892585f4755f3368b65210fe69d5300fa981a5efdabf008"
        role_urn: "beam:artifact:role:staging_to:v1"
        role_payload: "\n:localedata-kJ2mc8rBH5-IklhfR1XzNotlIQ_mnVMA-pgaXv2r8Ag.jar"
      >
      dependencies: <
        type_urn: "beam:artifact:type:file:v1"
        type_payload: "\nF/tmp/artifacts/nashorn-B0CAb3QpJET_6VsT3hcC_89VtvhV616H8N2bHAIaqWo.jar\022@0740806f74292444ffe95b13de1702ffcf55b6f855eb5e87f0dd9b1c021aa96a"
        role_urn: "beam:artifact:role:staging_to:v1"
        role_payload: "\n7nashorn-B0CAb3QpJET_6VsT3hcC_89VtvhV616H8N2bHAIaqWo.jar"
      >
      dependencies: <
        type_urn: "beam:artifact:type:file:v1"
        type_payload: "\nG/tmp/artifacts/cldrdata-gclqV9lOGqQOKesG-a6TAUTGEYlyIDqpyd4M_k7gtWo.jar\022@81c96a57d94e1aa40e29eb06f9ae930144c6118972203aa9c9de0cfe4ee0b56a"
        role_urn: "beam:artifact:role:staging_to:v1"
        role_payload: "\n8cldrdata-gclqV9lOGqQOKesG-a6TAUTGEYlyIDqpyd4M_k7gtWo.jar"
      >
      dependencies: <
        type_urn: "beam:artifact:type:file:v1"
        type_payload: "\nD/tmp/artifacts/dnsns-byzoQxdXengTvA5IlbH9gSIzfhNQElRYltuMJN0vjcc.jar\022@6f2ce84317577a7813bc0e4895b1fd8122337e135012545896db8c24dd2f8dc7"
        role_urn: "beam:artifact:role:staging_to:v1"
        role_payload: "\n5dnsns-byzoQxdXengTvA5IlbH9gSIzfhNQElRYltuMJN0vjcc.jar"
      >
      dependencies: <
        type_urn: "beam:artifact:type:file:v1"
        type_payload: "\nr/tmp/artifacts/beam-sdks-java-io-expansion-service-2.42.0-SNAPSHOT-vPQsvQdIaDq8qqRzich6d6PlQ_Cc7636Uu7-DimOLfs.jar\022@bcf42cbd0748683abcaaa47389c87a77a3e543f09cefadfa52eefe0e298e2dfb"
        role_urn: "beam:artifact:role:staging_to:v1"
        role_payload: "\ncbeam-sdks-java-io-expansion-service-2.42.0-SNAPSHOT-vPQsvQdIaDq8qqRzich6d6PlQ_Cc7636Uu7-DimOLfs.jar"
      >
    >
  >
>
root_transform_ids: "s1"
root_transform_ids: "e4"
root_transform_ids: "e5"
root_transform_ids: "s3"
requirements: "beam:requirement:pardo:splittable_dofn:v1"
2022/09/07 02:37:55 Cross-compiling <https://ci-beam.apache.org/job/beam_PostCommit_XVR_Spark3/ws/src/sdks/go/test/integration/io/xlang/kafka/kafka_test.go> as /tmp/worker-2-1662518275033051597
2022/09/07 02:37:56 Prepared job with id: go-testkafkaio_basicreadwrite-403_09a18af2-efc8-420e-9015-3fb1fb4385b6 and staging token: go-testkafkaio_basicreadwrite-403_09a18af2-efc8-420e-9015-3fb1fb4385b6
2022/09/07 02:37:56 Staged binary artifact with token: 
2022/09/07 02:37:56 Submitted job: go0testkafkaio0basicreadwrite0403-jenkins-0907023756-5a94097a_d91ba72c-6e24-4705-b08c-1450a648ac10
2022/09/07 02:37:56 Job state: STOPPED
2022/09/07 02:37:56 Job state: STARTING
2022/09/07 02:37:56 Job state: RUNNING
2022/09/07 02:38:20 Job state: DONE
2022/09/07 02:38:20 Warning: 6 errors during metrics processing: [failed to deduce Step from MonitoringInfo: urn:"beam:metric:element_count:v1" type:"beam:metrics:sum_int64:v1" payload:"\x01" labels:{key:"PCOLLECTION" value:"wMWdRzRRAyExternal/KafkaIO.Read/KafkaIO.Read.ReadFromKafkaViaUnbounded/Read(KafkaUnboundedSource)/Create/Read(CreateSource)/ParDo(OutputSingleSource)/ParMultiDo(OutputSingleSource).output/SplitAndSize0"} failed to deduce Step from MonitoringInfo: urn:"beam:metric:sampled_byte_size:v1" type:"beam:metrics:distribution_int64:v1" payload:"\x01\xfd\"\xfd\"\xfd\"" labels:{key:"PCOLLECTION" value:"wMWdRzRRAyExternal/KafkaIO.Read/KafkaIO.Read.ReadFromKafkaViaUnbounded/Read(KafkaUnboundedSource)/Create/Read(CreateSource)/ParDo(OutputSingleSource)/ParMultiDo(OutputSingleSource).output/SplitAndSize0"} failed to deduce Step from MonitoringInfo: urn:"beam:metric:element_count:v1" type:"beam:metrics:sum_int64:v1" payload:"\x01" labels:{key:"PCOLLECTION" value:"wMWdRzRRAyExternal/KafkaIO.Read/KafkaIO.Read.ReadFromKafkaViaUnbounded/Read(KafkaUnboundedSource)/Create/Read(CreateSource)/ParDo(OutputSingleSource)/ParMultiDo(OutputSingleSource).output/PairWithRestriction0"} failed to deduce Step from MonitoringInfo: urn:"beam:metric:element_count:v1" type:"beam:metrics:sum_int64:v1" payload:"\x01" labels:{key:"PCOLLECTION" value:"wMWdRzRRAyExternal/KafkaIO.Read/KafkaIO.Read.ReadFromKafkaViaUnbounded/Read(KafkaUnboundedSource)/Create/Read(CreateSource)/ParDo(OutputSingleSource)/ParMultiDo(OutputSingleSource).output/SplitAndSize0"} failed to deduce Step from MonitoringInfo: urn:"beam:metric:sampled_byte_size:v1" type:"beam:metrics:distribution_int64:v1" payload:"\x01\xf8\"\xf8\"\xf8\"" labels:{key:"PCOLLECTION" value:"wMWdRzRRAyExternal/KafkaIO.Read/KafkaIO.Read.ReadFromKafkaViaUnbounded/Read(KafkaUnboundedSource)/Create/Read(CreateSource)/ParDo(OutputSingleSource)/ParMultiDo(OutputSingleSource).output/SplitAndSize0"} failed to deduce Step from MonitoringInfo: urn:"beam:metric:sampled_byte_size:v1" type:"beam:metrics:distribution_int64:v1" payload:"\x01\xf0\"\xf0\"\xf0\"" labels:{key:"PCOLLECTION" value:"wMWdRzRRAyExternal/KafkaIO.Read/KafkaIO.Read.ReadFromKafkaViaUnbounded/Read(KafkaUnboundedSource)/Create/Read(CreateSource)/ParDo(OutputSingleSource)/ParMultiDo(OutputSingleSource).output/PairWithRestriction0"}]
--- PASS: TestKafkaIO_BasicReadWrite (38.50s)
PASS
ok  	github.com/apache/beam/sdks/v2/go/test/integration/io/xlang/kafka	44.535s

> Task :runners:spark:3:job-server:validatesCrossLanguageRunnerJavaUsingPython

org.apache.beam.sdk.extensions.python.transforms.RunInferenceTransformTest > testRunInferenceWithKVs FAILED
    java.lang.IllegalStateException at RunInferenceTransformTest.java:108
    java.lang.NullPointerException at Preconditions.java:980

org.apache.beam.sdk.extensions.python.transforms.RunInferenceTransformTest > testRunInference FAILED
    java.lang.IllegalStateException at RunInferenceTransformTest.java:60
    java.lang.NullPointerException at Preconditions.java:980

16 tests completed, 2 failed, 2 skipped

> Task :runners:spark:3:job-server:validatesCrossLanguageRunnerJavaUsingPython FAILED
> Task :runners:spark:3:job-server:validatesCrossLanguageRunnerPythonUsingJava
> Task :runners:spark:3:job-server:validatesCrossLanguageRunnerPythonUsingSql
> Task :runners:spark:3:job-server:validatesCrossLanguageRunnerCleanup
> Task :runners:spark:3:job-server:sparkJobServerCleanup

FAILURE: Build failed with an exception.

* What went wrong:
Execution failed for task ':runners:spark:3:job-server:validatesCrossLanguageRunnerJavaUsingPython'.
> There were failing tests. See the report at: file://<https://ci-beam.apache.org/job/beam_PostCommit_XVR_Spark3/ws/src/runners/spark/3/job-server/build/reports/tests/validatesCrossLanguageRunnerJavaUsingPython/index.html>

* Try:
> Run with --stacktrace option to get the stack trace.
> Run with --info or --debug option to get more log output.
> Run with --scan to get full insights.

* Get more help at https://help.gradle.org

Deprecated Gradle features were used in this build, making it incompatible with Gradle 8.0.

You can use '--warning-mode all' to show the individual deprecation warnings and determine if they come from your own scripts or plugins.

See https://docs.gradle.org/7.4/userguide/command_line_interface.html#sec:command_line_warnings

Execution optimizations have been disabled for 1 invalid unit(s) of work during this build to ensure correctness.
Please consult deprecation warnings for more details.

BUILD FAILED in 37m 2s
263 actionable tasks: 178 executed, 73 from cache, 12 up-to-date

Publishing build scan...
https://gradle.com/s/7xydmqf3g6d2i

Build step 'Invoke Gradle script' changed build result to FAILURE
Build step 'Invoke Gradle script' marked build as failure

---------------------------------------------------------------------
To unsubscribe, e-mail: builds-unsubscribe@beam.apache.org
For additional commands, e-mail: builds-help@beam.apache.org


Build failed in Jenkins: beam_PostCommit_XVR_Spark3 #2103

Posted by Apache Jenkins Server <je...@builds.apache.org>.
See <https://ci-beam.apache.org/job/beam_PostCommit_XVR_Spark3/2103/display/redirect?page=changes>

Changes:

[Brian Hulette] Use typehints in benchmark utilities

[oleg.borisevich] fixing condition for db index creation

[noreply] [Go SDK]: Add support for Google Cloud Profiler for pipelines (#22824)

[noreply] Listen to window messages to switch SDK and to load content (#22959)

[noreply] Disable singleIterate (#23042)


------------------------------------------
[...truncated 1.04 MB...]
      component_coder_ids: "dFcmMMjUFMTimestampedValueCoder"
    >
  >
  coders: <
    key: "dFcmMMjUFMKvCoder4"
    value: <
      spec: <
        urn: "beam:coder:kv:v1"
      >
      component_coder_ids: "dFcmMMjUFMVarIntCoder"
      component_coder_ids: "dFcmMMjUFMIterableCoder"
    >
  >
  coders: <
    key: "dFcmMMjUFMNullableCoder"
    value: <
      spec: <
        urn: "beam:coder:nullable:v1"
      >
      component_coder_ids: "dFcmMMjUFMByteArrayCoder"
    >
  >
  coders: <
    key: "dFcmMMjUFMSerializableCoder"
    value: <
      spec: <
        urn: "beam:coders:javasdk:0.1"
        payload: "\202SNAPPY\000\000\000\000\001\000\000\000\001\000\000\000\312\214\002\360^\254\355\000\005sr\000,org.apache.beam.sdk.coders.SerializableCoder\010\364 \216\305ynl\002\000\001L\000\004typet\000\021Ljava/lang/Class;xr\000&ofV\000\024Custom\005P8j\260\010\235\013;\035\013\002\000\000xr\000 j\213\000\005/\034C\335\325\211\256\274~\370\001/\020pvr\000;N1\000Pio.BoundedReadFromUnb\t\021`Source$Shardd\236\240U\205\000j\363\002\000\000xp"
      >
    >
  >
  coders: <
    key: "dFcmMMjUFMSnappyCoder"
    value: <
      spec: <
        urn: "beam:coders:javasdk:0.1"
        payload: "\202SNAPPY\000\000\000\000\001\000\000\000\001\000\000\001.\307\003\360@\254\355\000\005sr\000&org.apache.beam.sdk.coders.SnappyCoder1\033\243\356\177\362\366,\002\000\001L\000\ninner\005\030 t\000\"Lorg/a\005B\000/\001B\020/sdk/\tB\000/\005$\020;xr\000*ng\000 tructured\005/8s\277\022\016\325\3246\021\002\000\000xr\000 j9\000\005/\034C\335\325\211\256\274~\370\001/\020psr\000,j1\000,Serializable\005= \010\364 \216\305ynl\002\001\327\\\004typet\000\021Ljava/lang/Class\001\300n'\001\024Custom\005PPj\260\010\235\013;\035\013\002\000\000xq\000~\000\003vr\000$N\221\000\\io.BoundedSource!`v\023\177\370QA\0019\010r\000\035Z3\000\t,0\020\213\372\020Y\214\347\323\002\000\000xp"
      >
    >
  >
  coders: <
    key: "dFcmMMjUFMTimestampedValueCoder"
    value: <
      spec: <
        urn: "beam:coders:javasdk:0.1"
        payload: "\202SNAPPY\000\000\000\000\001\000\000\000\001\000\000\001?\315\003\270\254\355\000\005sr\000Aorg.apache.beam.sdk.values.TimestampedV\001\022\000$>\021\000LCoder\364\376\202p\274iX-\002\000\001L\000\nv\001)\005\030\034t\000\"Lorg/\t]\000/\001],/sdk/coders/\005$\020;xr\000*N\202\000\t%(.Structured\005/8s\277\022\016\325\3246\021\002\000\000xr\000 j9\000\005/\034C\335\325\211\256\274~\370\001/\020psr\000,j1\000(Serializabl\t\277\034\010\364 \216\305ynl\005\327\\\004typet\000\021Ljava/lang/Class\001\300\000&jV\000\024Custom\005\215Pj\260\010\235\013;\035\013\002\000\000xq\000~\000\003vr\000;N;\000Pio.BoundedReadFromUnb\t\021`Source$Shardd\236\240U\205\000j\363\002\000\000xp"
      >
    >
  >
  coders: <
    key: "dFcmMMjUFMValueWithRecordIdCoder"
    value: <
      spec: <
        urn: "beam:coders:javasdk:0.1"
        payload: "\202SNAPPY\000\000\000\000\001\000\000\000\001\000\000\001\213\311\005\320\254\355\000\005sr\000Corg.apache.beam.sdk.values.ValueWithRecordId$B\022\000LCoder{\343\376bQ\014\204>\002\000\002L\000\007i\t\025\034t\000+Lorg/\t\\\000/\001\\\024/sdk/c\0012(s/ByteArray\005B\014;L\000\n\005u\005\016\010t\000\"n;\000\005$\020;xr\000*N\274\000\t`(.Structured\005/8s\277\022\016\325\3246\021\002\000\000xr\000 j9\000\005/\034C\335\325\211\256\274~\370\001/\020psr\000)j1\0006\312\000\034\351\277\005|\263\3746\333\001:\010r\000&j8\000\024Atomic\005o\034\307\354\265\314\205tPF\0015 q\000~\000\003sr\000-N;\000$io.kafka.K\001\006\000R%\227\005B<I\320\251Y\032\341{#\002\000\001L\000\007kv\005\025\010t\000$nH\001\000K\t&\000;\025s\000\"Ns\000-P\r- j\000\275\271\035\243\3126\002!\353\010\010ke)\277\001\264\000\0022\303\001\005\022\025Y\000(jY\000\030Nullabl)\372\034E\333\0336>\220\247\007\005\307]\022.O\000\001\014,\006sq\000~\000\016q\000~\000\020"
      >
    >
  >
  coders: <
    key: "dFcmMMjUFMVarIntCoder"
    value: <
      spec: <
        urn: "beam:coders:javasdk:0.1"
        payload: "\202SNAPPY\000\000\000\000\001\000\000\000\001\000\000\000\210\330\001\350\254\355\000\005sr\000&org.apache.beam.sdk.coders.VarIntCoder\300K2\332\251KVh\002\000\000xrr5\000\024Atomic\0055 \307\354\265\314\205tPF\002\0055\000*jj\000$Structured\0059\034s\277\022\016\325\3246\021\t9\000 j9\000\005/0C\335\325\211\256\274~\370\002\000\000xp"
      >
    >
  >
  coders: <
    key: "dFcmMMjUFMVoidCoder"
    value: <
      spec: <
        urn: "beam:coders:javasdk:0.1"
        payload: "\202SNAPPY\000\000\000\000\001\000\000\000\001\000\000\000\210\326\001\350\254\355\000\005sr\000$org.apache.beam.sdk.coders.VoidCoder\271\277U\233\350\r\257U\002\000\000xr\000&j3\000\024Atomic\0055 \307\354\265\314\205tPF\002\0055\000*j5\000$Structured\0059\034s\277\022\016\325\3246\021\t9\000 j9\000\005/0C\335\325\211\256\274~\370\002\000\000xp"
      >
    >
  >
  environments: <
    key: "dFcmMMjUFMbeam:env:docker:v1"
    value: <
      urn: "beam:env:docker:v1"
      payload: "\n apache/beam_java8_sdk:2.42.0.dev"
      capabilities: "beam:coder:bytes:v1"
      capabilities: "beam:coder:bool:v1"
      capabilities: "beam:coder:varint:v1"
      capabilities: "beam:coder:string_utf8:v1"
      capabilities: "beam:coder:iterable:v1"
      capabilities: "beam:coder:timer:v1"
      capabilities: "beam:coder:kv:v1"
      capabilities: "beam:coder:length_prefix:v1"
      capabilities: "beam:coder:global_window:v1"
      capabilities: "beam:coder:interval_window:v1"
      capabilities: "beam:coder:custom_window:v1"
      capabilities: "beam:coder:windowed_value:v1"
      capabilities: "beam:coder:double:v1"
      capabilities: "beam:coder:row:v1"
      capabilities: "beam:coder:param_windowed_value:v1"
      capabilities: "beam:coder:state_backed_iterable:v1"
      capabilities: "beam:coder:sharded_key:v1"
      capabilities: "beam:coder:nullable:v1"
      capabilities: "beam:protocol:multi_core_bundle_processing:v1"
      capabilities: "beam:protocol:progress_reporting:v1"
      capabilities: "beam:protocol:harness_monitoring_infos:v1"
      capabilities: "beam:protocol:control_request_elements_embedding:v1"
      capabilities: "beam:protocol:state_caching:v1"
      capabilities: "beam:version:sdk_base:apache/beam_java8_sdk:2.42.0.dev"
      capabilities: "beam:transform:sdf_truncate_sized_restrictions:v1"
      capabilities: "beam:transform:to_string:v1"
      dependencies: <
        type_urn: "beam:artifact:type:file:v1"
        type_payload: "\nL/tmp/artifacts/icedtea-sound-CGRxIE9edPHnbxQhM-L5mp8h21H-ySB79uQtSquPV_Q.jar\022@086471204f5e74f1e76f142133e2f99a9f21db51fec9207bf6e42d4aab8f57f4"
        role_urn: "beam:artifact:role:staging_to:v1"
        role_payload: "\n=icedtea-sound-CGRxIE9edPHnbxQhM-L5mp8h21H-ySB79uQtSquPV_Q.jar"
      >
      dependencies: <
        type_urn: "beam:artifact:type:file:v1"
        type_payload: "\nF/tmp/artifacts/jaccess-FBI0Bb27lF3oEBieWAi7SP8X1zBR8k4BJQOVpsoK9a0.jar\022@14123405bdbb945de810189e5808bb48ff17d73051f24e01250395a6ca0af5ad"
        role_urn: "beam:artifact:role:staging_to:v1"
        role_payload: "\n7jaccess-FBI0Bb27lF3oEBieWAi7SP8X1zBR8k4BJQOVpsoK9a0.jar"
      >
      dependencies: <
        type_urn: "beam:artifact:type:file:v1"
        type_payload: "\nI/tmp/artifacts/localedata-kJ2mc8rBH5-IklhfR1XzNotlIQ_mnVMA-pgaXv2r8Ag.jar\022@909da673cac11f9f8892585f4755f3368b65210fe69d5300fa981a5efdabf008"
        role_urn: "beam:artifact:role:staging_to:v1"
        role_payload: "\n:localedata-kJ2mc8rBH5-IklhfR1XzNotlIQ_mnVMA-pgaXv2r8Ag.jar"
      >
      dependencies: <
        type_urn: "beam:artifact:type:file:v1"
        type_payload: "\nF/tmp/artifacts/nashorn-B0CAb3QpJET_6VsT3hcC_89VtvhV616H8N2bHAIaqWo.jar\022@0740806f74292444ffe95b13de1702ffcf55b6f855eb5e87f0dd9b1c021aa96a"
        role_urn: "beam:artifact:role:staging_to:v1"
        role_payload: "\n7nashorn-B0CAb3QpJET_6VsT3hcC_89VtvhV616H8N2bHAIaqWo.jar"
      >
      dependencies: <
        type_urn: "beam:artifact:type:file:v1"
        type_payload: "\nG/tmp/artifacts/cldrdata-gclqV9lOGqQOKesG-a6TAUTGEYlyIDqpyd4M_k7gtWo.jar\022@81c96a57d94e1aa40e29eb06f9ae930144c6118972203aa9c9de0cfe4ee0b56a"
        role_urn: "beam:artifact:role:staging_to:v1"
        role_payload: "\n8cldrdata-gclqV9lOGqQOKesG-a6TAUTGEYlyIDqpyd4M_k7gtWo.jar"
      >
      dependencies: <
        type_urn: "beam:artifact:type:file:v1"
        type_payload: "\nD/tmp/artifacts/dnsns-byzoQxdXengTvA5IlbH9gSIzfhNQElRYltuMJN0vjcc.jar\022@6f2ce84317577a7813bc0e4895b1fd8122337e135012545896db8c24dd2f8dc7"
        role_urn: "beam:artifact:role:staging_to:v1"
        role_payload: "\n5dnsns-byzoQxdXengTvA5IlbH9gSIzfhNQElRYltuMJN0vjcc.jar"
      >
      dependencies: <
        type_urn: "beam:artifact:type:file:v1"
        type_payload: "\nr/tmp/artifacts/beam-sdks-java-io-expansion-service-2.42.0-SNAPSHOT-vPQsvQdIaDq8qqRzich6d6PlQ_Cc7636Uu7-DimOLfs.jar\022@bcf42cbd0748683abcaaa47389c87a77a3e543f09cefadfa52eefe0e298e2dfb"
        role_urn: "beam:artifact:role:staging_to:v1"
        role_payload: "\ncbeam-sdks-java-io-expansion-service-2.42.0-SNAPSHOT-vPQsvQdIaDq8qqRzich6d6PlQ_Cc7636Uu7-DimOLfs.jar"
      >
    >
  >
  environments: <
    key: "go"
    value: <
      urn: "beam:env:docker:v1"
      payload: "\n\026apache/beam_go_sdk:dev"
      capabilities: "beam:protocol:progress_reporting:v1"
      capabilities: "beam:protocol:multi_core_bundle_processing:v1"
      capabilities: "beam:transform:sdf_truncate_sized_restrictions:v1"
      capabilities: "beam:protocol:worker_status:v1"
      capabilities: "beam:protocol:monitoring_info_short_ids:v1"
      capabilities: "beam:version:sdk_base:go"
      capabilities: "beam:coder:bytes:v1"
      capabilities: "beam:coder:bool:v1"
      capabilities: "beam:coder:varint:v1"
      capabilities: "beam:coder:double:v1"
      capabilities: "beam:coder:string_utf8:v1"
      capabilities: "beam:coder:length_prefix:v1"
      capabilities: "beam:coder:kv:v1"
      capabilities: "beam:coder:iterable:v1"
      capabilities: "beam:coder:state_backed_iterable:v1"
      capabilities: "beam:coder:windowed_value:v1"
      capabilities: "beam:coder:global_window:v1"
      capabilities: "beam:coder:interval_window:v1"
      capabilities: "beam:coder:row:v1"
      capabilities: "beam:coder:nullable:v1"
      dependencies: <
        type_urn: "beam:artifact:type:file:v1"
        role_urn: "beam:artifact:role:go_worker_binary:v1"
      >
    >
  >
>
root_transform_ids: "s1"
root_transform_ids: "e4"
root_transform_ids: "e5"
root_transform_ids: "s3"
requirements: "beam:requirement:pardo:splittable_dofn:v1"
2022/09/06 20:38:40 Cross-compiling <https://ci-beam.apache.org/job/beam_PostCommit_XVR_Spark3/ws/src/sdks/go/test/integration/io/xlang/kafka/kafka_test.go> as /tmp/worker-2-1662496720553945390
2022/09/06 20:38:42 Prepared job with id: go-testkafkaio_basicreadwrite-474_bf3a6748-5a8a-4e57-91d5-7757e302dc64 and staging token: go-testkafkaio_basicreadwrite-474_bf3a6748-5a8a-4e57-91d5-7757e302dc64
2022/09/06 20:38:42 Staged binary artifact with token: 
2022/09/06 20:38:42 Submitted job: go0testkafkaio0basicreadwrite0474-jenkins-0906203842-3d715a0e_bef31dcd-0ad6-4170-94b7-0683ec953227
2022/09/06 20:38:42 Job state: STOPPED
2022/09/06 20:38:42 Job state: STARTING
2022/09/06 20:38:42 Job state: RUNNING
2022/09/06 20:39:06 Job state: DONE
2022/09/06 20:39:06 Warning: 6 errors during metrics processing: [failed to deduce Step from MonitoringInfo: urn:"beam:metric:element_count:v1" type:"beam:metrics:sum_int64:v1" payload:"\x01" labels:{key:"PCOLLECTION" value:"dFcmMMjUFMExternal/KafkaIO.Read/KafkaIO.Read.ReadFromKafkaViaUnbounded/Read(KafkaUnboundedSource)/Create/Read(CreateSource)/ParDo(OutputSingleSource)/ParMultiDo(OutputSingleSource).output/SplitAndSize0"} failed to deduce Step from MonitoringInfo: urn:"beam:metric:sampled_byte_size:v1" type:"beam:metrics:distribution_int64:v1" payload:"\x01\xfd\"\xfd\"\xfd\"" labels:{key:"PCOLLECTION" value:"dFcmMMjUFMExternal/KafkaIO.Read/KafkaIO.Read.ReadFromKafkaViaUnbounded/Read(KafkaUnboundedSource)/Create/Read(CreateSource)/ParDo(OutputSingleSource)/ParMultiDo(OutputSingleSource).output/SplitAndSize0"} failed to deduce Step from MonitoringInfo: urn:"beam:metric:element_count:v1" type:"beam:metrics:sum_int64:v1" payload:"\x01" labels:{key:"PCOLLECTION" value:"dFcmMMjUFMExternal/KafkaIO.Read/KafkaIO.Read.ReadFromKafkaViaUnbounded/Read(KafkaUnboundedSource)/Create/Read(CreateSource)/ParDo(OutputSingleSource)/ParMultiDo(OutputSingleSource).output/SplitAndSize0"} failed to deduce Step from MonitoringInfo: urn:"beam:metric:element_count:v1" type:"beam:metrics:sum_int64:v1" payload:"\x01" labels:{key:"PCOLLECTION" value:"dFcmMMjUFMExternal/KafkaIO.Read/KafkaIO.Read.ReadFromKafkaViaUnbounded/Read(KafkaUnboundedSource)/Create/Read(CreateSource)/ParDo(OutputSingleSource)/ParMultiDo(OutputSingleSource).output/PairWithRestriction0"} failed to deduce Step from MonitoringInfo: urn:"beam:metric:sampled_byte_size:v1" type:"beam:metrics:distribution_int64:v1" payload:"\x01\xf8\"\xf8\"\xf8\"" labels:{key:"PCOLLECTION" value:"dFcmMMjUFMExternal/KafkaIO.Read/KafkaIO.Read.ReadFromKafkaViaUnbounded/Read(KafkaUnboundedSource)/Create/Read(CreateSource)/ParDo(OutputSingleSource)/ParMultiDo(OutputSingleSource).output/SplitAndSize0"} failed to deduce Step from MonitoringInfo: urn:"beam:metric:sampled_byte_size:v1" type:"beam:metrics:distribution_int64:v1" payload:"\x01\xf0\"\xf0\"\xf0\"" labels:{key:"PCOLLECTION" value:"dFcmMMjUFMExternal/KafkaIO.Read/KafkaIO.Read.ReadFromKafkaViaUnbounded/Read(KafkaUnboundedSource)/Create/Read(CreateSource)/ParDo(OutputSingleSource)/ParMultiDo(OutputSingleSource).output/PairWithRestriction0"}]
--- PASS: TestKafkaIO_BasicReadWrite (40.12s)
PASS
ok  	github.com/apache/beam/sdks/v2/go/test/integration/io/xlang/kafka	46.201s

> Task :runners:spark:3:job-server:validatesCrossLanguageRunnerJavaUsingPython

org.apache.beam.sdk.extensions.python.transforms.RunInferenceTransformTest > testRunInferenceWithKVs FAILED
    java.lang.IllegalStateException at RunInferenceTransformTest.java:108
    java.lang.NullPointerException at Preconditions.java:980

org.apache.beam.sdk.extensions.python.transforms.RunInferenceTransformTest > testRunInference FAILED
    java.lang.IllegalStateException at RunInferenceTransformTest.java:60
    java.lang.NullPointerException at Preconditions.java:980

16 tests completed, 2 failed, 2 skipped

> Task :runners:spark:3:job-server:validatesCrossLanguageRunnerJavaUsingPython FAILED
> Task :runners:spark:3:job-server:validatesCrossLanguageRunnerPythonUsingJava
> Task :runners:spark:3:job-server:validatesCrossLanguageRunnerPythonUsingSql
> Task :runners:spark:3:job-server:validatesCrossLanguageRunnerCleanup
> Task :runners:spark:3:job-server:sparkJobServerCleanup

FAILURE: Build failed with an exception.

* What went wrong:
Execution failed for task ':runners:spark:3:job-server:validatesCrossLanguageRunnerJavaUsingPython'.
> There were failing tests. See the report at: file://<https://ci-beam.apache.org/job/beam_PostCommit_XVR_Spark3/ws/src/runners/spark/3/job-server/build/reports/tests/validatesCrossLanguageRunnerJavaUsingPython/index.html>

* Try:
> Run with --stacktrace option to get the stack trace.
> Run with --info or --debug option to get more log output.
> Run with --scan to get full insights.

* Get more help at https://help.gradle.org

Deprecated Gradle features were used in this build, making it incompatible with Gradle 8.0.

You can use '--warning-mode all' to show the individual deprecation warnings and determine if they come from your own scripts or plugins.

See https://docs.gradle.org/7.4/userguide/command_line_interface.html#sec:command_line_warnings

Execution optimizations have been disabled for 1 invalid unit(s) of work during this build to ensure correctness.
Please consult deprecation warnings for more details.

BUILD FAILED in 29m 28s
263 actionable tasks: 173 executed, 78 from cache, 12 up-to-date

Publishing build scan...
https://gradle.com/s/ex4omatcwulgw

Build step 'Invoke Gradle script' changed build result to FAILURE
Build step 'Invoke Gradle script' marked build as failure

---------------------------------------------------------------------
To unsubscribe, e-mail: builds-unsubscribe@beam.apache.org
For additional commands, e-mail: builds-help@beam.apache.org


Build failed in Jenkins: beam_PostCommit_XVR_Spark3 #2102

Posted by Apache Jenkins Server <je...@builds.apache.org>.
See <https://ci-beam.apache.org/job/beam_PostCommit_XVR_Spark3/2102/display/redirect?page=changes>

Changes:

[noreply] Allow users to pass classloader to dynamically load JDBC drivers.

[noreply] Fix withCheckStopReadingFn to not cause the pipeline to crash (#22962)

[noreply] Inference benchmark tests (#21738)


------------------------------------------
[...truncated 1.04 MB...]
        urn: "beam:coders:javasdk:0.1"
        payload: "\202SNAPPY\000\000\000\000\001\000\000\000\001\000\000\001?\315\003\270\254\355\000\005sr\000Aorg.apache.beam.sdk.values.TimestampedV\001\022\000$>\021\000LCoder\364\376\202p\274iX-\002\000\001L\000\nv\001)\005\030\034t\000\"Lorg/\t]\000/\001],/sdk/coders/\005$\020;xr\000*N\202\000\t%(.Structured\005/8s\277\022\016\325\3246\021\002\000\000xr\000 j9\000\005/\034C\335\325\211\256\274~\370\001/\020psr\000,j1\000(Serializabl\t\277\034\010\364 \216\305ynl\005\327\\\004typet\000\021Ljava/lang/Class\001\300\000&jV\000\024Custom\005\215Pj\260\010\235\013;\035\013\002\000\000xq\000~\000\003vr\000;N;\000Pio.BoundedReadFromUnb\t\021`Source$Shardd\236\240U\205\000j\363\002\000\000xp"
      >
    >
  >
  coders: <
    key: "SFxsDJAmHRValueWithRecordIdCoder"
    value: <
      spec: <
        urn: "beam:coders:javasdk:0.1"
        payload: "\202SNAPPY\000\000\000\000\001\000\000\000\001\000\000\001\213\311\005\320\254\355\000\005sr\000Corg.apache.beam.sdk.values.ValueWithRecordId$B\022\000LCoder{\343\376bQ\014\204>\002\000\002L\000\007i\t\025\034t\000+Lorg/\t\\\000/\001\\\024/sdk/c\0012(s/ByteArray\005B\014;L\000\n\005u\005\016\010t\000\"n;\000\005$\020;xr\000*N\274\000\t`(.Structured\005/8s\277\022\016\325\3246\021\002\000\000xr\000 j9\000\005/\034C\335\325\211\256\274~\370\001/\020psr\000)j1\0006\312\000\034\351\277\005|\263\3746\333\001:\010r\000&j8\000\024Atomic\005o\034\307\354\265\314\205tPF\0015 q\000~\000\003sr\000-N;\000$io.kafka.K\001\006\000R%\227\005B<I\320\251Y\032\341{#\002\000\001L\000\007kv\005\025\010t\000$nH\001\000K\t&\000;\025s\000\"Ns\000-P\r- j\000\275\271\035\243\3126\002!\353\010\010ke)\277\001\264\000\0022\303\001\005\022\025Y\000(jY\000\030Nullabl)\372\034E\333\0336>\220\247\007\005\307]\022.O\000\001\014,\006sq\000~\000\016q\000~\000\020"
      >
    >
  >
  coders: <
    key: "SFxsDJAmHRVarIntCoder"
    value: <
      spec: <
        urn: "beam:coders:javasdk:0.1"
        payload: "\202SNAPPY\000\000\000\000\001\000\000\000\001\000\000\000\210\330\001\350\254\355\000\005sr\000&org.apache.beam.sdk.coders.VarIntCoder\300K2\332\251KVh\002\000\000xrr5\000\024Atomic\0055 \307\354\265\314\205tPF\002\0055\000*jj\000$Structured\0059\034s\277\022\016\325\3246\021\t9\000 j9\000\005/0C\335\325\211\256\274~\370\002\000\000xp"
      >
    >
  >
  coders: <
    key: "SFxsDJAmHRVoidCoder"
    value: <
      spec: <
        urn: "beam:coders:javasdk:0.1"
        payload: "\202SNAPPY\000\000\000\000\001\000\000\000\001\000\000\000\210\326\001\350\254\355\000\005sr\000$org.apache.beam.sdk.coders.VoidCoder\271\277U\233\350\r\257U\002\000\000xr\000&j3\000\024Atomic\0055 \307\354\265\314\205tPF\002\0055\000*j5\000$Structured\0059\034s\277\022\016\325\3246\021\t9\000 j9\000\005/0C\335\325\211\256\274~\370\002\000\000xp"
      >
    >
  >
  coders: <
    key: "c0"
    value: <
      spec: <
        urn: "beam:coder:bytes:v1"
      >
    >
  >
  coders: <
    key: "c1"
    value: <
      spec: <
        urn: "beam:coder:global_window:v1"
      >
    >
  >
  coders: <
    key: "c2"
    value: <
      spec: <
        urn: "beam:go:coder:custom:v1"
        payload: "Cgd2YXJpbnR6EgIIAhpdCklnaXRodWIuY29tL2FwYWNoZS9iZWFtL3Nka3MvdjIvZ28vcGtnL2JlYW0vY29yZS9ydW50aW1lL2NvZGVyeC5lbmNWYXJJbnRaEhAIFiIECBlADyoGCBQSAggIImkKSWdpdGh1Yi5jb20vYXBhY2hlL2JlYW0vc2Rrcy92Mi9nby9wa2cvYmVhbS9jb3JlL3J1bnRpbWUvY29kZXJ4LmRlY1ZhckludFoSHAgWIgQIGUADIgYIFBICCAgqBAgZQA8qBAgZQAE="
      >
    >
  >
  coders: <
    key: "c3"
    value: <
      spec: <
        urn: "beam:coder:length_prefix:v1"
      >
      component_coder_ids: "c2"
    >
  >
  coders: <
    key: "c4"
    value: <
      spec: <
        urn: "beam:coder:kv:v1"
      >
      component_coder_ids: "c0"
      component_coder_ids: "c0"
    >
  >
  environments: <
    key: "SFxsDJAmHRbeam:env:docker:v1"
    value: <
      urn: "beam:env:docker:v1"
      payload: "\n apache/beam_java8_sdk:2.42.0.dev"
      capabilities: "beam:coder:bytes:v1"
      capabilities: "beam:coder:bool:v1"
      capabilities: "beam:coder:varint:v1"
      capabilities: "beam:coder:string_utf8:v1"
      capabilities: "beam:coder:iterable:v1"
      capabilities: "beam:coder:timer:v1"
      capabilities: "beam:coder:kv:v1"
      capabilities: "beam:coder:length_prefix:v1"
      capabilities: "beam:coder:global_window:v1"
      capabilities: "beam:coder:interval_window:v1"
      capabilities: "beam:coder:custom_window:v1"
      capabilities: "beam:coder:windowed_value:v1"
      capabilities: "beam:coder:double:v1"
      capabilities: "beam:coder:row:v1"
      capabilities: "beam:coder:param_windowed_value:v1"
      capabilities: "beam:coder:state_backed_iterable:v1"
      capabilities: "beam:coder:sharded_key:v1"
      capabilities: "beam:coder:nullable:v1"
      capabilities: "beam:protocol:multi_core_bundle_processing:v1"
      capabilities: "beam:protocol:progress_reporting:v1"
      capabilities: "beam:protocol:harness_monitoring_infos:v1"
      capabilities: "beam:protocol:control_request_elements_embedding:v1"
      capabilities: "beam:protocol:state_caching:v1"
      capabilities: "beam:version:sdk_base:apache/beam_java8_sdk:2.42.0.dev"
      capabilities: "beam:transform:sdf_truncate_sized_restrictions:v1"
      capabilities: "beam:transform:to_string:v1"
      dependencies: <
        type_urn: "beam:artifact:type:file:v1"
        type_payload: "\nL/tmp/artifacts/icedtea-sound-CGRxIE9edPHnbxQhM-L5mp8h21H-ySB79uQtSquPV_Q.jar\022@086471204f5e74f1e76f142133e2f99a9f21db51fec9207bf6e42d4aab8f57f4"
        role_urn: "beam:artifact:role:staging_to:v1"
        role_payload: "\n=icedtea-sound-CGRxIE9edPHnbxQhM-L5mp8h21H-ySB79uQtSquPV_Q.jar"
      >
      dependencies: <
        type_urn: "beam:artifact:type:file:v1"
        type_payload: "\nF/tmp/artifacts/jaccess-FBI0Bb27lF3oEBieWAi7SP8X1zBR8k4BJQOVpsoK9a0.jar\022@14123405bdbb945de810189e5808bb48ff17d73051f24e01250395a6ca0af5ad"
        role_urn: "beam:artifact:role:staging_to:v1"
        role_payload: "\n7jaccess-FBI0Bb27lF3oEBieWAi7SP8X1zBR8k4BJQOVpsoK9a0.jar"
      >
      dependencies: <
        type_urn: "beam:artifact:type:file:v1"
        type_payload: "\nI/tmp/artifacts/localedata-kJ2mc8rBH5-IklhfR1XzNotlIQ_mnVMA-pgaXv2r8Ag.jar\022@909da673cac11f9f8892585f4755f3368b65210fe69d5300fa981a5efdabf008"
        role_urn: "beam:artifact:role:staging_to:v1"
        role_payload: "\n:localedata-kJ2mc8rBH5-IklhfR1XzNotlIQ_mnVMA-pgaXv2r8Ag.jar"
      >
      dependencies: <
        type_urn: "beam:artifact:type:file:v1"
        type_payload: "\nF/tmp/artifacts/nashorn-B0CAb3QpJET_6VsT3hcC_89VtvhV616H8N2bHAIaqWo.jar\022@0740806f74292444ffe95b13de1702ffcf55b6f855eb5e87f0dd9b1c021aa96a"
        role_urn: "beam:artifact:role:staging_to:v1"
        role_payload: "\n7nashorn-B0CAb3QpJET_6VsT3hcC_89VtvhV616H8N2bHAIaqWo.jar"
      >
      dependencies: <
        type_urn: "beam:artifact:type:file:v1"
        type_payload: "\nG/tmp/artifacts/cldrdata-gclqV9lOGqQOKesG-a6TAUTGEYlyIDqpyd4M_k7gtWo.jar\022@81c96a57d94e1aa40e29eb06f9ae930144c6118972203aa9c9de0cfe4ee0b56a"
        role_urn: "beam:artifact:role:staging_to:v1"
        role_payload: "\n8cldrdata-gclqV9lOGqQOKesG-a6TAUTGEYlyIDqpyd4M_k7gtWo.jar"
      >
      dependencies: <
        type_urn: "beam:artifact:type:file:v1"
        type_payload: "\nD/tmp/artifacts/dnsns-byzoQxdXengTvA5IlbH9gSIzfhNQElRYltuMJN0vjcc.jar\022@6f2ce84317577a7813bc0e4895b1fd8122337e135012545896db8c24dd2f8dc7"
        role_urn: "beam:artifact:role:staging_to:v1"
        role_payload: "\n5dnsns-byzoQxdXengTvA5IlbH9gSIzfhNQElRYltuMJN0vjcc.jar"
      >
      dependencies: <
        type_urn: "beam:artifact:type:file:v1"
        type_payload: "\nr/tmp/artifacts/beam-sdks-java-io-expansion-service-2.42.0-SNAPSHOT-vPQsvQdIaDq8qqRzich6d6PlQ_Cc7636Uu7-DimOLfs.jar\022@bcf42cbd0748683abcaaa47389c87a77a3e543f09cefadfa52eefe0e298e2dfb"
        role_urn: "beam:artifact:role:staging_to:v1"
        role_payload: "\ncbeam-sdks-java-io-expansion-service-2.42.0-SNAPSHOT-vPQsvQdIaDq8qqRzich6d6PlQ_Cc7636Uu7-DimOLfs.jar"
      >
    >
  >
  environments: <
    key: "go"
    value: <
      urn: "beam:env:docker:v1"
      payload: "\n\026apache/beam_go_sdk:dev"
      capabilities: "beam:protocol:progress_reporting:v1"
      capabilities: "beam:protocol:multi_core_bundle_processing:v1"
      capabilities: "beam:transform:sdf_truncate_sized_restrictions:v1"
      capabilities: "beam:protocol:worker_status:v1"
      capabilities: "beam:protocol:monitoring_info_short_ids:v1"
      capabilities: "beam:version:sdk_base:go"
      capabilities: "beam:coder:bytes:v1"
      capabilities: "beam:coder:bool:v1"
      capabilities: "beam:coder:varint:v1"
      capabilities: "beam:coder:double:v1"
      capabilities: "beam:coder:string_utf8:v1"
      capabilities: "beam:coder:length_prefix:v1"
      capabilities: "beam:coder:kv:v1"
      capabilities: "beam:coder:iterable:v1"
      capabilities: "beam:coder:state_backed_iterable:v1"
      capabilities: "beam:coder:windowed_value:v1"
      capabilities: "beam:coder:global_window:v1"
      capabilities: "beam:coder:interval_window:v1"
      capabilities: "beam:coder:row:v1"
      capabilities: "beam:coder:nullable:v1"
      dependencies: <
        type_urn: "beam:artifact:type:file:v1"
        role_urn: "beam:artifact:role:go_worker_binary:v1"
      >
    >
  >
>
root_transform_ids: "s1"
root_transform_ids: "e4"
root_transform_ids: "e5"
root_transform_ids: "s3"
requirements: "beam:requirement:pardo:splittable_dofn:v1"
2022/09/06 14:39:47 Cross-compiling <https://ci-beam.apache.org/job/beam_PostCommit_XVR_Spark3/ws/src/sdks/go/test/integration/io/xlang/kafka/kafka_test.go> as /tmp/worker-2-1662475187738663652
2022/09/06 14:39:49 Prepared job with id: go-testkafkaio_basicreadwrite-57_01cae5db-fe75-45ab-94aa-e1ec28818861 and staging token: go-testkafkaio_basicreadwrite-57_01cae5db-fe75-45ab-94aa-e1ec28818861
2022/09/06 14:39:49 Staged binary artifact with token: 
2022/09/06 14:39:49 Submitted job: go0testkafkaio0basicreadwrite057-jenkins-0906143949-800d7e56_9bcb0d9c-3df7-4c11-aba5-b2b169b074c8
2022/09/06 14:39:49 Job state: STOPPED
2022/09/06 14:39:49 Job state: STARTING
2022/09/06 14:39:49 Job state: RUNNING
2022/09/06 14:40:34 Job state: DONE
2022/09/06 14:40:34 Warning: 6 errors during metrics processing: [failed to deduce Step from MonitoringInfo: urn:"beam:metric:element_count:v1" type:"beam:metrics:sum_int64:v1" payload:"\x01" labels:{key:"PCOLLECTION" value:"SFxsDJAmHRExternal/KafkaIO.Read/KafkaIO.Read.ReadFromKafkaViaUnbounded/Read(KafkaUnboundedSource)/Create/Read(CreateSource)/ParDo(OutputSingleSource)/ParMultiDo(OutputSingleSource).output/SplitAndSize0"} failed to deduce Step from MonitoringInfo: urn:"beam:metric:element_count:v1" type:"beam:metrics:sum_int64:v1" payload:"\x01" labels:{key:"PCOLLECTION" value:"SFxsDJAmHRExternal/KafkaIO.Read/KafkaIO.Read.ReadFromKafkaViaUnbounded/Read(KafkaUnboundedSource)/Create/Read(CreateSource)/ParDo(OutputSingleSource)/ParMultiDo(OutputSingleSource).output/PairWithRestriction0"} failed to deduce Step from MonitoringInfo: urn:"beam:metric:sampled_byte_size:v1" type:"beam:metrics:distribution_int64:v1" payload:"\x01\xf0\"\xf0\"\xf0\"" labels:{key:"PCOLLECTION" value:"SFxsDJAmHRExternal/KafkaIO.Read/KafkaIO.Read.ReadFromKafkaViaUnbounded/Read(KafkaUnboundedSource)/Create/Read(CreateSource)/ParDo(OutputSingleSource)/ParMultiDo(OutputSingleSource).output/PairWithRestriction0"} failed to deduce Step from MonitoringInfo: urn:"beam:metric:sampled_byte_size:v1" type:"beam:metrics:distribution_int64:v1" payload:"\x01\xf8\"\xf8\"\xf8\"" labels:{key:"PCOLLECTION" value:"SFxsDJAmHRExternal/KafkaIO.Read/KafkaIO.Read.ReadFromKafkaViaUnbounded/Read(KafkaUnboundedSource)/Create/Read(CreateSource)/ParDo(OutputSingleSource)/ParMultiDo(OutputSingleSource).output/SplitAndSize0"} failed to deduce Step from MonitoringInfo: urn:"beam:metric:element_count:v1" type:"beam:metrics:sum_int64:v1" payload:"\x01" labels:{key:"PCOLLECTION" value:"SFxsDJAmHRExternal/KafkaIO.Read/KafkaIO.Read.ReadFromKafkaViaUnbounded/Read(KafkaUnboundedSource)/Create/Read(CreateSource)/ParDo(OutputSingleSource)/ParMultiDo(OutputSingleSource).output/SplitAndSize0"} failed to deduce Step from MonitoringInfo: urn:"beam:metric:sampled_byte_size:v1" type:"beam:metrics:distribution_int64:v1" payload:"\x01\xfd\"\xfd\"\xfd\"" labels:{key:"PCOLLECTION" value:"SFxsDJAmHRExternal/KafkaIO.Read/KafkaIO.Read.ReadFromKafkaViaUnbounded/Read(KafkaUnboundedSource)/Create/Read(CreateSource)/ParDo(OutputSingleSource)/ParMultiDo(OutputSingleSource).output/SplitAndSize0"}]
--- PASS: TestKafkaIO_BasicReadWrite (65.27s)
PASS
ok  	github.com/apache/beam/sdks/v2/go/test/integration/io/xlang/kafka	71.309s

> Task :runners:spark:3:job-server:validatesCrossLanguageRunnerJavaUsingPython

org.apache.beam.sdk.extensions.python.transforms.RunInferenceTransformTest > testRunInferenceWithKVs FAILED
    java.lang.IllegalStateException at RunInferenceTransformTest.java:108
    java.lang.NullPointerException at Preconditions.java:980

org.apache.beam.sdk.extensions.python.transforms.RunInferenceTransformTest > testRunInference FAILED
    java.lang.IllegalStateException at RunInferenceTransformTest.java:60
    java.lang.NullPointerException at Preconditions.java:980

16 tests completed, 2 failed, 2 skipped

> Task :runners:spark:3:job-server:validatesCrossLanguageRunnerJavaUsingPython FAILED
> Task :runners:spark:3:job-server:validatesCrossLanguageRunnerPythonUsingJava
> Task :runners:spark:3:job-server:validatesCrossLanguageRunnerPythonUsingSql
> Task :runners:spark:3:job-server:validatesCrossLanguageRunnerCleanup
> Task :runners:spark:3:job-server:sparkJobServerCleanup

FAILURE: Build failed with an exception.

* What went wrong:
Execution failed for task ':runners:spark:3:job-server:validatesCrossLanguageRunnerJavaUsingPython'.
> There were failing tests. See the report at: file://<https://ci-beam.apache.org/job/beam_PostCommit_XVR_Spark3/ws/src/runners/spark/3/job-server/build/reports/tests/validatesCrossLanguageRunnerJavaUsingPython/index.html>

* Try:
> Run with --stacktrace option to get the stack trace.
> Run with --info or --debug option to get more log output.
> Run with --scan to get full insights.

* Get more help at https://help.gradle.org

Deprecated Gradle features were used in this build, making it incompatible with Gradle 8.0.

You can use '--warning-mode all' to show the individual deprecation warnings and determine if they come from your own scripts or plugins.

See https://docs.gradle.org/7.4/userguide/command_line_interface.html#sec:command_line_warnings

Execution optimizations have been disabled for 1 invalid unit(s) of work during this build to ensure correctness.
Please consult deprecation warnings for more details.

BUILD FAILED in 34m 43s
263 actionable tasks: 188 executed, 63 from cache, 12 up-to-date

Publishing build scan...
https://gradle.com/s/v45e2qmeaiwqq

Build step 'Invoke Gradle script' changed build result to FAILURE
Build step 'Invoke Gradle script' marked build as failure

---------------------------------------------------------------------
To unsubscribe, e-mail: builds-unsubscribe@beam.apache.org
For additional commands, e-mail: builds-help@beam.apache.org