You are viewing a plain text version of this content. The canonical link for it is here.
Posted to common-dev@hadoop.apache.org by Apache Jenkins Server <je...@builds.apache.org> on 2016/05/25 14:14:16 UTC

Build failed in Jenkins: Hadoop-common-trunk-Java8 #1541

See <https://builds.apache.org/job/Hadoop-common-trunk-Java8/1541/changes>

Changes:

[junping_du] YARN-5131. Distributed shell AM fails when extra container arrives

[vvasudev] YARN-857. Localization failures should be available in container

[vvasudev] YARN-5115. Avoid setting CONTENT-DISPOSITION header in the

------------------------------------------
[...truncated 5356 lines...]
Tests run: 17, Failures: 0, Errors: 0, Skipped: 0, Time elapsed: 3.765 sec - in org.apache.hadoop.net.unix.TestDomainSocket
Tests run: 5, Failures: 0, Errors: 0, Skipped: 0, Time elapsed: 1.815 sec - in org.apache.hadoop.net.TestSwitchMapping
Tests run: 8, Failures: 0, Errors: 0, Skipped: 0, Time elapsed: 2.465 sec - in org.apache.hadoop.net.TestStaticMapping
Tests run: 1, Failures: 0, Errors: 0, Skipped: 0, Time elapsed: 2.309 sec - in org.apache.hadoop.cli.TestCLI
Running org.apache.hadoop.io.TestSortedMapWritable
Running org.apache.hadoop.io.TestIOUtils
Running org.apache.hadoop.io.TestSequenceFile
Tests run: 4, Failures: 0, Errors: 0, Skipped: 0, Time elapsed: 0.82 sec - in org.apache.hadoop.io.TestSortedMapWritable
Tests run: 12, Failures: 0, Errors: 0, Skipped: 0, Time elapsed: 1.244 sec - in org.apache.hadoop.io.TestIOUtils
Running org.apache.hadoop.io.TestEnumSetWritable
Running org.apache.hadoop.io.TestWritableName
Tests run: 4, Failures: 0, Errors: 0, Skipped: 0, Time elapsed: 0.79 sec - in org.apache.hadoop.io.TestWritableName
Running org.apache.hadoop.io.TestBoundedByteArrayOutputStream
Tests run: 2, Failures: 0, Errors: 0, Skipped: 0, Time elapsed: 0.16 sec - in org.apache.hadoop.io.TestBoundedByteArrayOutputStream
Tests run: 6, Failures: 0, Errors: 0, Skipped: 0, Time elapsed: 1.449 sec - in org.apache.hadoop.io.TestEnumSetWritable
Running org.apache.hadoop.io.TestSequenceFileAppend
Running org.apache.hadoop.io.TestBytesWritable
Tests run: 6, Failures: 0, Errors: 0, Skipped: 0, Time elapsed: 0.602 sec - in org.apache.hadoop.io.TestBytesWritable
Running org.apache.hadoop.io.TestSequenceFileSerialization
Running org.apache.hadoop.io.TestDataByteBuffers
Tests run: 5, Failures: 0, Errors: 0, Skipped: 0, Time elapsed: 0.802 sec - in org.apache.hadoop.io.TestDataByteBuffers
Tests run: 5, Failures: 0, Errors: 0, Skipped: 0, Time elapsed: 3.287 sec - in org.apache.hadoop.io.TestSequenceFileAppend
Tests run: 1, Failures: 0, Errors: 0, Skipped: 0, Time elapsed: 2.512 sec - in org.apache.hadoop.io.TestSequenceFileSerialization
Running org.apache.hadoop.io.file.tfile.TestTFileComparators
Running org.apache.hadoop.io.file.tfile.TestTFileSeek
Running org.apache.hadoop.io.file.tfile.TestTFileLzoCodecsByteArrays
Tests run: 3, Failures: 0, Errors: 0, Skipped: 0, Time elapsed: 2.228 sec - in org.apache.hadoop.io.file.tfile.TestTFileComparators
Tests run: 25, Failures: 0, Errors: 0, Skipped: 0, Time elapsed: 1.156 sec - in org.apache.hadoop.io.file.tfile.TestTFileLzoCodecsByteArrays
Running org.apache.hadoop.io.file.tfile.TestTFileLzoCodecsStreams
Running org.apache.hadoop.io.file.tfile.TestTFileUnsortedByteArrays
Tests run: 19, Failures: 0, Errors: 0, Skipped: 0, Time elapsed: 0.887 sec - in org.apache.hadoop.io.file.tfile.TestTFileLzoCodecsStreams
Running org.apache.hadoop.io.file.tfile.TestTFileStreams
Tests run: 4, Failures: 0, Errors: 0, Skipped: 0, Time elapsed: 2.363 sec - in org.apache.hadoop.io.file.tfile.TestTFileUnsortedByteArrays
Running org.apache.hadoop.io.file.tfile.TestTFile
Tests run: 1, Failures: 0, Errors: 0, Skipped: 0, Time elapsed: 7.568 sec - in org.apache.hadoop.io.file.tfile.TestTFileSeek
Tests run: 19, Failures: 0, Errors: 0, Skipped: 0, Time elapsed: 4.882 sec - in org.apache.hadoop.io.file.tfile.TestTFileStreams
Tests run: 3, Failures: 0, Errors: 0, Skipped: 0, Time elapsed: 3.232 sec - in org.apache.hadoop.io.file.tfile.TestTFile
Running org.apache.hadoop.io.file.tfile.TestTFileNoneCodecsJClassComparatorByteArrays
Running org.apache.hadoop.io.file.tfile.TestTFileJClassComparatorByteArrays
Running org.apache.hadoop.io.file.tfile.TestCompression
Tests run: 1, Failures: 0, Errors: 0, Skipped: 0, Time elapsed: 1.097 sec - in org.apache.hadoop.io.file.tfile.TestCompression
Running org.apache.hadoop.io.file.tfile.TestTFileNoneCodecsStreams
Tests run: 25, Failures: 0, Errors: 0, Skipped: 0, Time elapsed: 3.522 sec - in org.apache.hadoop.io.file.tfile.TestTFileNoneCodecsJClassComparatorByteArrays
Running org.apache.hadoop.io.file.tfile.TestTFileSplit
Tests run: 9, Failures: 0, Errors: 0, Skipped: 0, Time elapsed: 21.205 sec - in org.apache.hadoop.io.TestSequenceFile
Running org.apache.hadoop.io.file.tfile.TestTFileComparator2
Tests run: 25, Failures: 0, Errors: 0, Skipped: 0, Time elapsed: 6.103 sec - in org.apache.hadoop.io.file.tfile.TestTFileJClassComparatorByteArrays
Running org.apache.hadoop.io.file.tfile.TestTFileNoneCodecsByteArrays
Tests run: 19, Failures: 0, Errors: 0, Skipped: 0, Time elapsed: 5.177 sec - in org.apache.hadoop.io.file.tfile.TestTFileNoneCodecsStreams
Running org.apache.hadoop.io.file.tfile.TestTFileByteArrays
Tests run: 1, Failures: 0, Errors: 0, Skipped: 0, Time elapsed: 3.875 sec - in org.apache.hadoop.io.file.tfile.TestTFileComparator2
Running org.apache.hadoop.io.file.tfile.TestTFileSeqFileComparison
Tests run: 25, Failures: 0, Errors: 0, Skipped: 0, Time elapsed: 4.554 sec - in org.apache.hadoop.io.file.tfile.TestTFileNoneCodecsByteArrays
Running org.apache.hadoop.io.file.tfile.TestVLong
Tests run: 1, Failures: 0, Errors: 0, Skipped: 0, Time elapsed: 10.86 sec - in org.apache.hadoop.io.file.tfile.TestTFileSplit
Tests run: 25, Failures: 0, Errors: 0, Skipped: 0, Time elapsed: 6.674 sec - in org.apache.hadoop.io.file.tfile.TestTFileByteArrays
Running org.apache.hadoop.io.TestTextNonUTF8
Running org.apache.hadoop.io.TestArrayWritable
Tests run: 1, Failures: 0, Errors: 0, Skipped: 0, Time elapsed: 0.532 sec - in org.apache.hadoop.io.TestTextNonUTF8
Tests run: 4, Failures: 0, Errors: 0, Skipped: 0, Time elapsed: 0.476 sec - in org.apache.hadoop.io.TestArrayWritable
Tests run: 9, Failures: 0, Errors: 0, Skipped: 0, Time elapsed: 3.969 sec - in org.apache.hadoop.io.file.tfile.TestVLong
Running org.apache.hadoop.io.erasurecode.rawcoder.TestXORRawCoder
Running org.apache.hadoop.io.erasurecode.rawcoder.TestRSRawCoderLegacy
Running org.apache.hadoop.io.erasurecode.rawcoder.TestDummyRawCoder
Tests run: 6, Failures: 0, Errors: 0, Skipped: 0, Time elapsed: 0.857 sec - in org.apache.hadoop.io.erasurecode.rawcoder.TestXORRawCoder
Tests run: 3, Failures: 0, Errors: 0, Skipped: 0, Time elapsed: 0.334 sec - in org.apache.hadoop.io.erasurecode.rawcoder.TestDummyRawCoder
Running org.apache.hadoop.io.erasurecode.rawcoder.TestRSRawCoder
Tests run: 16, Failures: 0, Errors: 0, Skipped: 0, Time elapsed: 1.8 sec - in org.apache.hadoop.io.erasurecode.rawcoder.TestRSRawCoderLegacy
Running org.apache.hadoop.io.erasurecode.TestECSchema
Tests run: 1, Failures: 0, Errors: 0, Skipped: 0, Time elapsed: 0.235 sec - in org.apache.hadoop.io.erasurecode.TestECSchema
Running org.apache.hadoop.io.erasurecode.TestCodecRawCoderMapping
Tests run: 1, Failures: 0, Errors: 0, Skipped: 0, Time elapsed: 9.785 sec - in org.apache.hadoop.io.file.tfile.TestTFileSeqFileComparison
Tests run: 16, Failures: 0, Errors: 0, Skipped: 0, Time elapsed: 1.287 sec - in org.apache.hadoop.io.erasurecode.rawcoder.TestRSRawCoder
Running org.apache.hadoop.io.erasurecode.coder.TestHHXORErasureCoder
Running org.apache.hadoop.io.erasurecode.coder.TestXORCoder
Running org.apache.hadoop.io.erasurecode.coder.TestRSErasureCoder
Tests run: 2, Failures: 0, Errors: 0, Skipped: 0, Time elapsed: 1 sec - in org.apache.hadoop.io.erasurecode.TestCodecRawCoderMapping
Running org.apache.hadoop.io.TestMapWritable
Tests run: 5, Failures: 0, Errors: 0, Skipped: 0, Time elapsed: 0.424 sec - in org.apache.hadoop.io.TestMapWritable
Tests run: 2, Failures: 0, Errors: 0, Skipped: 0, Time elapsed: 1.231 sec - in org.apache.hadoop.io.erasurecode.coder.TestXORCoder
Running org.apache.hadoop.io.TestText
Running org.apache.hadoop.io.TestBooleanWritable
Tests run: 2, Failures: 0, Errors: 0, Skipped: 0, Time elapsed: 0.287 sec - in org.apache.hadoop.io.TestBooleanWritable
Tests run: 9, Failures: 0, Errors: 0, Skipped: 0, Time elapsed: 2.389 sec - in org.apache.hadoop.io.erasurecode.coder.TestHHXORErasureCoder
Tests run: 10, Failures: 0, Errors: 0, Skipped: 0, Time elapsed: 2.091 sec - in org.apache.hadoop.io.erasurecode.coder.TestRSErasureCoder
Running org.apache.hadoop.io.compress.zlib.TestZlibCompressorDecompressor
Tests run: 18, Failures: 0, Errors: 0, Skipped: 0, Time elapsed: 1.171 sec - in org.apache.hadoop.io.TestText
Running org.apache.hadoop.io.compress.lz4.TestLz4CompressorDecompressor
Running org.apache.hadoop.io.compress.TestCompressionStreamReuse
Running org.apache.hadoop.io.compress.TestCodecFactory
Tests run: 13, Failures: 0, Errors: 0, Skipped: 0, Time elapsed: 0.684 sec - in org.apache.hadoop.io.compress.lz4.TestLz4CompressorDecompressor
Running org.apache.hadoop.io.compress.TestCodec
Tests run: 10, Failures: 0, Errors: 0, Skipped: 0, Time elapsed: 1.517 sec - in org.apache.hadoop.io.compress.zlib.TestZlibCompressorDecompressor
Tests run: 1, Failures: 0, Errors: 0, Skipped: 0, Time elapsed: 0.766 sec - in org.apache.hadoop.io.compress.TestCodecFactory
Running org.apache.hadoop.io.compress.bzip2.TestBzip2CompressorDecompressor
Running org.apache.hadoop.io.compress.TestCompressorDecompressor
Tests run: 2, Failures: 0, Errors: 0, Skipped: 2, Time elapsed: 0.629 sec - in org.apache.hadoop.io.compress.bzip2.TestBzip2CompressorDecompressor
Tests run: 2, Failures: 0, Errors: 0, Skipped: 0, Time elapsed: 0.938 sec - in org.apache.hadoop.io.compress.TestCompressorDecompressor
Running org.apache.hadoop.io.compress.TestCodecPool
Running org.apache.hadoop.io.compress.snappy.TestSnappyCompressorDecompressor
Tests run: 6, Failures: 0, Errors: 0, Skipped: 0, Time elapsed: 0.626 sec - in org.apache.hadoop.io.compress.TestCodecPool
Tests run: 14, Failures: 0, Errors: 0, Skipped: 0, Time elapsed: 0.6 sec - in org.apache.hadoop.io.compress.snappy.TestSnappyCompressorDecompressor
Running org.apache.hadoop.io.compress.TestDecompressorStream
Tests run: 3, Failures: 0, Errors: 0, Skipped: 0, Time elapsed: 0.109 sec - in org.apache.hadoop.io.compress.TestDecompressorStream
Running org.apache.hadoop.io.compress.TestBlockDecompressorStream
Tests run: 2, Failures: 0, Errors: 0, Skipped: 0, Time elapsed: 0.109 sec - in org.apache.hadoop.io.compress.TestBlockDecompressorStream
Running org.apache.hadoop.io.compress.TestCompressorStream
Tests run: 1, Failures: 0, Errors: 0, Skipped: 0, Time elapsed: 0.259 sec - in org.apache.hadoop.io.compress.TestCompressorStream
Running org.apache.hadoop.io.TestMD5Hash
Running org.apache.hadoop.io.TestSecureIOUtils
Tests run: 2, Failures: 0, Errors: 0, Skipped: 0, Time elapsed: 0.357 sec - in org.apache.hadoop.io.TestMD5Hash
Running org.apache.hadoop.io.TestMapFile
Tests run: 3, Failures: 0, Errors: 0, Skipped: 0, Time elapsed: 6.267 sec - in org.apache.hadoop.io.compress.TestCompressionStreamReuse
Tests run: 4, Failures: 0, Errors: 0, Skipped: 0, Time elapsed: 1.201 sec - in org.apache.hadoop.io.TestSecureIOUtils
Running org.apache.hadoop.io.TestGenericWritable
Running org.apache.hadoop.io.nativeio.TestNativeIO
Tests run: 5, Failures: 0, Errors: 0, Skipped: 0, Time elapsed: 0.788 sec - in org.apache.hadoop.io.TestGenericWritable
Tests run: 21, Failures: 0, Errors: 0, Skipped: 0, Time elapsed: 2.169 sec - in org.apache.hadoop.io.TestMapFile
Running org.apache.hadoop.io.nativeio.TestSharedFileDescriptorFactory
Running org.apache.hadoop.io.TestDefaultStringifier
Tests run: 3, Failures: 0, Errors: 0, Skipped: 0, Time elapsed: 0.673 sec - in org.apache.hadoop.io.nativeio.TestSharedFileDescriptorFactory
Tests run: 4, Failures: 0, Errors: 0, Skipped: 0, Time elapsed: 0.802 sec - in org.apache.hadoop.io.TestDefaultStringifier
Running org.apache.hadoop.io.TestArrayPrimitiveWritable
Tests run: 3, Failures: 0, Errors: 0, Skipped: 0, Time elapsed: 0.709 sec - in org.apache.hadoop.io.TestArrayPrimitiveWritable
Running org.apache.hadoop.io.TestUTF8
Running org.apache.hadoop.io.TestBloomMapFile
Tests run: 8, Failures: 0, Errors: 0, Skipped: 0, Time elapsed: 2.064 sec - in org.apache.hadoop.io.TestUTF8
Running org.apache.hadoop.io.retry.TestRetryProxy
Tests run: 7, Failures: 0, Errors: 0, Skipped: 0, Time elapsed: 3.009 sec - in org.apache.hadoop.io.TestBloomMapFile
Tests run: 12, Failures: 0, Errors: 0, Skipped: 0, Time elapsed: 1.658 sec - in org.apache.hadoop.io.retry.TestRetryProxy
Running org.apache.hadoop.io.retry.TestDefaultRetryPolicy
Running org.apache.hadoop.io.retry.TestFailoverProxy
Tests run: 3, Failures: 0, Errors: 0, Skipped: 0, Time elapsed: 0.663 sec - in org.apache.hadoop.io.retry.TestDefaultRetryPolicy
Tests run: 20, Failures: 0, Errors: 0, Skipped: 0, Time elapsed: 8.219 sec - in org.apache.hadoop.io.nativeio.TestNativeIO
Running org.apache.hadoop.io.TestVersionedWritable
Running org.apache.hadoop.io.TestObjectWritableProtos
Tests run: 3, Failures: 0, Errors: 0, Skipped: 0, Time elapsed: 0.252 sec - in org.apache.hadoop.io.TestVersionedWritable
Tests run: 3, Failures: 0, Errors: 0, Skipped: 0, Time elapsed: 0.445 sec - in org.apache.hadoop.io.TestObjectWritableProtos
Running org.apache.hadoop.io.TestSequenceFileSync
Running org.apache.hadoop.io.serializer.TestSerializationFactory
Tests run: 5, Failures: 0, Errors: 0, Skipped: 0, Time elapsed: 0.653 sec - in org.apache.hadoop.io.serializer.TestSerializationFactory
Tests run: 1, Failures: 0, Errors: 0, Skipped: 0, Time elapsed: 1.191 sec - in org.apache.hadoop.io.TestSequenceFileSync
Running org.apache.hadoop.io.serializer.avro.TestAvroSerialization
Running org.apache.hadoop.io.serializer.TestWritableSerialization
Tests run: 3, Failures: 0, Errors: 0, Skipped: 0, Time elapsed: 0.852 sec - in org.apache.hadoop.io.serializer.TestWritableSerialization
Tests run: 5, Failures: 0, Errors: 0, Skipped: 0, Time elapsed: 1.123 sec - in org.apache.hadoop.io.serializer.avro.TestAvroSerialization
Running org.apache.hadoop.io.TestWritable
Running org.apache.hadoop.io.TestWritableUtils
Tests run: 1, Failures: 0, Errors: 0, Skipped: 0, Time elapsed: 0.164 sec - in org.apache.hadoop.io.TestWritableUtils
Tests run: 6, Failures: 0, Errors: 0, Skipped: 0, Time elapsed: 0.327 sec - in org.apache.hadoop.io.TestWritable
Running org.apache.hadoop.io.TestArrayFile
Running org.apache.hadoop.io.TestSetFile
Tests run: 2, Failures: 0, Errors: 0, Skipped: 0, Time elapsed: 2.655 sec - in org.apache.hadoop.io.TestSetFile
Tests run: 3, Failures: 0, Errors: 0, Skipped: 0, Time elapsed: 3.77 sec - in org.apache.hadoop.io.TestArrayFile
Tests run: 9, Failures: 0, Errors: 0, Skipped: 0, Time elapsed: 10.645 sec - in org.apache.hadoop.io.retry.TestFailoverProxy
Tests run: 25, Failures: 0, Errors: 0, Skipped: 0, Time elapsed: 112.988 sec - in org.apache.hadoop.io.compress.TestCodec

Results :

Failed tests: 
  TestGangliaMetrics.testGangliaMetrics2:139->checkMetrics:161 Missing metrics: test.s1rec.Xxx

Tests in error: 
  TestZKFailoverController.testGracefulFailover:438 » ServiceFailed Unable to be...
  TestZKFailoverController.testGracefulFailoverMultipleZKfcs:582 » ServiceFailed

Tests run: 3399, Failures: 1, Errors: 2, Skipped: 86

[INFO]                                                                         
[INFO] ------------------------------------------------------------------------
[INFO] Skipping Apache Hadoop NFS
[INFO] This project has been banned from the build due to previous failures.
[INFO] ------------------------------------------------------------------------
[INFO]                                                                         
[INFO] ------------------------------------------------------------------------
[INFO] Skipping Apache Hadoop KMS
[INFO] This project has been banned from the build due to previous failures.
[INFO] ------------------------------------------------------------------------
[INFO]                                                                         
[INFO] ------------------------------------------------------------------------
[INFO] Building Apache Hadoop Common Project 3.0.0-alpha1-SNAPSHOT
[INFO] ------------------------------------------------------------------------
[INFO] 
[INFO] --- maven-clean-plugin:2.5:clean (default-clean) @ hadoop-common-project ---
[INFO] Deleting <https://builds.apache.org/job/Hadoop-common-trunk-Java8/ws/source/hadoop-common-project/target>
[INFO] 
[INFO] --- maven-antrun-plugin:1.7:run (create-testdirs) @ hadoop-common-project ---
[INFO] Executing tasks

main:
    [mkdir] Created dir: <https://builds.apache.org/job/Hadoop-common-trunk-Java8/ws/source/hadoop-common-project/target/test-dir>
[INFO] Executed tasks
[INFO] 
[INFO] --- maven-source-plugin:2.3:jar-no-fork (hadoop-java-sources) @ hadoop-common-project ---
[INFO] 
[INFO] --- maven-source-plugin:2.3:test-jar-no-fork (hadoop-java-sources) @ hadoop-common-project ---
[INFO] 
[INFO] --- maven-enforcer-plugin:1.3.1:enforce (dist-enforce) @ hadoop-common-project ---
[INFO] 
[INFO] --- maven-site-plugin:3.5:attach-descriptor (attach-descriptor) @ hadoop-common-project ---
[INFO] 
[INFO] --- maven-javadoc-plugin:2.8.1:jar (module-javadocs) @ hadoop-common-project ---
[INFO] Not executing Javadoc as the project is not a Java classpath-capable package
[INFO] 
[INFO] --- maven-enforcer-plugin:1.3.1:enforce (depcheck) @ hadoop-common-project ---
[INFO] 
[INFO] --- maven-checkstyle-plugin:2.15:checkstyle (default-cli) @ hadoop-common-project ---
[INFO] 
[INFO] --- findbugs-maven-plugin:3.0.0:findbugs (default-cli) @ hadoop-common-project ---
[INFO] ------------------------------------------------------------------------
[INFO] Reactor Summary:
[INFO] 
[INFO] Apache Hadoop Annotations .......................... SUCCESS [ 20.097 s]
[INFO] Apache Hadoop MiniKDC .............................. SUCCESS [ 30.511 s]
[INFO] Apache Hadoop Auth ................................. SUCCESS [04:19 min]
[INFO] Apache Hadoop Auth Examples ........................ SUCCESS [ 12.821 s]
[INFO] Apache Hadoop Common ............................... FAILURE [10:07 min]
[INFO] Apache Hadoop NFS .................................. SKIPPED
[INFO] Apache Hadoop KMS .................................. SKIPPED
[INFO] Apache Hadoop Common Project ....................... SUCCESS [  0.075 s]
[INFO] ------------------------------------------------------------------------
[INFO] BUILD FAILURE
[INFO] ------------------------------------------------------------------------
[INFO] Total time: 15:32 min
[INFO] Finished at: 2016-05-25T14:14:05+00:00
[INFO] Final Memory: 99M/2370M
[INFO] ------------------------------------------------------------------------
[ERROR] Failed to execute goal org.apache.maven.plugins:maven-surefire-plugin:2.17:test (default-test) on project hadoop-common: There are test failures.
[ERROR] 
[ERROR] Please refer to <https://builds.apache.org/job/Hadoop-common-trunk-Java8/ws/source/hadoop-common-project/hadoop-common/target/surefire-reports> for the individual test results.
[ERROR] -> [Help 1]
[ERROR] 
[ERROR] To see the full stack trace of the errors, re-run Maven with the -e switch.
[ERROR] Re-run Maven using the -X switch to enable full debug logging.
[ERROR] 
[ERROR] For more information about the errors and possible solutions, please read the following articles:
[ERROR] [Help 1] http://cwiki.apache.org/confluence/display/MAVEN/MojoFailureException
[ERROR] 
[ERROR] After correcting the problems, you can resume the build with the command
[ERROR]   mvn <goals> -rf :hadoop-common
Build step 'Execute shell' marked build as failure
Archiving artifacts
Setting LATEST1_8_HOME=/home/jenkins/jenkins-slave/tools/hudson.model.JDK/latest1.8
Setting MAVEN_3_3_3_HOME=/home/jenkins/jenkins-slave/tools/hudson.tasks.Maven_MavenInstallation/maven-3.3.3
Recording test results
Setting LATEST1_8_HOME=/home/jenkins/jenkins-slave/tools/hudson.model.JDK/latest1.8
Setting MAVEN_3_3_3_HOME=/home/jenkins/jenkins-slave/tools/hudson.tasks.Maven_MavenInstallation/maven-3.3.3
Setting LATEST1_8_HOME=/home/jenkins/jenkins-slave/tools/hudson.model.JDK/latest1.8
Setting MAVEN_3_3_3_HOME=/home/jenkins/jenkins-slave/tools/hudson.tasks.Maven_MavenInstallation/maven-3.3.3

---------------------------------------------------------------------
To unsubscribe, e-mail: common-dev-unsubscribe@hadoop.apache.org
For additional commands, e-mail: common-dev-help@hadoop.apache.org


Jenkins build is back to normal : Hadoop-common-trunk-Java8 #1543

Posted by Apache Jenkins Server <je...@builds.apache.org>.
See <https://builds.apache.org/job/Hadoop-common-trunk-Java8/1543/changes>


---------------------------------------------------------------------
To unsubscribe, e-mail: common-dev-unsubscribe@hadoop.apache.org
For additional commands, e-mail: common-dev-help@hadoop.apache.org


Build failed in Jenkins: Hadoop-common-trunk-Java8 #1542

Posted by Apache Jenkins Server <je...@builds.apache.org>.
See <https://builds.apache.org/job/Hadoop-common-trunk-Java8/1542/changes>

Changes:

[rkanter] YARN-4766. NM should not aggregate logs older than the retention policy

[kasha] YARN-3344. Fix warning - procfs stat file is not in the expected format.

------------------------------------------
[...truncated 4056 lines...]
-------------------------------------------------------
 T E S T S
-------------------------------------------------------
Running org.apache.hadoop.minikdc.TestMiniKdc
Tests run: 3, Failures: 0, Errors: 0, Skipped: 0, Time elapsed: 7.6 sec - in org.apache.hadoop.minikdc.TestMiniKdc
Running org.apache.hadoop.minikdc.TestChangeOrgNameAndDomain
Tests run: 3, Failures: 0, Errors: 0, Skipped: 0, Time elapsed: 7.239 sec - in org.apache.hadoop.minikdc.TestChangeOrgNameAndDomain

Results :

Tests run: 6, Failures: 0, Errors: 0, Skipped: 0

[INFO] 
[INFO] --- maven-jar-plugin:2.5:jar (default-jar) @ hadoop-minikdc ---
[INFO] Building jar: <https://builds.apache.org/job/Hadoop-common-trunk-Java8/ws/source/hadoop-common-project/hadoop-minikdc/target/hadoop-minikdc-3.0.0-alpha1-SNAPSHOT.jar>
[INFO] 
[INFO] --- maven-source-plugin:2.3:jar-no-fork (hadoop-java-sources) @ hadoop-minikdc ---
[INFO] Building jar: <https://builds.apache.org/job/Hadoop-common-trunk-Java8/ws/source/hadoop-common-project/hadoop-minikdc/target/hadoop-minikdc-3.0.0-alpha1-SNAPSHOT-sources.jar>
[INFO] 
[INFO] --- maven-source-plugin:2.3:test-jar-no-fork (hadoop-java-sources) @ hadoop-minikdc ---
[INFO] Building jar: <https://builds.apache.org/job/Hadoop-common-trunk-Java8/ws/source/hadoop-common-project/hadoop-minikdc/target/hadoop-minikdc-3.0.0-alpha1-SNAPSHOT-test-sources.jar>
[INFO] 
[INFO] --- maven-enforcer-plugin:1.3.1:enforce (dist-enforce) @ hadoop-minikdc ---
[INFO] 
[INFO] --- maven-site-plugin:3.5:attach-descriptor (attach-descriptor) @ hadoop-minikdc ---
[INFO] 
[INFO] --- maven-javadoc-plugin:2.8.1:jar (module-javadocs) @ hadoop-minikdc ---
[INFO] 
Loading source files for package org.apache.hadoop.minikdc...
Constructing Javadoc information...
Standard Doclet version 1.8.0_74
Building tree for all the packages and classes...
Generating <https://builds.apache.org/job/Hadoop-common-trunk-Java8/ws/source/hadoop-common-project/hadoop-minikdc/target/org/apache/hadoop/minikdc/KerberosSecurityTestcase.html...>
Generating <https://builds.apache.org/job/Hadoop-common-trunk-Java8/ws/source/hadoop-common-project/hadoop-minikdc/target/org/apache/hadoop/minikdc/MiniKdc.html...>
Generating <https://builds.apache.org/job/Hadoop-common-trunk-Java8/ws/source/hadoop-common-project/hadoop-minikdc/target/org/apache/hadoop/minikdc/package-frame.html...>
Generating <https://builds.apache.org/job/Hadoop-common-trunk-Java8/ws/source/hadoop-common-project/hadoop-minikdc/target/org/apache/hadoop/minikdc/package-summary.html...>
Generating <https://builds.apache.org/job/Hadoop-common-trunk-Java8/ws/source/hadoop-common-project/hadoop-minikdc/target/org/apache/hadoop/minikdc/package-tree.html...>
Generating <https://builds.apache.org/job/Hadoop-common-trunk-Java8/ws/source/hadoop-common-project/hadoop-minikdc/target/constant-values.html...>
Generating <https://builds.apache.org/job/Hadoop-common-trunk-Java8/ws/source/hadoop-common-project/hadoop-minikdc/target/org/apache/hadoop/minikdc/class-use/MiniKdc.html...>
Generating <https://builds.apache.org/job/Hadoop-common-trunk-Java8/ws/source/hadoop-common-project/hadoop-minikdc/target/org/apache/hadoop/minikdc/class-use/KerberosSecurityTestcase.html...>
Generating <https://builds.apache.org/job/Hadoop-common-trunk-Java8/ws/source/hadoop-common-project/hadoop-minikdc/target/org/apache/hadoop/minikdc/package-use.html...>
Building index for all the packages and classes...
Generating <https://builds.apache.org/job/Hadoop-common-trunk-Java8/ws/source/hadoop-common-project/hadoop-minikdc/target/overview-tree.html...>
Generating <https://builds.apache.org/job/Hadoop-common-trunk-Java8/ws/source/hadoop-common-project/hadoop-minikdc/target/index-all.html...>
Generating <https://builds.apache.org/job/Hadoop-common-trunk-Java8/ws/source/hadoop-common-project/hadoop-minikdc/target/deprecated-list.html...>
Building index for all classes...
Generating <https://builds.apache.org/job/Hadoop-common-trunk-Java8/ws/source/hadoop-common-project/hadoop-minikdc/target/allclasses-frame.html...>
Generating <https://builds.apache.org/job/Hadoop-common-trunk-Java8/ws/source/hadoop-common-project/hadoop-minikdc/target/allclasses-noframe.html...>
Generating <https://builds.apache.org/job/Hadoop-common-trunk-Java8/ws/source/hadoop-common-project/hadoop-minikdc/target/index.html...>
Generating <https://builds.apache.org/job/Hadoop-common-trunk-Java8/ws/source/hadoop-common-project/hadoop-minikdc/target/help-doc.html...>
[INFO] Building jar: <https://builds.apache.org/job/Hadoop-common-trunk-Java8/ws/source/hadoop-common-project/hadoop-minikdc/target/hadoop-minikdc-3.0.0-alpha1-SNAPSHOT-javadoc.jar>
[INFO] 
[INFO] --- maven-enforcer-plugin:1.3.1:enforce (depcheck) @ hadoop-minikdc ---
[INFO] 
[INFO] --- maven-checkstyle-plugin:2.15:checkstyle (default-cli) @ hadoop-minikdc ---
[INFO] There are 13 errors reported by Checkstyle 6.6 with checkstyle/checkstyle.xml ruleset.
[WARNING] Unable to locate Source XRef to link to - DISABLED
[INFO] 
[INFO] --- findbugs-maven-plugin:3.0.0:findbugs (default-cli) @ hadoop-minikdc ---
[INFO] Fork Value is true
[INFO] Done FindBugs Analysis....
[INFO]                                                                         
[INFO] ------------------------------------------------------------------------
[INFO] Building Apache Hadoop Auth 3.0.0-alpha1-SNAPSHOT
[INFO] ------------------------------------------------------------------------
[INFO] 
[INFO] --- maven-clean-plugin:2.5:clean (default-clean) @ hadoop-auth ---
[INFO] Deleting <https://builds.apache.org/job/Hadoop-common-trunk-Java8/ws/source/hadoop-common-project/hadoop-auth/target>
[INFO] 
[INFO] --- maven-antrun-plugin:1.7:run (create-testdirs) @ hadoop-auth ---
[INFO] Executing tasks

main:
    [mkdir] Created dir: <https://builds.apache.org/job/Hadoop-common-trunk-Java8/ws/source/hadoop-common-project/hadoop-auth/target/test-dir>
[INFO] Executed tasks
[INFO] 
[INFO] --- maven-resources-plugin:2.6:resources (default-resources) @ hadoop-auth ---
[INFO] Using 'UTF-8' encoding to copy filtered resources.
[INFO] skip non existing resourceDirectory <https://builds.apache.org/job/Hadoop-common-trunk-Java8/ws/source/hadoop-common-project/hadoop-auth/src/main/resources>
[INFO] 
[INFO] --- maven-compiler-plugin:3.1:compile (default-compile) @ hadoop-auth ---
[INFO] Compiling 25 source files to <https://builds.apache.org/job/Hadoop-common-trunk-Java8/ws/source/hadoop-common-project/hadoop-auth/target/classes>
[INFO] 
[INFO] --- maven-resources-plugin:2.6:testResources (default-testResources) @ hadoop-auth ---
[INFO] Using 'UTF-8' encoding to copy filtered resources.
[INFO] skip non existing resourceDirectory <https://builds.apache.org/job/Hadoop-common-trunk-Java8/ws/source/hadoop-common-project/hadoop-auth/src/test/resources>
[INFO] 
[INFO] --- maven-compiler-plugin:3.1:testCompile (default-testCompile) @ hadoop-auth ---
[INFO] Compiling 24 source files to <https://builds.apache.org/job/Hadoop-common-trunk-Java8/ws/source/hadoop-common-project/hadoop-auth/target/test-classes>
[WARNING] <https://builds.apache.org/job/Hadoop-common-trunk-Java8/ws/source/hadoop-common-project/hadoop-auth/src/test/java/org/apache/hadoop/security/authentication/client/AuthenticatorTestCase.java>: <https://builds.apache.org/job/Hadoop-common-trunk-Java8/ws/source/hadoop-common-project/hadoop-auth/src/test/java/org/apache/hadoop/security/authentication/client/AuthenticatorTestCase.java> uses or overrides a deprecated API.
[WARNING] <https://builds.apache.org/job/Hadoop-common-trunk-Java8/ws/source/hadoop-common-project/hadoop-auth/src/test/java/org/apache/hadoop/security/authentication/client/AuthenticatorTestCase.java>: Recompile with -Xlint:deprecation for details.
[INFO] 
[INFO] --- maven-surefire-plugin:2.17:test (default-test) @ hadoop-auth ---
[INFO] Surefire report directory: <https://builds.apache.org/job/Hadoop-common-trunk-Java8/ws/source/hadoop-common-project/hadoop-auth/target/surefire-reports>

-------------------------------------------------------
 T E S T S
-------------------------------------------------------

-------------------------------------------------------
 T E S T S
-------------------------------------------------------
Running org.apache.hadoop.security.authentication.util.TestZKSignerSecretProvider
Tests run: 3, Failures: 1, Errors: 0, Skipped: 0, Time elapsed: 15.961 sec <<< FAILURE! - in org.apache.hadoop.security.authentication.util.TestZKSignerSecretProvider
testMultipleInit(org.apache.hadoop.security.authentication.util.TestZKSignerSecretProvider)  Time elapsed: 3.093 sec  <<< FAILURE!
java.lang.AssertionError: expected null, but was:<[B...@3a93b025>
	at org.junit.Assert.fail(Assert.java:88)
	at org.junit.Assert.failNotNull(Assert.java:664)
	at org.junit.Assert.assertNull(Assert.java:646)
	at org.junit.Assert.assertNull(Assert.java:656)
	at org.apache.hadoop.security.authentication.util.TestZKSignerSecretProvider.testMultipleInit(TestZKSignerSecretProvider.java:149)

Running org.apache.hadoop.security.authentication.util.TestSigner
Tests run: 6, Failures: 0, Errors: 0, Skipped: 0, Time elapsed: 0.102 sec - in org.apache.hadoop.security.authentication.util.TestSigner
Running org.apache.hadoop.security.authentication.util.TestStringSignerSecretProvider
Tests run: 1, Failures: 0, Errors: 0, Skipped: 0, Time elapsed: 0.059 sec - in org.apache.hadoop.security.authentication.util.TestStringSignerSecretProvider
Running org.apache.hadoop.security.authentication.util.TestCertificateUtil
Tests run: 3, Failures: 0, Errors: 0, Skipped: 0, Time elapsed: 0.094 sec - in org.apache.hadoop.security.authentication.util.TestCertificateUtil
Running org.apache.hadoop.security.authentication.util.TestRandomSignerSecretProvider
Tests run: 1, Failures: 0, Errors: 0, Skipped: 0, Time elapsed: 51.173 sec - in org.apache.hadoop.security.authentication.util.TestRandomSignerSecretProvider
Running org.apache.hadoop.security.authentication.util.TestRolloverSignerSecretProvider
Tests run: 1, Failures: 0, Errors: 0, Skipped: 0, Time elapsed: 51.165 sec - in org.apache.hadoop.security.authentication.util.TestRolloverSignerSecretProvider
Running org.apache.hadoop.security.authentication.util.TestKerberosName
Tests run: 3, Failures: 0, Errors: 0, Skipped: 0, Time elapsed: 0.223 sec - in org.apache.hadoop.security.authentication.util.TestKerberosName
Running org.apache.hadoop.security.authentication.util.TestKerberosUtil
Tests run: 5, Failures: 0, Errors: 0, Skipped: 0, Time elapsed: 0.392 sec - in org.apache.hadoop.security.authentication.util.TestKerberosUtil
Running org.apache.hadoop.security.authentication.util.TestJaasConfiguration
Tests run: 1, Failures: 0, Errors: 0, Skipped: 0, Time elapsed: 0.064 sec - in org.apache.hadoop.security.authentication.util.TestJaasConfiguration
Running org.apache.hadoop.security.authentication.util.TestFileSignerSecretProvider
Tests run: 1, Failures: 0, Errors: 0, Skipped: 0, Time elapsed: 0.073 sec - in org.apache.hadoop.security.authentication.util.TestFileSignerSecretProvider
Running org.apache.hadoop.security.authentication.util.TestAuthToken
Tests run: 4, Failures: 0, Errors: 0, Skipped: 0, Time elapsed: 0.237 sec - in org.apache.hadoop.security.authentication.util.TestAuthToken
Running org.apache.hadoop.security.authentication.server.TestPseudoAuthenticationHandler
Tests run: 6, Failures: 0, Errors: 0, Skipped: 0, Time elapsed: 0.306 sec - in org.apache.hadoop.security.authentication.server.TestPseudoAuthenticationHandler
Running org.apache.hadoop.security.authentication.server.TestJWTRedirectAuthentictionHandler
Tests run: 12, Failures: 0, Errors: 0, Skipped: 0, Time elapsed: 30.083 sec - in org.apache.hadoop.security.authentication.server.TestJWTRedirectAuthentictionHandler
Running org.apache.hadoop.security.authentication.server.TestAltKerberosAuthenticationHandler
Tests run: 9, Failures: 0, Errors: 0, Skipped: 0, Time elapsed: 15.79 sec - in org.apache.hadoop.security.authentication.server.TestAltKerberosAuthenticationHandler
Running org.apache.hadoop.security.authentication.server.TestAuthenticationToken
Tests run: 1, Failures: 0, Errors: 0, Skipped: 0, Time elapsed: 0.069 sec - in org.apache.hadoop.security.authentication.server.TestAuthenticationToken
Running org.apache.hadoop.security.authentication.server.TestAuthenticationFilter
Tests run: 26, Failures: 0, Errors: 0, Skipped: 0, Time elapsed: 0.604 sec - in org.apache.hadoop.security.authentication.server.TestAuthenticationFilter
Running org.apache.hadoop.security.authentication.server.TestKerberosAuthenticationHandler
Tests run: 6, Failures: 0, Errors: 0, Skipped: 0, Time elapsed: 11.174 sec - in org.apache.hadoop.security.authentication.server.TestKerberosAuthenticationHandler
Running org.apache.hadoop.security.authentication.client.TestAuthenticatedURL
Tests run: 6, Failures: 0, Errors: 0, Skipped: 0, Time elapsed: 0.298 sec - in org.apache.hadoop.security.authentication.client.TestAuthenticatedURL
Running org.apache.hadoop.security.authentication.client.TestKerberosAuthenticator
Tests run: 14, Failures: 0, Errors: 0, Skipped: 0, Time elapsed: 24.132 sec - in org.apache.hadoop.security.authentication.client.TestKerberosAuthenticator
Running org.apache.hadoop.security.authentication.client.TestPseudoAuthenticator
Tests run: 7, Failures: 0, Errors: 0, Skipped: 0, Time elapsed: 1.04 sec - in org.apache.hadoop.security.authentication.client.TestPseudoAuthenticator

Results :

Failed tests: 
  TestZKSignerSecretProvider.testMultipleInit:149 expected null, but was:<[B...@3a93b025>

Tests run: 116, Failures: 1, Errors: 0, Skipped: 0

[INFO]                                                                         
[INFO] ------------------------------------------------------------------------
[INFO] Skipping Apache Hadoop Auth Examples
[INFO] This project has been banned from the build due to previous failures.
[INFO] ------------------------------------------------------------------------
[INFO]                                                                         
[INFO] ------------------------------------------------------------------------
[INFO] Skipping Apache Hadoop Common
[INFO] This project has been banned from the build due to previous failures.
[INFO] ------------------------------------------------------------------------
[INFO]                                                                         
[INFO] ------------------------------------------------------------------------
[INFO] Skipping Apache Hadoop NFS
[INFO] This project has been banned from the build due to previous failures.
[INFO] ------------------------------------------------------------------------
[INFO]                                                                         
[INFO] ------------------------------------------------------------------------
[INFO] Skipping Apache Hadoop KMS
[INFO] This project has been banned from the build due to previous failures.
[INFO] ------------------------------------------------------------------------
[INFO]                                                                         
[INFO] ------------------------------------------------------------------------
[INFO] Building Apache Hadoop Common Project 3.0.0-alpha1-SNAPSHOT
[INFO] ------------------------------------------------------------------------
[INFO] 
[INFO] --- maven-clean-plugin:2.5:clean (default-clean) @ hadoop-common-project ---
[INFO] Deleting <https://builds.apache.org/job/Hadoop-common-trunk-Java8/ws/source/hadoop-common-project/target>
[INFO] 
[INFO] --- maven-antrun-plugin:1.7:run (create-testdirs) @ hadoop-common-project ---
[INFO] Executing tasks

main:
    [mkdir] Created dir: <https://builds.apache.org/job/Hadoop-common-trunk-Java8/ws/source/hadoop-common-project/target/test-dir>
[INFO] Executed tasks
[INFO] 
[INFO] --- maven-source-plugin:2.3:jar-no-fork (hadoop-java-sources) @ hadoop-common-project ---
[INFO] 
[INFO] --- maven-source-plugin:2.3:test-jar-no-fork (hadoop-java-sources) @ hadoop-common-project ---
[INFO] 
[INFO] --- maven-enforcer-plugin:1.3.1:enforce (dist-enforce) @ hadoop-common-project ---
[INFO] 
[INFO] --- maven-site-plugin:3.5:attach-descriptor (attach-descriptor) @ hadoop-common-project ---
[INFO] 
[INFO] --- maven-javadoc-plugin:2.8.1:jar (module-javadocs) @ hadoop-common-project ---
[INFO] Not executing Javadoc as the project is not a Java classpath-capable package
[INFO] 
[INFO] --- maven-enforcer-plugin:1.3.1:enforce (depcheck) @ hadoop-common-project ---
[INFO] 
[INFO] --- maven-checkstyle-plugin:2.15:checkstyle (default-cli) @ hadoop-common-project ---
[INFO] 
[INFO] --- findbugs-maven-plugin:3.0.0:findbugs (default-cli) @ hadoop-common-project ---
[INFO] ------------------------------------------------------------------------
[INFO] Reactor Summary:
[INFO] 
[INFO] Apache Hadoop Annotations .......................... SUCCESS [ 16.027 s]
[INFO] Apache Hadoop MiniKDC .............................. SUCCESS [ 29.494 s]
[INFO] Apache Hadoop Auth ................................. FAILURE [03:30 min]
[INFO] Apache Hadoop Auth Examples ........................ SKIPPED
[INFO] Apache Hadoop Common ............................... SKIPPED
[INFO] Apache Hadoop NFS .................................. SKIPPED
[INFO] Apache Hadoop KMS .................................. SKIPPED
[INFO] Apache Hadoop Common Project ....................... SUCCESS [  0.130 s]
[INFO] ------------------------------------------------------------------------
[INFO] BUILD FAILURE
[INFO] ------------------------------------------------------------------------
[INFO] Total time: 04:19 min
[INFO] Finished at: 2016-05-25T18:03:17+00:00
[INFO] Final Memory: 74M/1178M
[INFO] ------------------------------------------------------------------------
[ERROR] Failed to execute goal org.apache.maven.plugins:maven-surefire-plugin:2.17:test (default-test) on project hadoop-auth: There are test failures.
[ERROR] 
[ERROR] Please refer to <https://builds.apache.org/job/Hadoop-common-trunk-Java8/ws/source/hadoop-common-project/hadoop-auth/target/surefire-reports> for the individual test results.
[ERROR] -> [Help 1]
[ERROR] 
[ERROR] To see the full stack trace of the errors, re-run Maven with the -e switch.
[ERROR] Re-run Maven using the -X switch to enable full debug logging.
[ERROR] 
[ERROR] For more information about the errors and possible solutions, please read the following articles:
[ERROR] [Help 1] http://cwiki.apache.org/confluence/display/MAVEN/MojoFailureException
[ERROR] 
[ERROR] After correcting the problems, you can resume the build with the command
[ERROR]   mvn <goals> -rf :hadoop-auth
Build step 'Execute shell' marked build as failure
Archiving artifacts
Setting LATEST1_8_HOME=/home/jenkins/jenkins-slave/tools/hudson.model.JDK/latest1.8
Setting MAVEN_3_3_3_HOME=/home/jenkins/jenkins-slave/tools/hudson.tasks.Maven_MavenInstallation/maven-3.3.3
Recording test results
Setting LATEST1_8_HOME=/home/jenkins/jenkins-slave/tools/hudson.model.JDK/latest1.8
Setting MAVEN_3_3_3_HOME=/home/jenkins/jenkins-slave/tools/hudson.tasks.Maven_MavenInstallation/maven-3.3.3
Setting LATEST1_8_HOME=/home/jenkins/jenkins-slave/tools/hudson.model.JDK/latest1.8
Setting MAVEN_3_3_3_HOME=/home/jenkins/jenkins-slave/tools/hudson.tasks.Maven_MavenInstallation/maven-3.3.3

---------------------------------------------------------------------
To unsubscribe, e-mail: common-dev-unsubscribe@hadoop.apache.org
For additional commands, e-mail: common-dev-help@hadoop.apache.org