You are viewing a plain text version of this content. The canonical link for it is here.
Posted to dev@aurora.apache.org by Apache Jenkins Server <je...@builds.apache.org> on 2018/07/26 00:44:48 UTC
Build failed in Jenkins: aurora-packaging-nightly #1071
See <https://builds.apache.org/job/aurora-packaging-nightly/1071/display/redirect>
------------------------------------------
[...truncated 13.56 MB...]
| `-- react-is@16.4.1
+-- sass.js@0.10.10
+-- sassjs-loader@1.0.0
| +-- q@1.5.1
| `-- q-io@1.13.6
| +-- es6-set@0.1.5
| | +-- d@1.0.0
| | +-- es5-ext@0.10.45
| | | `-- next-tick@1.0.0
| | +-- es6-iterator@2.0.3
| | +-- es6-symbol@3.1.1
| | `-- event-emitter@0.3.5
| +-- mimeparse@0.1.4
| +-- qs@1.2.2
| `-- url2@0.0.0
+-- style-loader@0.18.2
| `-- schema-utils@0.3.0
+-- url-loader@0.6.2
| +-- mime@1.6.0
| `-- schema-utils@0.3.0
`-- webpack@2.7.0
+-- acorn@5.7.1
+-- acorn-dynamic-import@2.0.2
| `-- acorn@4.0.13
+-- ajv@4.11.8
+-- ajv-keywords@1.5.1
+-- async@2.6.1
+-- enhanced-resolve@3.4.1
+-- interpret@1.1.0
+-- json-loader@0.5.7
+-- loader-runner@2.3.0
+-- loader-utils@0.2.17
+-- memory-fs@0.4.1
+-- node-libs-browser@2.1.0
| +-- assert@1.4.1
| | `-- util@0.10.3
| | `-- inherits@2.0.1
| +-- browserify-zlib@0.2.0
| | `-- pako@1.0.6
| +-- buffer@4.9.1
| | +-- base64-js@1.3.0
| | +-- ieee754@1.1.12
| | `-- isarray@1.0.0
| +-- console-browserify@1.1.0
| | `-- date-now@0.1.4
| +-- constants-browserify@1.0.0
| +-- crypto-browserify@3.12.0
| | +-- browserify-cipher@1.0.1
| | | +-- browserify-aes@1.2.0
| | | | `-- buffer-xor@1.0.3
| | | +-- browserify-des@1.0.2
| | | | `-- des.js@1.0.0
| | | `-- evp_bytestokey@1.0.3
| | +-- browserify-sign@4.0.4
| | | +-- bn.js@4.11.8
| | | +-- browserify-rsa@4.0.1
| | | +-- elliptic@6.4.0
| | | | +-- brorand@1.1.0
| | | | +-- hash.js@1.1.5
| | | | +-- hmac-drbg@1.0.1
| | | | +-- minimalistic-assert@1.0.1
| | | | `-- minimalistic-crypto-utils@1.0.1
| | | `-- parse-asn1@5.1.1
| | | `-- asn1.js@4.10.1
| | +-- create-ecdh@4.0.3
| | +-- create-hash@1.2.0
| | | +-- cipher-base@1.0.4
| | | +-- md5.js@1.3.4
| | | | `-- hash-base@3.0.4
| | | +-- ripemd160@2.0.2
| | | `-- sha.js@2.4.11
| | +-- create-hmac@1.1.7
| | +-- diffie-hellman@5.0.3
| | | `-- miller-rabin@4.0.1
| | +-- pbkdf2@3.0.16
| | +-- public-encrypt@4.0.2
| | +-- randombytes@2.0.6
| | `-- randomfill@1.0.4
| +-- domain-browser@1.2.0
| +-- events@1.1.1
| +-- https-browserify@1.0.0
| +-- os-browserify@0.3.0
| +-- path-browserify@0.0.0
| +-- process@0.11.10
| +-- punycode@1.4.1
| +-- querystring-es3@0.2.1
| +-- stream-browserify@2.0.1
| +-- stream-http@2.8.3
| | +-- builtin-status-codes@3.0.0
| | +-- to-arraybuffer@1.0.1
| | `-- xtend@4.0.1
| +-- string_decoder@1.1.1
| +-- timers-browserify@2.0.10
| +-- tty-browserify@0.0.0
| +-- url@0.11.0
| | +-- punycode@1.3.2
| | `-- querystring@0.2.0
| +-- util@0.10.4
| `-- vm-browserify@0.0.4
| `-- indexof@0.0.1
+-- supports-color@3.2.3
| `-- has-flag@1.0.0
+-- tapable@0.2.8
+-- uglify-js@2.8.29
| +-- uglify-to-browserify@1.0.2
| `-- yargs@3.10.0
| +-- camelcase@1.2.1
| +-- cliui@2.1.0
| | +-- center-align@0.1.3
| | | +-- align-text@0.1.4
| | | | +-- kind-of@3.2.2
| | | | `-- longest@1.0.1
| | | `-- lazy-cache@1.0.4
| | +-- right-align@0.1.3
| | `-- wordwrap@0.0.2
| `-- window-size@0.1.0
+-- watchpack@1.6.0
| +-- chokidar@2.0.4
| | +-- async-each@1.0.1
| | +-- braces@2.3.2
| | | +-- extend-shallow@2.0.1
| | | +-- fill-range@4.0.0
| | | | +-- extend-shallow@2.0.1
| | | | +-- is-number@3.0.0
| | | | | `-- kind-of@3.2.2
| | | | `-- to-regex-range@2.1.1
| | | +-- isobject@3.0.1
| | | +-- snapdragon-node@2.1.1
| | | | +-- define-property@1.0.0
| | | | | `-- is-descriptor@1.0.2
| | | | | +-- is-accessor-descriptor@1.0.0
| | | | | `-- is-data-descriptor@1.0.0
| | | | `-- snapdragon-util@3.0.1
| | | | `-- kind-of@3.2.2
| | | `-- split-string@3.1.0
| | +-- glob-parent@3.1.0
| | | +-- is-glob@3.1.0
| | | `-- path-dirname@1.0.2
| | +-- is-binary-path@1.0.1
| | | `-- binary-extensions@1.11.0
| | +-- is-glob@4.0.0
| | | `-- is-extglob@2.1.1
| | +-- lodash.debounce@4.0.8
| | +-- readdirp@2.1.0
| | | `-- set-immediate-shim@1.0.1
| | `-- upath@1.1.0
| `-- neo-async@2.5.1
+-- webpack-sources@1.1.0
| `-- source-map@0.6.1
`-- yargs@6.6.0
+-- camelcase@3.0.0
+-- cliui@3.2.0
+-- os-locale@1.4.0
+-- read-pkg-up@1.0.1
| +-- find-up@1.1.2
| | `-- path-exists@2.1.0
| `-- read-pkg@1.1.0
| +-- load-json-file@1.1.0
| | `-- strip-bom@2.0.0
| | `-- is-utf8@0.2.1
| `-- path-type@1.1.0
+-- string-width@1.0.2
| +-- code-point-at@1.1.0
| `-- is-fullwidth-code-point@1.0.0
| `-- number-is-nan@1.0.1
+-- which-module@1.0.0
`-- yargs-parser@4.2.1
<=========----> 71% EXECUTING [4m 26s]> maven-license-plugin-1.10.b1.jar> closure-compiler-v20131014.jar> jopt-simple-4.6.jar> maven-model-3.0.1.jar<=========----> 71% EXECUTING [4m 26s]> maven-license-plugin-1.10.b1.jar> closure-compiler-v20131014.jar> jopt-simple-4.6.jar> maven-model-3.0.1.jar<=========----> 71% EXECUTING [4m 26s]> maven-license-plugin-1.10.b1.jar> closure-compiler-v20131014.jar> jopt-simple-4.6.jar> maven-model-3.0.1.jar<=========----> 71% EXECUTING [4m 26s]> maven-license-plugin-1.10.b1.jar> closure-compiler-v20131014.jar> jopt-simple-4.6.jar> maven-model-3.0.1.jar<=========----> 71% EXECUTING [4m 27s]> maven-license-plugin-1.10.b1.jar> closure-compiler-v20131014.jar> jopt-simple-4.6.jar> maven-model-3.0.1.jar<=========----> 71% EXECUTING [4m 27s]> maven-license-plugin-1.10.b1.jar> closure-compiler-v20131014.jar> jopt-simple-4.6.jar> maven-model-3.0.1.jar<=========----> 71% EXECUTING [4m 27s]> maven-license-plugin-1.10.b1.jar> closure-compiler-v20131014.jar> jopt-simple-4.6.jar> maven-model-3.0.1.jar<=========----> 71% EXECUTING [4m 27s]> maven-license-plugin-1.10.b1.jar> closure-compiler-v20131014.jar> jopt-simple-4.6.jar> maven-model-3.0.1.jar<=========----> 71% EXECUTING [4m 27s]> maven-license-plugin-1.10.b1.jar> closure-compiler-v20131014.jar> jopt-simple-4.6.jar> maven-model-3.0.1.jar<=========----> 71% EXECUTING [4m 27s]> maven-license-plugin-1.10.b1.jar> closure-compiler-v20131014.jar> jopt-simple-4.6.jar> maven-model-3.0.1.jar<=========----> 71% EXECUTING [4m 27s]> maven-license-plugin-1.10.b1.jar> closure-compiler-v20131014.jar> jopt-simple-4.6.jar> maven-model-3.0.1.jar<=========----> 71% EXECUTING [4m 27s]> maven-license-plugin-1.10.b1.jar> closure-compiler-v20131014.jar> jopt-simple-4.6.jar> maven-model-3.0.1.jar<=========----> 71% EXECUTING [4m 27s]> maven-license-plugin-1.10.b1.jar> closure-compiler-v20131014.jar> jopt-simple-4.6.jar> maven-model-3.0.1.jar<=========----> 71% EXECUTING [4m 27s]> maven-license-plugin-1.10.b1.jar> closure-compiler-v20131014.jar> jopt-simple-4.6.jar> maven-model-3.0.1.jar<=========----> 71% EXECUTING [4m 28s]> maven-license-plugin-1.10.b1.jar> closure-compiler-v20131014.jar> jopt-simple-4.6.jar> maven-model-3.0.1.jar<=========----> 71% EXECUTING [4m 28s]> maven-license-plugin-1.10.b1.jar> closure-compiler-v20131014.jar> jopt-simple-4.6.jar> maven-model-3.0.1.jar<=========----> 71% EXECUTING [4m 28s]> maven-license-plugin-1.10.b1.jar> closure-compiler-v20131014.jar> jopt-simple-4.6.jar> maven-model-3.0.1.jar<=========----> 71% EXECUTING [4m 28s]> maven-license-plugin-1.10.b1.jar> closure-compiler-v20131014.jar> jopt-simple-4.6.jar> maven-model-3.0.1.jar<=========----> 71% EXECUTING [4m 28s]> maven-license-plugin-1.10.b1.jar> closure-compiler-v20131014.jar> jopt-simple-4.6.jar> maven-model-3.0.1.jar<=========----> 71% EXECUTING [4m 28s]> maven-license-plugin-1.10.b1.jar> closure-compiler-v20131014.jar> jopt-simple-4.6.jar> maven-model-3.0.1.jar<=========----> 71% EXECUTING [4m 28s]> maven-license-plugin-1.10.b1.jar> closure-compiler-v20131014.jar> jopt-simple-4.6.jar> maven-model-3.0.1.jar<=========----> 71% EXECUTING [4m 28s]> maven-license-plugin-1.10.b1.jar> closure-compiler-v20131014.jar> jopt-simple-4.6.jar> maven-model-3.0.1.jar<=========----> 71% EXECUTING [4m 28s]> maven-license-plugin-1.10.b1.jar> closure-compiler-v20131014.jar> jopt-simple-4.6.jar> maven-model-3.0.1.jar<=========----> 71% EXECUTING [4m 28s]> maven-license-plugin-1.10.b1.jar> closure-compiler-v20131014.jar> jopt-simple-4.6.jar> maven-model-3.0.1.jar<=========----> 71% EXECUTING [4m 29s]> maven-license-plugin-1.10.b1.jar> closure-compiler-v20131014.jar> jopt-simple-4.6.jar> maven-model-3.0.1.jar<=========----> 71% EXECUTING [4m 29s]> maven-license-plugin-1.10.b1.jar> closure-compiler-v20131014.jar> jopt-simple-4.6.jar> maven-model-3.0.1.jar<=========----> 71% EXECUTING [4m 29s]> maven-license-plugin-1.10.b1.jar> closure-compiler-v20131014.jar> jopt-simple-4.6.jar> maven-model-3.0.1.jar<=========----> 71% EXECUTING [4m 29s]> maven-license-plugin-1.10.b1.jar> closure-compiler-v20131014.jar> jopt-simple-4.6.jar> maven-model-3.0.1.jar<=========----> 71% EXECUTING [4m 29s]> maven-license-plugin-1.10.b1.jar> closure-compiler-v20131014.jar> jopt-simple-4.6.jar> maven-model-3.0.1.jar<=========----> 71% EXECUTING [4m 29s]> maven-license-plugin-1.10.b1.jar> closure-compiler-v20131014.jar> jopt-simple-4.6.jar> maven-model-3.0.1.jar<=========----> 71% EXECUTING [4m 29s]> maven-license-plugin-1.10.b1.jar> closure-compiler-v20131014.jar> jopt-simple-4.6.jar> maven-model-3.0.1.jar<=========----> 71% EXECUTING [4m 29s]> maven-license-plugin-1.10.b1.jar> closure-compiler-v20131014.jar> jopt-simple-4.6.jar> maven-model-3.0.1.jar<=========----> 71% EXECUTING [4m 29s]> maven-license-plugin-1.10.b1.jar> closure-compiler-v20131014.jar> jopt-simple-4.6.jar> maven-model-3.0.1.jar<=========----> 71% EXECUTING [4m 29s]> maven-license-plugin-1.10.b1.jar> closure-compiler-v20131014.jar> jopt-simple-4.6.jar> maven-model-3.0.1.jar<=========----> 71% EXECUTING [4m 30s]> maven-license-plugin-1.10.b1.jar> closure-compiler-v20131014.jar> jopt-simple-4.6.jar> maven-model-3.0.1.jar<=========----> 71% EXECUTING [4m 30s]> maven-license-plugin-1.10.b1.jar> closure-compiler-v20131014.jar> jopt-simple-4.6.jar> maven-model-3.0.1.jar<=========----> 71% EXECUTING [4m 30s]> maven-license-plugin-1.10.b1.jar> closure-compiler-v20131014.jar> jopt-simple-4.6.jar> maven-model-3.0.1.jar<=========----> 75% EXECUTING [4m 30s]> maven-license-plugin-1.10.b1.jar> closure-compiler-v20131014.jar> jopt-simple-4.6.jar> maven-model-3.0.1.jar<=========----> 75% EXECUTING [4m 30s]> maven-license-plugin-1.10.b1.jar> closure-compiler-v20131014.jar> jopt-simple-4.6.jar> maven-model-3.0.1.jar<=========----> 75% EXECUTING [4m 30s]> maven-license-plugin-1.10.b1.jar> closure-compiler-v20131014.jar> jopt-simple-4.6.jar> maven-model-3.0.1.jar<=========----> 75% EXECUTING [4m 30s]> maven-license-plugin-1.10.b1.jar> closure-compiler-v20131014.jar> jopt-simple-4.6.jar> maven-model-3.0.1.jar<=========----> 75% EXECUTING [4m 30s]> maven-license-plugin-1.10.b1.jar> closure-compiler-v20131014.jar> jopt-simple-4.6.jar> maven-model-3.0.1.jar<=========----> 75% EXECUTING [4m 30s]> maven-license-plugin-1.10.b1.jar> closure-compiler-v20131014.jar> jopt-simple-4.6.jar> maven-model-3.0.1.jar<=========----> 75% EXECUTING [4m 31s]> maven-license-plugin-1.10.b1.jar> closure-compiler-v20131014.jar> jopt-simple-4.6.jar> maven-model-3.0.1.jar<=========----> 75% EXECUTING [4m 31s]> maven-license-plugin-1.10.b1.jar> closure-compiler-v20131014.jar> jopt-simple-4.6.jar> maven-model-3.0.1.jar<=========----> 75% EXECUTING [4m 31s]> maven-license-plugin-1.10.b1.jar> closure-compiler-v20131014.jar> jopt-simple-4.6.jar> maven-model-3.0.1.jar<=========----> 75% EXECUTING [4m 31s]> maven-license-plugin-1.10.b1.jar> closure-compiler-v20131014.jar> jopt-simple-4.6.jar> maven-model-3.0.1.jar<=========----> 75% EXECUTING [4m 31s]> maven-license-plugin-1.10.b1.jar> closure-compiler-v20131014.jar> jopt-simple-4.6.jar> maven-model-3.0.1.jar<=========----> 75% EXECUTING [4m 31s]> maven-license-plugin-1.10.b1.jar> closure-compiler-v20131014.jar> jopt-simple-4.6.jar> maven-model-3.0.1.jar<=========----> 75% EXECUTING [4m 31s]> maven-license-plugin-1.10.b1.jar> closure-compiler-v20131014.jar> jopt-simple-4.6.jar> maven-model-3.0.1.jar<=========----> 75% EXECUTING [4m 31s]> maven-license-plugin-1.10.b1.jar> closure-compiler-v20131014.jar> jopt-simple-4.6.jar> maven-model-3.0.1.jar<=========----> 75% EXECUTING [4m 31s]> maven-license-plugin-1.10.b1.jar> closure-compiler-v20131014.jar> jopt-simple-4.6.jar> maven-model-3.0.1.jar<=========----> 75% EXECUTING [4m 31s]> maven-license-plugin-1.10.b1.jar> closure-compiler-v20131014.jar> jopt-simple-4.6.jar> maven-model-3.0.1.jar<=========----> 75% EXECUTING [4m 32s]> maven-license-plugin-1.10.b1.jar> closure-compiler-v20131014.jar> jopt-simple-4.6.jar> maven-model-3.0.1.jar<=========----> 75% EXECUTING [4m 32s]> maven-license-plugin-1.10.b1.jar> closure-compiler-v20131014.jar> jopt-simple-4.6.jar> maven-model-3.0.1.jar<=========----> 75% EXECUTING [4m 32s]> maven-license-plugin-1.10.b1.jar> closure-compiler-v20131014.jar> jopt-simple-4.6.jar> maven-model-3.0.1.jar<=========----> 75% EXECUTING [4m 32s]> maven-license-plugin-1.10.b1.jar> closure-compiler-v20131014.jar> jopt-simple-4.6.jar> maven-model-3.0.1.jar<=========----> 75% EXECUTING [4m 32s]> maven-license-plugin-1.10.b1.jar> closure-compiler-v20131014.jar> jopt-simple-4.6.jar> maven-model-3.0.1.jar<=========----> 75% EXECUTING [4m 32s]> maven-license-plugin-1.10.b1.jar> closure-compiler-v20131014.jar> jopt-simple-4.6.jar> maven-model-3.0.1.jar<=========----> 75% EXECUTING [4m 32s]> maven-license-plugin-1.10.b1.jar> closure-compiler-v20131014.jar> jopt-simple-4.6.jar> maven-model-3.0.1.jar<=========----> 75% EXECUTING [4m 32s]> maven-license-plugin-1.10.b1.jar> closure-compiler-v20131014.jar> jopt-simple-4.6.jar> maven-model-3.0.1.jar<=========----> 75% EXECUTING [4m 32s]> maven-license-plugin-1.10.b1.jar> closure-compiler-v20131014.jar> jopt-simple-4.6.jar> maven-model-3.0.1.jar<=========----> 75% EXECUTING [4m 32s]> maven-license-plugin-1.10.b1.jar> closure-compiler-v20131014.jar> jopt-simple-4.6.jar> maven-model-3.0.1.jar<=========----> 75% EXECUTING [4m 33s]> maven-license-plugin-1.10.b1.jar> closure-compiler-v20131014.jar> jopt-simple-4.6.jar> maven-model-3.0.1.jar<=========----> 75% EXECUTING [4m 33s]> maven-license-plugin-1.10.b1.jar> closure-compiler-v20131014.jar> jopt-simple-4.6.jar> maven-model-3.0.1.jar<=========----> 75% EXECUTING [4m 33s]> maven-license-plugin-1.10.b1.jar> closure-compiler-v20131014.jar> jopt-simple-4.6.jar> maven-model-3.0.1.jar<=========----> 75% EXECUTING [4m 33s]> maven-license-plugin-1.10.b1.jar> closure-compiler-v20131014.jar> jopt-simple-4.6.jar> maven-model-3.0.1.jar<=========----> 75% EXECUTING [4m 33s]> maven-license-plugin-1.10.b1.jar> closure-compiler-v20131014.jar> jopt-simple-4.6.jar> maven-model-3.0.1.jar<=========----> 75% EXECUTING [4m 33s]> maven-license-plugin-1.10.b1.jar> closure-compiler-v20131014.jar> jopt-simple-4.6.jar> maven-model-3.0.1.jar<=========----> 75% EXECUTING [4m 33s]> maven-license-plugin-1.10.b1.jar> closure-compiler-v20131014.jar> jopt-simple-4.6.jar> maven-model-3.0.1.jar<=========----> 75% EXECUTING [4m 33s]> maven-license-plugin-1.10.b1.jar> closure-compiler-v20131014.jar> jopt-simple-4.6.jar> maven-model-3.0.1.jar<=========----> 75% EXECUTING [4m 33s]> maven-license-plugin-1.10.b1.jar> closure-compiler-v20131014.jar> jopt-simple-4.6.jar> maven-model-3.0.1.jar<=========----> 75% EXECUTING [4m 33s]> maven-license-plugin-1.10.b1.jar> closure-compiler-v20131014.jar> jopt-simple-4.6.jar> maven-model-3.0.1.jar<=========----> 75% EXECUTING [4m 34s]> maven-license-plugin-1.10.b1.jar> closure-compiler-v20131014.jar> jopt-simple-4.6.jar> maven-model-3.0.1.jar<=========----> 75% EXECUTING [4m 34s]> maven-license-plugin-1.10.b1.jar> closure-compiler-v20131014.jar> jopt-simple-4.6.jar> maven-model-3.0.1.jar<=========----> 75% EXECUTING [4m 34s]> maven-license-plugin-1.10.b1.jar> closure-compiler-v20131014.jar> jopt-simple-4.6.jar> maven-model-3.0.1.jar<=========----> 75% EXECUTING [4m 34s]> maven-license-plugin-1.10.b1.jar> closure-compiler-v20131014.jar> jopt-simple-4.6.jar> maven-model-3.0.1.jar<=========----> 75% EXECUTING [4m 34s]> maven-license-plugin-1.10.b1.jar> closure-compiler-v20131014.jar> jopt-simple-4.6.jar> maven-model-3.0.1.jar<=========----> 75% EXECUTING [4m 34s]> maven-license-plugin-1.10.b1.jar> closure-compiler-v20131014.jar> jopt-simple-4.6.jar> maven-model-3.0.1.jar<=========----> 75% EXECUTING [4m 34s]> maven-license-plugin-1.10.b1.jar> closure-compiler-v20131014.jar> jopt-simple-4.6.jar> maven-model-3.0.1.jar<=========----> 75% EXECUTING [4m 34s]> maven-license-plugin-1.10.b1.jar> closure-compiler-v20131014.jar> jopt-simple-4.6.jar> maven-model-3.0.1.jar<=========----> 75% EXECUTING [4m 34s]> maven-license-plugin-1.10.b1.jar> closure-compiler-v20131014.jar> jopt-simple-4.6.jar> maven-model-3.0.1.jar<=========----> 75% EXECUTING [4m 34s]> maven-license-plugin-1.10.b1.jar> closure-compiler-v20131014.jar> jopt-simple-4.6.jar> maven-model-3.0.1.jar<=========----> 75% EXECUTING [4m 35s]> maven-license-plugin-1.10.b1.jar> closure-compiler-v20131014.jar> jopt-simple-4.6.jar> maven-model-3.0.1.jar<=========----> 75% EXECUTING [4m 35s]> maven-license-plugin-1.10.b1.jar> closure-compiler-v20131014.jar> jopt-simple-4.6.jar> maven-model-3.0.1.jar<=========----> 75% EXECUTING [4m 35s]> maven-license-plugin-1.10.b1.jar> closure-compiler-v20131014.jar> jopt-simple-4.6.jar> maven-model-3.0.1.jar<=========----> 75% EXECUTING [4m 35s]> maven-license-plugin-1.10.b1.jar> closure-compiler-v20131014.jar> jopt-simple-4.6.jar> maven-model-3.0.1.jar<=========----> 75% EXECUTING [4m 35s]> maven-license-plugin-1.10.b1.jar> closure-compiler-v20131014.jar> jopt-simple-4.6.jar> maven-model-3.0.1.jar<=========----> 75% EXECUTING [4m 35s]> maven-license-plugin-1.10.b1.jar> closure-compiler-v20131014.jar> jopt-simple-4.6.jar> maven-model-3.0.1.jar<=========----> 75% EXECUTING [4m 35s]> maven-license-plugin-1.10.b1.jar> closure-compiler-v20131014.jar> jopt-simple-4.6.jar> maven-model-3.0.1.jar<=========----> 75% EXECUTING [4m 35s]> maven-license-plugin-1.10.b1.jar> closure-compiler-v20131014.jar> jopt-simple-4.6.jar> maven-model-3.0.1.jar<=========----> 75% EXECUTING [4m 35s]> maven-license-plugin-1.10.b1.jar> closure-compiler-v20131014.jar> jopt-simple-4.6.jar> maven-model-3.0.1.jar<=========----> 75% EXECUTING [4m 35s]> maven-license-plugin-1.10.b1.jar> closure-compiler-v20131014.jar> jopt-simple-4.6.jar> maven-model-3.0.1.jar<=========----> 75% EXECUTING [4m 36s]> maven-license-plugin-1.10.b1.jar> closure-compiler-v20131014.jar> jopt-simple-4.6.jar> maven-model-3.0.1.jar<=========----> 75% EXECUTING [4m 36s]> maven-license-plugin-1.10.b1.jar> closure-compiler-v20131014.jar> jopt-simple-4.6.jar> maven-model-3.0.1.jar<=========----> 75% EXECUTING [4m 36s]> maven-license-plugin-1.10.b1.jar> closure-compiler-v20131014.jar> jopt-simple-4.6.jar> maven-model-3.0.1.jar<=========----> 75% EXECUTING [4m 36s]> maven-license-plugin-1.10.b1.jar> closure-compiler-v20131014.jar> jopt-simple-4.6.jar> maven-model-3.0.1.jar<=========----> 75% EXECUTING [4m 36s]> maven-license-plugin-1.10.b1.jar> closure-compiler-v20131014.jar> jopt-simple-4.6.jar> maven-model-3.0.1.jar<=========----> 75% EXECUTING [4m 36s]> maven-license-plugin-1.10.b1.jar> closure-compiler-v20131014.jar> jopt-simple-4.6.jar> maven-model-3.0.1.jar<=========----> 75% EXECUTING [4m 36s]> maven-license-plugin-1.10.b1.jar> closure-compiler-v20131014.jar> jopt-simple-4.6.jar> maven-model-3.0.1.jar<=========----> 75% EXECUTING [4m 36s]> maven-license-plugin-1.10.b1.jar> closure-compiler-v20131014.jar> jopt-simple-4.6.jar> maven-model-3.0.1.jar<=========----> 75% EXECUTING [4m 36s]> maven-license-plugin-1.10.b1.jar> closure-compiler-v20131014.jar> jopt-simple-4.6.jar> maven-model-3.0.1.jar<=========----> 75% EXECUTING [4m 36s]> maven-license-plugin-1.10.b1.jar> closure-compiler-v20131014.jar> jopt-simple-4.6.jar> maven-model-3.0.1.jar<=========----> 75% EXECUTING [4m 37s]> maven-license-plugin-1.10.b1.jar> closure-compiler-v20131014.jar> jopt-simple-4.6.jar> maven-model-3.0.1.jar<=========----> 75% EXECUTING [4m 37s]> maven-license-plugin-1.10.b1.jar> closure-compiler-v20131014.jar> jopt-simple-4.6.jar> maven-model-3.0.1.jar<=========----> 75% EXECUTING [4m 37s]> maven-license-plugin-1.10.b1.jar> closure-compiler-v20131014.jar> jopt-simple-4.6.jar> maven-model-3.0.1.jar<=========----> 75% EXECUTING [4m 37s]> maven-license-plugin-1.10.b1.jar> closure-compiler-v20131014.jar> jopt-simple-4.6.jar> maven-model-3.0.1.jar<=========----> 75% EXECUTING [4m 37s]> maven-license-plugin-1.10.b1.jar> closure-compiler-v20131014.jar> jopt-simple-4.6.jar> maven-model-3.0.1.jar<=========----> 75% EXECUTING [4m 37s]> maven-license-plugin-1.10.b1.jar> closure-compiler-v20131014.jar> jopt-simple-4.6.jar> maven-model-3.0.1.jar<=========----> 75% EXECUTING [4m 37s]> maven-license-plugin-1.10.b1.jar> closure-compiler-v20131014.jar> jopt-simple-4.6.jar> maven-model-3.0.1.jar<=========----> 75% EXECUTING [4m 37s]> maven-license-plugin-1.10.b1.jar> closure-compiler-v20131014.jar> jopt-simple-4.6.jar> maven-model-3.0.1.jar<=========----> 75% EXECUTING [4m 37s]> maven-license-plugin-1.10.b1.jar> closure-compiler-v20131014.jar> jopt-simple-4.6.jar> maven-model-3.0.1.jar<=========----> 75% EXECUTING [4m 37s]> maven-license-plugin-1.10.b1.jar> closure-compiler-v20131014.jar> jopt-simple-4.6.jar> maven-model-3.0.1.jar<=========----> 75% EXECUTING [4m 38s]> maven-license-plugin-1.10.b1.jar> closure-compiler-v20131014.jar> jopt-simple-4.6.jar> maven-model-3.0.1.jar<=========----> 75% EXECUTING [4m 38s]> maven-license-plugin-1.10.b1.jar> closure-compiler-v20131014.jar> jopt-simple-4.6.jar> maven-model-3.0.1.jar<=========----> 75% EXECUTING [4m 38s]> maven-license-plugin-1.10.b1.jar> closure-compiler-v20131014.jar> jopt-simple-4.6.jar> maven-model-3.0.1.jar<=========----> 75% EXECUTING [4m 38s]> maven-license-plugin-1.10.b1.jar> closure-compiler-v20131014.jar> jopt-simple-4.6.jar> maven-model-3.0.1.jar<=========----> 75% EXECUTING [4m 38s]> maven-license-plugin-1.10.b1.jar> closure-compiler-v20131014.jar> jopt-simple-4.6.jar> maven-model-3.0.1.jar<=========----> 75% EXECUTING [4m 38s]> maven-license-plugin-1.10.b1.jar> closure-compiler-v20131014.jar> jopt-simple-4.6.jar> maven-model-3.0.1.jar<=========----> 75% EXECUTING [4m 38s]> maven-license-plugin-1.10.b1.jar> closure-compiler-v20131014.jar> jopt-simple-4.6.jar> maven-model-3.0.1.jar<=========----> 75% EXECUTING [4m 38s]> maven-license-plugin-1.10.b1.jar> closure-compiler-v20131014.jar> jopt-simple-4.6.jar> maven-model-3.0.1.jar<=========----> 75% EXECUTING [4m 38s]> maven-license-plugin-1.10.b1.jar> closure-compiler-v20131014.jar> jopt-simple-4.6.jar> maven-model-3.0.1.jar<=========----> 75% EXECUTING [4m 38s]> maven-license-plugin-1.10.b1.jar> closure-compiler-v20131014.jar> jopt-simple-4.6.jar> maven-model-3.0.1.jar<=========----> 75% EXECUTING [4m 39s]> maven-license-plugin-1.10.b1.jar> closure-compiler-v20131014.jar> jopt-simple-4.6.jar> maven-model-3.0.1.jar<=========----> 75% EXECUTING [4m 39s]> maven-license-plugin-1.10.b1.jar> closure-compiler-v20131014.jar> jopt-simple-4.6.jar> maven-model-3.0.1.jar<=========----> 75% EXECUTING [4m 39s]> maven-license-plugin-1.10.b1.jar> closure-compiler-v20131014.jar> jopt-simple-4.6.jar> maven-model-3.0.1.jar<=========----> 75% EXECUTING [4m 39s]> maven-license-plugin-1.10.b1.jar> closure-compiler-v20131014.jar> jopt-simple-4.6.jar> maven-model-3.0.1.jar<=========----> 75% EXECUTING [4m 39s]> maven-license-plugin-1.10.b1.jar> closure-compiler-v20131014.jar> jopt-simple-4.6.jar> maven-model-3.0.1.jar<=========----> 75% EXECUTING [4m 39s]> maven-license-plugin-1.10.b1.jar> closure-compiler-v20131014.jar> jopt-simple-4.6.jar> maven-model-3.0.1.jar<=========----> 75% EXECUTING [4m 39s]> maven-license-plugin-1.10.b1.jar> closure-compiler-v20131014.jar> jopt-simple-4.6.jar> maven-model-3.0.1.jar<=========----> 75% EXECUTING [4m 39s]> maven-license-plugin-1.10.b1.jar> closure-compiler-v20131014.jar> jopt-simple-4.6.jar> maven-model-3.0.1.jar<=========----> 75% EXECUTING [4m 39s]> maven-license-plugin-1.10.b1.jar> closure-compiler-v20131014.jar> jopt-simple-4.6.jar> maven-model-3.0.1.jar<=========----> 75% EXECUTING [4m 39s]> maven-license-plugin-1.10.b1.jar> closure-compiler-v20131014.jar> jopt-simple-4.6.jar> maven-model-3.0.1.jar<=========----> 75% EXECUTING [4m 40s]> maven-license-plugin-1.10.b1.jar> closure-compiler-v20131014.jar> jopt-simple-4.6.jar> maven-model-3.0.1.jar<=========----> 75% EXECUTING [4m 40s]> maven-license-plugin-1.10.b1.jar> closure-compiler-v20131014.jar> jopt-simple-4.6.jar> maven-model-3.0.1.jar<=========----> 75% EXECUTING [4m 40s]> maven-license-plugin-1.10.b1.jar> closure-compiler-v20131014.jar> jopt-simple-4.6.jar> maven-model-3.0.1.jar<=========----> 75% EXECUTING [4m 40s]> maven-license-plugin-1.10.b1.jar> closure-compiler-v20131014.jar> jopt-simple-4.6.jar> maven-model-3.0.1.jar<=========----> 75% EXECUTING [4m 40s]> maven-license-plugin-1.10.b1.jar> closure-compiler-v20131014.jar> jopt-simple-4.6.jar> maven-model-3.0.1.jar<=========----> 75% EXECUTING [4m 40s]> maven-license-plugin-1.10.b1.jar> closure-compiler-v20131014.jar> jopt-simple-4.6.jar> maven-model-3.0.1.jar<=========----> 75% EXECUTING [4m 40s]> maven-license-plugin-1.10.b1.jar> closure-compiler-v20131014.jar> jopt-simple-4.6.jar> maven-model-3.0.1.jar<=========----> 75% EXECUTING [4m 40s]> maven-license-plugin-1.10.b1.jar> closure-compiler-v20131014.jar> jopt-simple-4.6.jar> maven-model-3.0.1.jar<=========----> 75% EXECUTING [4m 40s]> maven-license-plugin-1.10.b1.jar> closure-compiler-v20131014.jar> jopt-simple-4.6.jar> maven-model-3.0.1.jar<=========----> 75% EXECUTING [4m 40s]> maven-license-plugin-1.10.b1.jar> closure-compiler-v20131014.jar> jopt-simple-4.6.jar> maven-model-3.0.1.jar<=========----> 75% EXECUTING [4m 41s]> maven-license-plugin-1.10.b1.jar> closure-compiler-v20131014.jar> jopt-simple-4.6.jar> maven-model-3.0.1.jar<=========----> 75% EXECUTING [4m 41s]> maven-license-plugin-1.10.b1.jar> closure-compiler-v20131014.jar> jopt-simple-4.6.jar> maven-model-3.0.1.jar<=========----> 75% EXECUTING [4m 41s]> maven-license-plugin-1.10.b1.jar> closure-compiler-v20131014.jar> jopt-simple-4.6.jar> maven-model-3.0.1.jar<=========----> 75% EXECUTING [4m 41s]> maven-license-plugin-1.10.b1.jar> closure-compiler-v20131014.jar> jopt-simple-4.6.jar> maven-model-3.0.1.jar<=========----> 75% EXECUTING [4m 41s]> maven-license-plugin-1.10.b1.jar> closure-compiler-v20131014.jar> jopt-simple-4.6.jar> maven-model-3.0.1.jar<=========----> 75% EXECUTING [4m 41s]> maven-license-plugin-1.10.b1.jar> closure-compiler-v20131014.jar> jopt-simple-4.6.jar> maven-model-3.0.1.jar<=========----> 75% EXECUTING [4m 41s]> maven-license-plugin-1.10.b1.jar> closure-compiler-v20131014.jar> jopt-simple-4.6.jar> maven-model-3.0.1.jar<=========----> 75% EXECUTING [4m 41s]> maven-license-plugin-1.10.b1.jar> closure-compiler-v20131014.jar> jopt-simple-4.6.jar> maven-model-3.0.1.jar<=========----> 75% EXECUTING [4m 41s]> maven-license-plugin-1.10.b1.jar> closure-compiler-v20131014.jar> jopt-simple-4.6.jar> maven-model-3.0.1.jar<=========----> 75% EXECUTING [4m 41s]> maven-license-plugin-1.10.b1.jar> closure-compiler-v20131014.jar> jopt-simple-4.6.jar> maven-model-3.0.1.jar<=========----> 75% EXECUTING [4m 42s]> maven-license-plugin-1.10.b1.jar> closure-compiler-v20131014.jar> jopt-simple-4.6.jar> maven-model-3.0.1.jar<=========----> 75% EXECUTING [4m 42s]> maven-license-plugin-1.10.b1.jar> closure-compiler-v20131014.jar> jopt-simple-4.6.jar> maven-model-3.0.1.jar<=========----> 75% EXECUTING [4m 42s]> maven-license-plugin-1.10.b1.jar> closure-compiler-v20131014.jar> jopt-simple-4.6.jar> maven-model-3.0.1.jar<=========----> 75% EXECUTING [4m 42s]> maven-license-plugin-1.10.b1.jar> closure-compiler-v20131014.jar> jopt-simple-4.6.jar> maven-model-3.0.1.jar<=========----> 75% EXECUTING [4m 42s]> maven-license-plugin-1.10.b1.jar> closure-compiler-v20131014.jar> jopt-simple-4.6.jar> maven-model-3.0.1.jar<=========----> 75% EXECUTING [4m 42s]> maven-license-plugin-1.10.b1.jar> closure-compiler-v20131014.jar> jopt-simple-4.6.jar> maven-model-3.0.1.jar<=========----> 75% EXECUTING [4m 42s]> maven-license-plugin-1.10.b1.jar> closure-compiler-v20131014.jar> jopt-simple-4.6.jar> maven-model-3.0.1.jar<=========----> 75% EXECUTING [4m 42s]> maven-license-plugin-1.10.b1.jar> closure-compiler-v20131014.jar> jopt-simple-4.6.jar> maven-model-3.0.1.jar<=========----> 75% EXECUTING [4m 42s]> maven-license-plugin-1.10.b1.jar> closure-compiler-v20131014.jar> jopt-simple-4.6.jar> maven-model-3.0.1.jar<=========----> 75% EXECUTING [4m 42s]> maven-license-plugin-1.10.b1.jar> closure-compiler-v20131014.jar> jopt-simple-4.6.jar> maven-model-3.0.1.jar<=========----> 75% EXECUTING [4m 43s]> maven-license-plugin-1.10.b1.jar> closure-compiler-v20131014.jar> jopt-simple-4.6.jar> maven-model-3.0.1.jar<=========----> 75% EXECUTING [4m 43s]> maven-license-plugin-1.10.b1.jar> closure-compiler-v20131014.jar> jopt-simple-4.6.jar> maven-model-3.0.1.jar<=========----> 75% EXECUTING [4m 43s]> maven-license-plugin-1.10.b1.jar> closure-compiler-v20131014.jar> jopt-simple-4.6.jar> maven-model-3.0.1.jar<=========----> 75% EXECUTING [4m 43s]> maven-license-plugin-1.10.b1.jar> closure-compiler-v20131014.jar> jopt-simple-4.6.jar> maven-model-3.0.1.jar<=========----> 75% EXECUTING [4m 43s]> maven-license-plugin-1.10.b1.jar> closure-compiler-v20131014.jar> jopt-simple-4.6.jar> maven-model-3.0.1.jar<=========----> 75% EXECUTING [4m 43s]> maven-license-plugin-1.10.b1.jar> closure-compiler-v20131014.jar> jopt-simple-4.6.jar> maven-model-3.0.1.jar<=========----> 75% EXECUTING [4m 43s]> maven-license-plugin-1.10.b1.jar> closure-compiler-v20131014.jar> jopt-simple-4.6.jar> maven-model-3.0.1.jar<=========----> 75% EXECUTING [4m 43s]> maven-license-plugin-1.10.b1.jar> closure-compiler-v20131014.jar> jopt-simple-4.6.jar> maven-model-3.0.1.jar<=========----> 75% EXECUTING [4m 43s]> maven-license-plugin-1.10.b1.jar> closure-compiler-v20131014.jar> jopt-simple-4.6.jar> maven-model-3.0.1.jar<=========----> 75% EXECUTING [4m 43s]> maven-license-plugin-1.10.b1.jar> closure-compiler-v20131014.jar> jopt-simple-4.6.jar> maven-model-3.0.1.jar<=========----> 75% EXECUTING [4m 44s]> maven-license-plugin-1.10.b1.jar> closure-compiler-v20131014.jar> jopt-simple-4.6.jar> maven-model-3.0.1.jar<=========----> 75% EXECUTING [4m 44s]> maven-license-plugin-1.10.b1.jar> closure-compiler-v20131014.jar> jopt-simple-4.6.jar> maven-model-3.0.1.jar<=========----> 75% EXECUTING [4m 44s]> maven-license-plugin-1.10.b1.jar> closure-compiler-v20131014.jar> jopt-simple-4.6.jar> maven-model-3.0.1.jar<=========----> 75% EXECUTING [4m 44s]> maven-license-plugin-1.10.b1.jar> closure-compiler-v20131014.jar> jopt-simple-4.6.jar> maven-model-3.0.1.jar<=========----> 75% EXECUTING [4m 44s]> maven-license-plugin-1.10.b1.jar> closure-compiler-v20131014.jar> jopt-simple-4.6.jar> maven-model-3.0.1.jar<=========----> 75% EXECUTING [4m 44s]> maven-license-plugin-1.10.b1.jar> closure-compiler-v20131014.jar> jopt-simple-4.6.jar> maven-model-3.0.1.jar<=========----> 75% EXECUTING [4m 44s]> maven-license-plugin-1.10.b1.jar> closure-compiler-v20131014.jar> jopt-simple-4.6.jar> maven-model-3.0.1.jar<=========----> 75% EXECUTING [4m 44s]> maven-license-plugin-1.10.b1.jar> closure-compiler-v20131014.jar> jopt-simple-4.6.jar> maven-model-3.0.1.jar<=========----> 75% EXECUTING [4m 44s]> maven-license-plugin-1.10.b1.jar> closure-compiler-v20131014.jar> jopt-simple-4.6.jar> maven-model-3.0.1.jar<=========----> 75% EXECUTING [4m 44s]> maven-license-plugin-1.10.b1.jar> closure-compiler-v20131014.jar> jopt-simple-4.6.jar> maven-model-3.0.1.jar<=========----> 75% EXECUTING [4m 44s]> maven-license-plugin-1.10.b1.jar> closure-compiler-v20131014.jar> jopt-simple-4.6.jar> maven-model-3.0.1.jar<=========----> 75% EXECUTING [4m 45s]> maven-license-plugin-1.10.b1.jar> closure-compiler-v20131014.jar> jopt-simple-4.6.jar> maven-model-3.0.1.jar<=========----> 75% EXECUTING [4m 45s]> maven-license-plugin-1.10.b1.jar> closure-compiler-v20131014.jar> jopt-simple-4.6.jar> maven-model-3.0.1.jar<=========----> 75% EXECUTING [4m 45s]> maven-license-plugin-1.10.b1.jar> closure-compiler-v20131014.jar> jopt-simple-4.6.jar> maven-model-3.0.1.jar<=========----> 75% EXECUTING [4m 45s]> maven-license-plugin-1.10.b1.jar> closure-compiler-v20131014.jar> jopt-simple-4.6.jar> maven-model-3.0.1.jar<=========----> 75% EXECUTING [4m 45s]> maven-license-plugin-1.10.b1.jar> closure-compiler-v20131014.jar> jopt-simple-4.6.jar> maven-model-3.0.1.jar<=========----> 75% EXECUTING [4m 45s]> maven-license-plugin-1.10.b1.jar> closure-compiler-v20131014.jar> jopt-simple-4.6.jar> maven-model-3.0.1.jar<=========----> 75% EXECUTING [4m 45s]> maven-license-plugin-1.10.b1.jar> closure-compiler-v20131014.jar> jopt-simple-4.6.jar> maven-model-3.0.1.jar<=========----> 75% EXECUTING [4m 45s]> maven-license-plugin-1.10.b1.jar> closure-compiler-v20131014.jar> jopt-simple-4.6.jar> maven-model-3.0.1.jar<=========----> 75% EXECUTING [4m 45s]> maven-license-plugin-1.10.b1.jar> closure-compiler-v20131014.jar> jopt-simple-4.6.jar> maven-model-3.0.1.jar
> Task :ui:webpack
Hash: c03a29682faeac046e39
Version: webpack 2.7.0
Time: 14754ms
Asset Size Chunks Chunk Names
bundle.js 3.18 MB 0 [emitted] [big] main
bundle.js.map 3.52 MB 0 [emitted] main
[1] ./~/react/index.js 190 bytes {0} [built]
[7] ./~/react-router-dom/es/index.js 1.01 kB {0} [built]
[177] ./src/main/js/client/scheduler-client.js 795 bytes {0} [built]
[179] ./src/main/js/pages/Home.js 3.72 kB {0} [built]
[180] ./src/main/js/pages/Instance.js 6.34 kB {0} [built]
[181] ./src/main/js/pages/Job.js 8.4 kB {0} [built]
[182] ./src/main/js/pages/Jobs.js 5.17 kB {0} [built]
[183] ./src/main/js/pages/Task.js 4.64 kB {0} [built]
[184] ./src/main/js/pages/Update.js 4.91 kB {0} [built]
[185] ./src/main/js/pages/Updates.js 5.06 kB {0} [built]
[186] ./~/react-dom/index.js 1.36 kB {0} [built]
[187] ./~/bootstrap/dist/css/bootstrap.css 984 bytes {0} [built]
[188] ./src/main/sass/app.scss 1.19 kB {0} [built]
[189] ./src/main/resources/source-sans-pro.css 1.05 kB {0} [built]
[221] ./src/main/js/index.js 3.43 kB {0} [built]
+ 264 hidden modules
<=========----> 75% EXECUTING [4m 46s]> maven-license-plugin-1.10.b1.jar> closure-compiler-v20131014.jar> jopt-simple-4.6.jar> maven-model-3.0.1.jar<==========---> 78% EXECUTING [4m 46s]> maven-license-plugin-1.10.b1.jar> closure-compiler-v20131014.jar> jopt-simple-4.6.jar> maven-model-3.0.1.jar<==========---> 78% EXECUTING [4m 46s]> maven-license-plugin-1.10.b1.jar> closure-compiler-v20131014.jar> jopt-simple-4.6.jar> maven-model-3.0.1.jar<==========---> 78% EXECUTING [4m 46s]> maven-license-plugin-1.10.b1.jar> closure-compiler-v20131014.jar> jopt-simple-4.6.jar> maven-model-3.0.1.jar<===========--> 85% EXECUTING [4m 46s]> maven-license-plugin-1.10.b1.jar> closure-compiler-v20131014.jar> jopt-simple-4.6.jar> maven-model-3.0.1.jar<===========--> 85% EXECUTING [4m 46s]> maven-license-plugin-1.10.b1.jar> closure-compiler-v20131014.jar> jopt-simple-4.6.jar> maven-model-3.0.1.jar<===========--> 85% EXECUTING [4m 46s]> maven-license-plugin-1.10.b1.jar> closure-compiler-v20131014.jar> jopt-simple-4.6.jar> maven-model-3.0.1.jar<===========--> 85% EXECUTING [4m 46s]> maven-license-plugin-1.10.b1.jar> closure-compiler-v20131014.jar> jopt-simple-4.6.jar> maven-model-3.0.1.jar<===========--> 85% EXECUTING [4m 46s]> maven-license-plugin-1.10.b1.jar> closure-compiler-v20131014.jar> jopt-simple-4.6.jar> maven-model-3.0.1.jar<===========--> 85% EXECUTING [4m 46s]> maven-license-plugin-1.10.b1.jar> closure-compiler-v20131014.jar> jopt-simple-4.6.jar> maven-model-3.0.1.jar<===========--> 85% EXECUTING [4m 47s]> maven-license-plugin-1.10.b1.jar> closure-compiler-v20131014.jar> jopt-simple-4.6.jar> maven-model-3.0.1.jar<===========--> 85% EXECUTING [4m 47s]> maven-license-plugin-1.10.b1.jar> closure-compiler-v20131014.jar> jopt-simple-4.6.jar> maven-model-3.0.1.jar<===========--> 85% EXECUTING [4m 47s]> maven-license-plugin-1.10.b1.jar> closure-compiler-v20131014.jar> jopt-simple-4.6.jar> maven-model-3.0.1.jar<===========--> 85% EXECUTING [4m 47s]> maven-license-plugin-1.10.b1.jar> closure-compiler-v20131014.jar> jopt-simple-4.6.jar> maven-model-3.0.1.jar<===========--> 85% EXECUTING [4m 47s]> maven-license-plugin-1.10.b1.jar> closure-compiler-v20131014.jar> jopt-simple-4.6.jar> maven-model-3.0.1.jar<===========--> 89% EXECUTING [4m 47s]> maven-license-plugin-1.10.b1.jar> closure-compiler-v20131014.jar> jopt-simple-4.6.jar> maven-model-3.0.1.jar<===========--> 89% EXECUTING [4m 47s]> maven-license-plugin-1.10.b1.jar> closure-compiler-v20131014.jar> jopt-simple-4.6.jar> maven-model-3.0.1.jar<============-> 92% EXECUTING [4m 47s]> maven-license-plugin-1.10.b1.jar> closure-compiler-v20131014.jar> jopt-simple-4.6.jar> maven-model-3.0.1.jar<============-> 96% EXECUTING [4m 47s]> maven-license-plugin-1.10.b1.jar> closure-compiler-v20131014.jar> jopt-simple-4.6.jar> maven-model-3.0.1.jar<============-> 96% EXECUTING [4m 47s]> maven-license-plugin-1.10.b1.jar> closure-compiler-v20131014.jar> jopt-simple-4.6.jar> maven-model-3.0.1.jar<============-> 96% EXECUTING [4m 48s]> maven-license-plugin-1.10.b1.jar> closure-compiler-v20131014.jar> jopt-simple-4.6.jar> maven-model-3.0.1.jar<============-> 96% EXECUTING [4m 48s]> maven-license-plugin-1.10.b1.jar> closure-compiler-v20131014.jar> jopt-simple-4.6.jar> maven-model-3.0.1.jar<============-> 96% EXECUTING [4m 48s]> maven-license-plugin-1.10.b1.jar> closure-compiler-v20131014.jar> jopt-simple-4.6.jar> maven-model-3.0.1.jar<============-> 96% EXECUTING [4m 48s]> maven-license-plugin-1.10.b1.jar> closure-compiler-v20131014.jar> jopt-simple-4.6.jar> maven-model-3.0.1.jar<============-> 96% EXECUTING [4m 48s]> maven-license-plugin-1.10.b1.jar> closure-compiler-v20131014.jar> jopt-simple-4.6.jar> maven-model-3.0.1.jar<============-> 96% EXECUTING [4m 48s]> maven-license-plugin-1.10.b1.jar> closure-compiler-v20131014.jar> jopt-simple-4.6.jar> maven-model-3.0.1.jar<============-> 96% EXECUTING [4m 48s]> maven-license-plugin-1.10.b1.jar> closure-compiler-v20131014.jar> jopt-simple-4.6.jar> maven-model-3.0.1.jar<============-> 96% EXECUTING [4m 48s]> maven-license-plugin-1.10.b1.jar> closure-compiler-v20131014.jar> jopt-simple-4.6.jar> maven-model-3.0.1.jar<============-> 96% EXECUTING [4m 48s]> maven-license-plugin-1.10.b1.jar> closure-compiler-v20131014.jar> jopt-simple-4.6.jar> maven-model-3.0.1.jar<============-> 96% EXECUTING [4m 48s]> maven-license-plugin-1.10.b1.jar> closure-compiler-v20131014.jar> jopt-simple-4.6.jar> maven-model-3.0.1.jar<============-> 96% EXECUTING [4m 49s]> maven-license-plugin-1.10.b1.jar> closure-compiler-v20131014.jar> jopt-simple-4.6.jar> maven-model-3.0.1.jar<============-> 96% EXECUTING [4m 49s]> maven-license-plugin-1.10.b1.jar> closure-compiler-v20131014.jar> jopt-simple-4.6.jar> maven-model-3.0.1.jar<============-> 96% EXECUTING [4m 49s]> maven-license-plugin-1.10.b1.jar> closure-compiler-v20131014.jar> jopt-simple-4.6.jar> maven-model-3.0.1.jar
BUILD SUCCESSFUL in 4m 52s
20 actionable tasks: 20 executed
<-------------> 0% WAITING> maven-license-plugin-1.10.b1.jar> closure-compiler-v20131014.jar> jopt-simple-4.6.jar> maven-model-3.0.1.jarmkdir -p third_party
/scratch/pants binary src/main/python/apache/aurora/executor:thermos_executor
fatal: Not a git repository (or any of the parent directories): .git
fatal: Not a git repository (or any of the parent directories): .git
00:44:37 00:00 [main]
(To run a reporting server: ./pants server)
00:44:38 00:01 [setup]
00:44:38 00:01 [parse]fatal: Not a git repository (or any of the parent directories): .git
Executing tasks in goals: gen -> pyprep -> binary
00:44:38 00:01 [gen]
00:44:38 00:01 [thrift-py]
00:44:38 00:01 [cache]
No cached artifacts for 4 targets.
Invalidated 4 targets.....
00:44:38 00:01 [pyprep]
00:44:38 00:01 [interpreter]
00:44:43 00:06 [build-local-dists]
00:44:43 00:06 [requirements]
00:44:43 00:06 [cache]
No cached artifacts for 27 targets.
Invalidated 27 targets.
Waiting for background workers to finish.
00:44:47 00:10 [complete]
FAILURE
Exception caught: (<class 'pex.resolver.Unsatisfiable'>)
Exception message: Could not satisfy all requirements for mesos.executor==1.5.0:
mesos.executor==1.5.0
debian/rules:35: recipe for target '__pants_build' failed
make[1]: *** [__pants_build] Error 1
make[1]: Leaving directory '/scratch'
debian/rules:22: recipe for target 'build' failed
make: *** [build] Error 2
dpkg-buildpackage: error: debian/rules build gave error exit status 2
Build step 'Execute shell' marked build as failure
Skipped archiving because build is not successful
Jenkins build is back to normal : aurora-packaging-nightly #1074
Posted by Apache Jenkins Server <je...@builds.apache.org>.
See <https://builds.apache.org/job/aurora-packaging-nightly/1074/display/redirect>
Build failed in Jenkins: aurora-packaging-nightly #1073
Posted by Apache Jenkins Server <je...@builds.apache.org>.
See <https://builds.apache.org/job/aurora-packaging-nightly/1073/display/redirect?page=changes>
Changes:
[renan] Updating aurora-packaging for compatibility with Pants 1.6.0 and to
------------------------------------------
[...truncated 26.84 MB...]
dh_testdir -O--exclude=aurora-scheduler.bat
dh_auto_clean -O--exclude=aurora-scheduler.bat
dh_clean -O--exclude=aurora-scheduler.bat
debian/rules build
dh build --exclude=aurora-scheduler.bat --with=systemd
dh_testdir -O--exclude=aurora-scheduler.bat
dh_auto_configure -O--exclude=aurora-scheduler.bat
debian/rules override_dh_auto_build
make[1]: Entering directory `/scratch'
/usr/bin/gradle installDist
Starting a Gradle Daemon (subsequent builds will be faster)
> Starting Daemon> Starting Daemon> Starting Daemon> Starting Daemon> Starting Daemon> Starting Daemon> Starting Daemon> Starting Daemon> Starting Daemon> Starting Daemon> Starting Daemon> Starting Daemon> Starting Daemon> Starting Daemon> Starting Daemon > Connecting to Daemon> IDLE<-------------> 0% INITIALIZING [0s]> buildSrc > settings<-------------> 0% INITIALIZING [0s]> buildSrc > settings<-------------> 0% INITIALIZING [0s]> buildSrc > settings<-------------> 0% INITIALIZING [0s]> buildSrc > settings<-------------> 0% INITIALIZING [0s]> buildSrc > settings<-------------> 0% INITIALIZING [0s]> buildSrc > loading<-------------> 0% INITIALIZING [0s]> buildSrc > loading<-------------> 0% INITIALIZING [0s]> buildSrc > loading<-------------> 0% INITIALIZING [0s]> buildSrc > loading<-------------> 0% INITIALIZING [0s]> buildSrc<-------------> 0% INITIALIZING [1s]> buildSrc<-------------> 0% INITIALIZING [1s]> buildSrc<-------------> 0% INITIALIZING [1s]> buildSrc<-------------> 0% INITIALIZING [1s]> buildSrc<-------------> 0% INITIALIZING [1s]> buildSrc<-------------> 0% INITIALIZING [1s]> buildSrc<-------------> 0% INITIALIZING [1s]> buildSrc<-------------> 0% INITIALIZING [1s]> buildSrc<-------------> 0% INITIALIZING [1s]> buildSrc<-------------> 0% INITIALIZING [2s]> buildSrc<-------------> 0% INITIALIZING [2s]> buildSrc<-------------> 0% INITIALIZING [2s]> buildSrc<-------------> 0% INITIALIZING [2s]> buildSrc<-------------> 0% INITIALIZING [2s]> buildSrc<-------------> 0% INITIALIZING [2s]> buildSrcGenerating JAR file 'gradle-api-4.2.jar'
<-------------> 0% INITIALIZING [2s]> buildSrc<-------------> 0% INITIALIZING [2s]> buildSrc > Generating 0%<-------------> 0% INITIALIZING [2s]> buildSrc > Generating 0%<-------------> 0% INITIALIZING [2s]> buildSrc > Generating 0%<-------------> 0% INITIALIZING [3s]> buildSrc > Generating 0%<-------------> 0% INITIALIZING [3s]> buildSrc > Generating 0%<-------------> 0% INITIALIZING [3s]> buildSrc > Generating 0%<-------------> 0% INITIALIZING [3s]> buildSrc > Generating 0%<-------------> 0% INITIALIZING [3s]> buildSrc > Generating 0%<-------------> 0% INITIALIZING [3s]> buildSrc > Generating 0%<-------------> 0% INITIALIZING [3s]> buildSrc > Generating 0%<-------------> 0% INITIALIZING [3s]> buildSrc > Generating 0%<-------------> 0% INITIALIZING [3s]> buildSrc > Generating 0%<-------------> 0% INITIALIZING [3s]> buildSrc > Generating 0%<-------------> 0% INITIALIZING [4s]> buildSrc > Generating 0%<-------------> 0% INITIALIZING [4s]> buildSrc > Generating 0%<-------------> 0% INITIALIZING [4s]> buildSrc > Generating 0%<-------------> 0% INITIALIZING [4s]> buildSrc > Generating 0%<-------------> 0% INITIALIZING [4s]> buildSrc > Generating 0%<-------------> 0% INITIALIZING [4s]> buildSrc > Generating 1%<-------------> 0% INITIALIZING [4s]> buildSrc > Generating 1%<-------------> 0% INITIALIZING [4s]> buildSrc > Generating 1%<-------------> 0% INITIALIZING [4s]> buildSrc > Generating 1%<-------------> 0% INITIALIZING [4s]> buildSrc > Generating 1%<-------------> 0% INITIALIZING [5s]> buildSrc > Generating 1%<-------------> 0% INITIALIZING [5s]> buildSrc > Generating 1%<-------------> 0% INITIALIZING [5s]> buildSrc > Generating 1%<-------------> 0% INITIALIZING [5s]> buildSrc > Generating 1%<-------------> 0% INITIALIZING [5s]> buildSrc > Generating 3%<-------------> 0% INITIALIZING [5s]> buildSrc > Generating 4%<-------------> 0% INITIALIZING [5s]> buildSrc > Generating 4%<-------------> 0% INITIALIZING [5s]> buildSrc > Generating 4%<-------------> 0% INITIALIZING [5s]> buildSrc > Generating 4%<-------------> 0% INITIALIZING [5s]> buildSrc > Generating 4%<-------------> 0% INITIALIZING [6s]> buildSrc > Generating 4%<-------------> 0% INITIALIZING [6s]> buildSrc > Generating 4%<-------------> 0% INITIALIZING [6s]> buildSrc > Generating 4%<-------------> 0% INITIALIZING [6s]> buildSrc > Generating 6%<-------------> 0% INITIALIZING [6s]> buildSrc > Generating 15%<-------------> 0% INITIALIZING [6s]> buildSrc > Generating 19%<-------------> 0% INITIALIZING [6s]> buildSrc > Generating 20%<-------------> 0% INITIALIZING [6s]> buildSrc > Generating 24%<-------------> 0% INITIALIZING [6s]> buildSrc > Generating 29%<-------------> 0% INITIALIZING [6s]> buildSrc > Generating 32%<-------------> 0% INITIALIZING [7s]> buildSrc > Generating 32%<-------------> 0% INITIALIZING [7s]> buildSrc > Generating 32%<-------------> 0% INITIALIZING [7s]> buildSrc > Generating 32%<-------------> 0% INITIALIZING [7s]> buildSrc > Generating 34%<-------------> 0% INITIALIZING [7s]> buildSrc > Generating 34%<-------------> 0% INITIALIZING [7s]> buildSrc > Generating 42%<-------------> 0% INITIALIZING [7s]> buildSrc > Generating 44%<-------------> 0% INITIALIZING [7s]> buildSrc > Generating 46%<-------------> 0% INITIALIZING [7s]> buildSrc > Generating 48%<-------------> 0% INITIALIZING [7s]> buildSrc > Generating 50%<-------------> 0% INITIALIZING [8s]> buildSrc > Generating 51%<-------------> 0% INITIALIZING [8s]> buildSrc > Generating 51%<-------------> 0% INITIALIZING [8s]> buildSrc > Generating 51%<-------------> 0% INITIALIZING [8s]> buildSrc > Generating 51%<-------------> 0% INITIALIZING [8s]> buildSrc > Generating 51%<-------------> 0% INITIALIZING [8s]> buildSrc > Generating 51%<-------------> 0% INITIALIZING [8s]> buildSrc > Generating 52%<-------------> 0% INITIALIZING [8s]> buildSrc > Generating 53%<-------------> 0% INITIALIZING [8s]> buildSrc > Generating 54%<-------------> 0% INITIALIZING [8s]> buildSrc > Generating 55%<-------------> 0% INITIALIZING [9s]> buildSrc > Generating 56%<-------------> 0% INITIALIZING [9s]> buildSrc > Generating 56%<-------------> 0% INITIALIZING [9s]> buildSrc > Generating 56%<-------------> 0% INITIALIZING [9s]> buildSrc > Generating 57%<-------------> 0% INITIALIZING [9s]> buildSrc > Generating 60%<-------------> 0% INITIALIZING [9s]> buildSrc > Generating 65%<-------------> 0% INITIALIZING [9s]> buildSrc > Generating 68%<-------------> 0% INITIALIZING [9s]> buildSrc > Generating 69%<-------------> 0% INITIALIZING [9s]> buildSrc > Generating 70%<-------------> 0% INITIALIZING [9s]> buildSrc > Generating 74%<-------------> 0% INITIALIZING [10s]> buildSrc > Generating 76%<-------------> 0% INITIALIZING [10s]> buildSrc > Generating 76%<-------------> 0% INITIALIZING [10s]> buildSrc > Generating 76%<-------------> 0% INITIALIZING [10s]> buildSrc > Generating 78%<-------------> 0% INITIALIZING [10s]> buildSrc > Generating 83%<-------------> 0% INITIALIZING [10s]> buildSrc > Generating 84%<-------------> 0% INITIALIZING [10s]> buildSrc > Generating 85%<-------------> 0% INITIALIZING [10s]> buildSrc > Generating 87%<-------------> 0% INITIALIZING [10s]> buildSrc > Generating 87%<-------------> 0% INITIALIZING [10s]> buildSrc > Generating 87%<-------------> 0% INITIALIZING [11s]> buildSrc > Generating 87%<-------------> 0% INITIALIZING [11s]> buildSrc > Generating 89%<-------------> 0% INITIALIZING [11s]> buildSrc > Generating 89%<-------------> 0% INITIALIZING [11s]> buildSrc > Generating 90%<-------------> 0% INITIALIZING [11s]> buildSrc > Generating 90%<-------------> 0% INITIALIZING [11s]> buildSrc > Generating 92%<-------------> 0% INITIALIZING [11s]> buildSrc > Generating 94%<-------------> 0% INITIALIZING [11s]> buildSrc > Generating 95%<-------------> 0% INITIALIZING [11s]> buildSrc > Generating 95%<-------------> 0% INITIALIZING [11s]> buildSrc > Generating 100%<-------------> 0% INITIALIZING [12s]> buildSrc > Generating 100%<-------------> 0% INITIALIZING [12s]> buildSrc > root project<-------------> 0% INITIALIZING [12s]> buildSrc > root project > Compiling /scratch/buildSrc/build.gradle into local compilation cache > Compiling build file '/scratch/buildSrc/build.gradle' to cross build script cache<-------------> 0% INITIALIZING [12s]> buildSrc > root project > Compiling /scratch/buildSrc/build.gradle into local compilation cache > Compiling build file '/scratch/buildSrc/build.gradle' to cross build script cache<-------------> 0% INITIALIZING [12s]> buildSrc > root project > Compiling /scratch/buildSrc/build.gradle into local compilation cache > Compiling build file '/scratch/buildSrc/build.gradle' to cross build script cache<-------------> 0% INITIALIZING [12s]> buildSrc > root project > Compiling /scratch/buildSrc/build.gradle into local compilation cache > Compiling build file '/scratch/buildSrc/build.gradle' to cross build script cache<-------------> 0% INITIALIZING [12s]> buildSrc > root project<-------------> 0% INITIALIZING [12s]> buildSrc > Resolve dependencies :buildSrc:runtimeClasspath<-------------> 0% INITIALIZING [12s]> buildSrc<-------------> 0% INITIALIZING [12s]> buildSrc
<-------------> 7% INITIALIZING [13s]> buildSrc> :buildSrc:compileJava<=------------> 14% INITIALIZING [13s]> buildSrc> :buildSrc:compileGroovy<=------------> 14% INITIALIZING [13s]> buildSrc> :buildSrc:compileGroovy<=------------> 14% INITIALIZING [13s]> buildSrc> :buildSrc:compileGroovy<=------------> 14% INITIALIZING [13s]> buildSrc> :buildSrc:compileGroovy<=------------> 14% INITIALIZING [13s]> buildSrc> :buildSrc:compileGroovy<=------------> 14% INITIALIZING [13s]> buildSrc> :buildSrc:compileGroovy<=------------> 14% INITIALIZING [13s]> buildSrc> :buildSrc:compileGroovy<=------------> 14% INITIALIZING [13s]> buildSrc> :buildSrc:compileGroovy<=------------> 14% INITIALIZING [13s]> buildSrc> :buildSrc:compileGroovy<=------------> 14% INITIALIZING [14s]> buildSrc> :buildSrc:compileGroovy<=------------> 14% INITIALIZING [14s]> buildSrc> :buildSrc:compileGroovy<=------------> 14% INITIALIZING [14s]> buildSrc> :buildSrc:compileGroovy<=------------> 14% INITIALIZING [14s]> buildSrc> :buildSrc:compileGroovy<=------------> 14% INITIALIZING [14s]> buildSrc> :buildSrc:compileGroovy<=------------> 14% INITIALIZING [14s]> buildSrc> :buildSrc:compileGroovy<=------------> 14% INITIALIZING [14s]> buildSrc> :buildSrc:compileGroovy<=------------> 14% INITIALIZING [14s]> buildSrc> :buildSrc:compileGroovy<=------------> 14% INITIALIZING [14s]> buildSrc> :buildSrc:compileGroovy<=------------> 14% INITIALIZING [14s]> buildSrc> :buildSrc:compileGroovy<=------------> 14% INITIALIZING [15s]> buildSrc> :buildSrc:compileGroovy<=------------> 14% INITIALIZING [15s]> buildSrc> :buildSrc:compileGroovy<=------------> 14% INITIALIZING [15s]> buildSrc> :buildSrc:compileGroovy<=------------> 14% INITIALIZING [15s]> buildSrc> :buildSrc:compileGroovy<=------------> 14% INITIALIZING [15s]> buildSrc> :buildSrc:compileGroovy<=------------> 14% INITIALIZING [15s]> buildSrc> :buildSrc:compileGroovy<=------------> 14% INITIALIZING [15s]> buildSrc> :buildSrc:compileGroovy<=------------> 14% INITIALIZING [15s]> buildSrc> :buildSrc:compileGroovy<=------------> 14% INITIALIZING [15s]> buildSrc> :buildSrc:compileGroovy<=------------> 14% INITIALIZING [15s]> buildSrc> :buildSrc:compileGroovy<=------------> 14% INITIALIZING [16s]> buildSrc> :buildSrc:compileGroovy<=------------> 14% INITIALIZING [16s]> buildSrc> :buildSrc:compileGroovy<=------------> 14% INITIALIZING [16s]> buildSrc> :buildSrc:compileGroovy<=------------> 14% INITIALIZING [16s]> buildSrc> :buildSrc:compileGroovy<=------------> 14% INITIALIZING [16s]> buildSrc> :buildSrc:compileGroovy<=------------> 14% INITIALIZING [16s]> buildSrc> :buildSrc:compileGroovy<=------------> 14% INITIALIZING [16s]> buildSrc> :buildSrc:compileGroovy<=------------> 14% INITIALIZING [16s]> buildSrc> :buildSrc:compileGroovy<=------------> 14% INITIALIZING [16s]> buildSrc> :buildSrc:compileGroovy<=------------> 14% INITIALIZING [16s]> buildSrc> :buildSrc:compileGroovy<=------------> 14% INITIALIZING [17s]> buildSrc> :buildSrc:compileGroovy<=------------> 14% INITIALIZING [17s]> buildSrc> :buildSrc:compileGroovy<=------------> 14% INITIALIZING [17s]> buildSrc> :buildSrc:compileGroovy<=------------> 14% INITIALIZING [17s]> buildSrc> :buildSrc:compileGroovy<=------------> 14% INITIALIZING [17s]> buildSrc> :buildSrc:compileGroovy<=------------> 14% INITIALIZING [17s]> buildSrc> :buildSrc:compileGroovy<=------------> 14% INITIALIZING [17s]> buildSrc> :buildSrc:compileGroovy<=------------> 14% INITIALIZING [17s]> buildSrc> :buildSrc:compileGroovy<=------------> 14% INITIALIZING [17s]> buildSrc> :buildSrc:compileGroovy<=------------> 14% INITIALIZING [17s]> buildSrc> :buildSrc:compileGroovy<=------------> 14% INITIALIZING [18s]> buildSrc> :buildSrc:compileGroovy<====---------> 35% INITIALIZING [18s]> buildSrc> IDLE<=============> 100% INITIALIZING [18s]> IDLE<=============> 100% INITIALIZING [18s]> settings > Compiling /scratch/settings.gradle into local compilation cache<=============> 100% INITIALIZING [18s]> settings<-------------> 0% CONFIGURING [18s]> root project > Compiling /scratch/build.gradle into local compilation cache > Compiling build file '/scratch/build.gradle' to cross build script cache<-------------> 0% CONFIGURING [18s]> root project > Compiling /scratch/build.gradle into local compilation cache > Compiling build file '/scratch/build.gradle' to cross build script cache<-------------> 0% CONFIGURING [18s]> root project<-------------> 0% CONFIGURING [18s]> root project<-------------> 0% CONFIGURING [18s]> root project<-------------> 0% CONFIGURING [18s]> root project<-------------> 0% CONFIGURING [19s]> root project<-------------> 0% CONFIGURING [19s]> root project<-------------> 0% CONFIGURING [19s]> root project<-------------> 0% CONFIGURING [19s]> root project<-------------> 0% CONFIGURING [19s]> root project<-------------> 0% CONFIGURING [19s]> root project<-------------> 0% CONFIGURING [19s]> root project<-------------> 0% CONFIGURING [19s]> root project<-------------> 0% CONFIGURING [19s]> root project<-------------> 0% CONFIGURING [20s]> root project<-------------> 0% CONFIGURING [20s]> root project<-------------> 0% CONFIGURING [20s]> root project<-------------> 0% CONFIGURING [20s]> root project<-------------> 0% CONFIGURING [20s]> root project<-------------> 0% CONFIGURING [20s]> root project<-------------> 0% CONFIGURING [20s]> root project<-------------> 0% CONFIGURING [20s]> root project<-------------> 0% CONFIGURING [20s]> root project<-------------> 0% CONFIGURING [20s]> root project<-------------> 0% CONFIGURING [21s]> root project<-------------> 0% CONFIGURING [21s]> root project<-------------> 0% CONFIGURING [21s]> root project<-------------> 0% CONFIGURING [21s]> root project<-------------> 0% CONFIGURING [21s]> root project > Resolve dependencies :classpath
<-------------> 0% CONFIGURING [21s]> root project > Resolve dependencies :classpath > gradle-js-plugin-1.12.1.pom> license-gradle-plugin-0.11.0.pom> gradle-node-plugin-1.2.0.pom> gradle-versions-plugin-0.11.3.pom<-------------> 0% CONFIGURING [21s]> root project > Resolve dependencies :classpath > gradle-js-plugin-1.12.1.pom> license-gradle-plugin-0.11.0.pom> gradle-node-plugin-1.2.0.pom> gradle-versions-plugin-0.11.3.pom<-------------> 0% CONFIGURING [21s]> root project > Resolve dependencies :classpath > gradle-js-plugin-1.12.1.pom> license-gradle-plugin-0.11.0.pom> gradle-node-plugin-1.2.0.pom> gradle-versions-plugin-0.11.3.pom<-------------> 0% CONFIGURING [21s]> root project > Resolve dependencies :classpath > gradle-js-plugin-1.12.1.pom> license-gradle-plugin-0.11.0.pom> gradle-node-plugin-1.2.0.pom> gradle-versions-plugin-0.11.3.pom<-------------> 0% CONFIGURING [21s]> root project > Resolve dependencies :classpath > gradle-js-plugin-1.12.1.pom> license-gradle-plugin-0.11.0.pom> gradle-node-plugin-1.2.0.pom> gradle-versions-plugin-0.11.3.pom<-------------> 0% CONFIGURING [22s]> root project > Resolve dependencies :classpath > gradle-js-plugin-1.12.1.pom> license-gradle-plugin-0.11.0.pom> gradle-node-plugin-1.2.0.pom> gradle-versions-plugin-0.11.3.pom<-------------> 0% CONFIGURING [22s]> root project > Resolve dependencies :classpath > gradle-js-plugin-1.12.1.pom> license-gradle-plugin-0.11.0.pom> gradle-node-plugin-1.2.0.pom> gradle-versions-plugin-0.11.3.pom<-------------> 0% CONFIGURING [22s]> root project > Resolve dependencies :classpath > gradle-js-plugin-1.12.1.pom> license-gradle-plugin-0.11.0.pom> gradle-node-plugin-1.2.0.pom> gradle-versions-plugin-0.11.3.pomDownload https://plugins.gradle.org/m2/com/github/ben-manes/gradle-versions-plugin/0.11.3/gradle-versions-plugin-0.11.3.pom
Download https://plugins.gradle.org/m2/com/moowork/gradle/gradle-node-plugin/1.2.0/gradle-node-plugin-1.2.0.pom
Download https://plugins.gradle.org/m2/com/eriwen/gradle-js-plugin/1.12.1/gradle-js-plugin-1.12.1.pom
Download https://plugins.gradle.org/m2/nl/javadude/gradle/plugins/license-gradle-plugin/0.11.0/license-gradle-plugin-0.11.0.pom
<-------------> 0% CONFIGURING [22s]> root project > Resolve dependencies :classpath> IDLE> IDLE> IDLE<-------------> 0% CONFIGURING [22s]> root project > Resolve dependencies :classpath<-------------> 0% CONFIGURING [22s]> root project > Resolve dependencies :classpath> gradlePlugin-1.6.0.pom> jmh-gradle-plugin-0.4.4.pom<-------------> 0% CONFIGURING [22s]> root project > Resolve dependencies :classpath> gradlePlugin-1.6.0.pom> jmh-gradle-plugin-0.4.4.pom<-------------> 0% CONFIGURING [22s]> root project > Resolve dependencies :classpath> gradlePlugin-1.6.0.pom> jmh-gradle-plugin-0.4.4.pom<-------------> 0% CONFIGURING [22s]> root project > Resolve dependencies :classpath> gradlePlugin-1.6.0.pom> jmh-gradle-plugin-0.4.4.pom<-------------> 0% CONFIGURING [22s]> root project > Resolve dependencies :classpath> gradlePlugin-1.6.0.pom> jmh-gradle-plugin-0.4.4.pom<-------------> 0% CONFIGURING [22s]> root project > Resolve dependencies :classpath> gradlePlugin-1.6.0.pom> jmh-gradle-plugin-0.4.4.pom<-------------> 0% CONFIGURING [23s]> root project > Resolve dependencies :classpath> gradlePlugin-1.6.0.pom> jmh-gradle-plugin-0.4.4.pomDownload https://plugins.gradle.org/m2/me/champeau/gradle/jmh-gradle-plugin/0.4.4/jmh-gradle-plugin-0.4.4.pom
<-------------> 0% CONFIGURING [23s]> root project > Resolve dependencies :classpath> gradlePlugin-1.6.0.pom> IDLE> IDLE<-------------> 0% CONFIGURING [23s]> root project > Resolve dependencies :classpath> gradlePlugin-1.6.0.pom<-------------> 0% CONFIGURING [23s]> root project > Resolve dependencies :classpath> gradlePlugin-1.6.0.pom<-------------> 0% CONFIGURING [23s]> root project > Resolve dependencies :classpath> gradlePlugin-1.6.0.pom<-------------> 0% CONFIGURING [23s]> root project > Resolve dependencies :classpath> gradlePlugin-1.6.0.pom<-------------> 0% CONFIGURING [23s]> root project > Resolve dependencies :classpath> gradlePlugin-1.6.0.pom<-------------> 0% CONFIGURING [23s]> root project > Resolve dependencies :classpath> gradlePlugin-1.6.0.pom<-------------> 0% CONFIGURING [23s]> root project > Resolve dependencies :classpath> gradlePlugin-1.6.0.pomDownload https://plugins.gradle.org/m2/gradle/plugin/com/github/spotbugs/gradlePlugin/1.6.0/gradlePlugin-1.6.0.pom
<-------------> 0% CONFIGURING [24s]> root project > Resolve dependencies :classpath > closure-compiler-v20131014.pom> html2js-0.1.pom> IDLE> IDLE<-------------> 0% CONFIGURING [24s]> root project > Resolve dependencies :classpath > closure-compiler-v20131014.pom> html2js-0.1.pom<-------------> 0% CONFIGURING [24s]> root project > Resolve dependencies :classpath > closure-compiler-v20131014.pom> html2js-0.1.pom<-------------> 0% CONFIGURING [24s]> root project > Resolve dependencies :classpath > closure-compiler-v20131014.pom> html2js-0.1.pom<-------------> 0% CONFIGURING [24s]> root project > Resolve dependencies :classpath > closure-compiler-v20131014.pom> html2js-0.1.pomDownload https://plugins.gradle.org/m2/com/google/javascript/closure-compiler/v20131014/closure-compiler-v20131014.pom
Download https://plugins.gradle.org/m2/io/jdev/html2js/html2js/0.1/html2js-0.1.pom
<-------------> 0% CONFIGURING [24s]> root project > Resolve dependencies :classpath > xstream-1.4.7.pom> IDLE> IDLE> IDLE<-------------> 0% CONFIGURING [24s]> root project > Resolve dependencies :classpath > xstream-1.4.7.pom<-------------> 0% CONFIGURING [24s]> root project > Resolve dependencies :classpath > xstream-1.4.7.pom<-------------> 0% CONFIGURING [24s]> root project > Resolve dependencies :classpath > xstream-1.4.7.pomDownload https://plugins.gradle.org/m2/com/thoughtworks/xstream/xstream/1.4.7/xstream-1.4.7.pom
<-------------> 0% CONFIGURING [24s]> root project > Resolve dependencies :classpath > xstream-parent-1.4.7.pom> IDLE> IDLE> IDLE<-------------> 0% CONFIGURING [25s]> root project > Resolve dependencies :classpath > xstream-parent-1.4.7.pom<-------------> 0% CONFIGURING [25s]> root project > Resolve dependencies :classpath > xstream-parent-1.4.7.pom<-------------> 0% CONFIGURING [25s]> root project > Resolve dependencies :classpath > xstream-parent-1.4.7.pomDownload https://plugins.gradle.org/m2/com/thoughtworks/xstream/xstream-parent/1.4.7/xstream-parent-1.4.7.pom
<-------------> 0% CONFIGURING [25s]> root project > Resolve dependencies :classpath> IDLE> IDLE> IDLE<-------------> 0% CONFIGURING [25s]> root project > Resolve dependencies :classpath > codehaus-parent-3.pom<-------------> 0% CONFIGURING [25s]> root project > Resolve dependencies :classpath > codehaus-parent-3.pom<-------------> 0% CONFIGURING [25s]> root project > Resolve dependencies :classpath > codehaus-parent-3.pom<-------------> 0% CONFIGURING [25s]> root project > Resolve dependencies :classpath > codehaus-parent-3.pomDownload https://plugins.gradle.org/m2/org/codehaus/codehaus-parent/3/codehaus-parent-3.pom
<-------------> 0% CONFIGURING [25s]> root project > Resolve dependencies :classpath> IDLE> IDLE> IDLE<-------------> 0% CONFIGURING [25s]> root project > Resolve dependencies :classpath<-------------> 0% CONFIGURING [25s]> root project > Resolve dependencies :classpath > guava-17.0.pom> maven-license-plugin-1.10.b1.pom<-------------> 0% CONFIGURING [26s]> root project > Resolve dependencies :classpath > guava-17.0.pom> maven-license-plugin-1.10.b1.pom<-------------> 0% CONFIGURING [26s]> root project > Resolve dependencies :classpath > guava-17.0.pom> maven-license-plugin-1.10.b1.pomDownload https://plugins.gradle.org/m2/com/google/guava/guava/17.0/guava-17.0.pom
<-------------> 0% CONFIGURING [26s]> root project > Resolve dependencies :classpath> maven-license-plugin-1.10.b1.pom> IDLE> IDLEDownload https://plugins.gradle.org/m2/com/mycila/maven-license-plugin/maven-license-plugin/1.10.b1/maven-license-plugin-1.10.b1.pom
<-------------> 0% CONFIGURING [26s]> root project > Resolve dependencies :classpath > guava-parent-17.0.pom> parent-pom-5.pom> IDLE> IDLE<-------------> 0% CONFIGURING [26s]> root project > Resolve dependencies :classpath > guava-parent-17.0.pom> parent-pom-5.pom<-------------> 0% CONFIGURING [26s]> root project > Resolve dependencies :classpath > guava-parent-17.0.pom> parent-pom-5.pom<-------------> 0% CONFIGURING [26s]> root project > Resolve dependencies :classpath > guava-parent-17.0.pom> parent-pom-5.pomDownload https://plugins.gradle.org/m2/com/google/guava/guava-parent/17.0/guava-parent-17.0.pom
Download https://plugins.gradle.org/m2/com/mycila/parent-pom/5/parent-pom-5.pom
<-------------> 0% CONFIGURING [26s]> root project > Resolve dependencies :classpath > oss-parent-7.pom> IDLE> IDLE> IDLE<-------------> 0% CONFIGURING [26s]> root project > Resolve dependencies :classpath > oss-parent-7.pom<-------------> 0% CONFIGURING [26s]> root project > Resolve dependencies :classpath > oss-parent-7.pom<-------------> 0% CONFIGURING [27s]> root project > Resolve dependencies :classpath > oss-parent-7.pomDownload https://plugins.gradle.org/m2/org/sonatype/oss/oss-parent/7/oss-parent-7.pom
<-------------> 0% CONFIGURING [27s]> root project > Resolve dependencies :classpath > jmh-core-1.19.pom> IDLE> IDLE> IDLE<-------------> 0% CONFIGURING [27s]> root project > Resolve dependencies :classpath > jmh-core-1.19.pom<-------------> 0% CONFIGURING [27s]> root project > Resolve dependencies :classpath > jmh-core-1.19.pom<-------------> 0% CONFIGURING [27s]> root project > Resolve dependencies :classpath > jmh-core-1.19.pomDownload https://plugins.gradle.org/m2/org/openjdk/jmh/jmh-core/1.19/jmh-core-1.19.pom
<-------------> 0% CONFIGURING [27s]> root project > Resolve dependencies :classpath > jmh-parent-1.19.pom> IDLE> IDLE> IDLE<-------------> 0% CONFIGURING [27s]> root project > Resolve dependencies :classpath > jmh-parent-1.19.pom<-------------> 0% CONFIGURING [27s]> root project > Resolve dependencies :classpath > jmh-parent-1.19.pom<-------------> 0% CONFIGURING [27s]> root project > Resolve dependencies :classpath > jmh-parent-1.19.pomDownload https://plugins.gradle.org/m2/org/openjdk/jmh/jmh-parent/1.19/jmh-parent-1.19.pom
<-------------> 0% CONFIGURING [28s]> root project > Resolve dependencies :classpath > spotbugs-3.1.0.pom> IDLE> IDLE> IDLE<-------------> 0% CONFIGURING [28s]> root project > Resolve dependencies :classpath > spotbugs-3.1.0.pom<-------------> 0% CONFIGURING [28s]> root project > Resolve dependencies :classpath > spotbugs-3.1.0.pom<-------------> 0% CONFIGURING [28s]> root project > Resolve dependencies :classpath > spotbugs-3.1.0.pom<-------------> 0% CONFIGURING [28s]> root project > Resolve dependencies :classpath > spotbugs-3.1.0.pomDownload https://plugins.gradle.org/m2/com/github/spotbugs/spotbugs/3.1.0/spotbugs-3.1.0.pom
<-------------> 0% CONFIGURING [28s]> root project > Resolve dependencies :classpath > args4j-2.0.16.pom> protobuf-java-2.4.1.pom> json-20090211.pom> jsr305-1.3.9.pom<-------------> 0% CONFIGURING [28s]> root project > Resolve dependencies :classpath > args4j-2.0.16.pom> protobuf-java-2.4.1.pom> json-20090211.pom> jsr305-1.3.9.pom<-------------> 0% CONFIGURING [28s]> root project > Resolve dependencies :classpath > args4j-2.0.16.pom> protobuf-java-2.4.1.pom> json-20090211.pom> jsr305-1.3.9.pomDownload https://plugins.gradle.org/m2/com/google/code/findbugs/jsr305/1.3.9/jsr305-1.3.9.pom
<-------------> 0% CONFIGURING [28s]> root project > Resolve dependencies :classpath > args4j-2.0.16.pom> protobuf-java-2.4.1.pom> json-20090211.pom> IDLEDownload https://plugins.gradle.org/m2/org/json/json/20090211/json-20090211.pom
Download https://plugins.gradle.org/m2/args4j/args4j/2.0.16/args4j-2.0.16.pom
Download https://plugins.gradle.org/m2/com/google/protobuf/protobuf-java/2.4.1/protobuf-java-2.4.1.pom
<-------------> 0% CONFIGURING [28s]> root project > Resolve dependencies :classpath > args4j-site-2.0.16.pom> google-1.pom> IDLE> IDLE<-------------> 0% CONFIGURING [28s]> root project > Resolve dependencies :classpath > args4j-site-2.0.16.pom> google-1.pom<-------------> 0% CONFIGURING [29s]> root project > Resolve dependencies :classpath > args4j-site-2.0.16.pom> google-1.pom<-------------> 0% CONFIGURING [29s]> root project > Resolve dependencies :classpath > args4j-site-2.0.16.pom> google-1.pomDownload https://plugins.gradle.org/m2/com/google/google/1/google-1.pom
Download https://plugins.gradle.org/m2/args4j/args4j-site/2.0.16/args4j-site-2.0.16.pom
<-------------> 0% CONFIGURING [29s]> root project > Resolve dependencies :classpath > xpp3_min-1.1.4c.pom> xmlpull-1.1.3.1.pom> IDLE> IDLE<-------------> 0% CONFIGURING [29s]> root project > Resolve dependencies :classpath > xpp3_min-1.1.4c.pom> xmlpull-1.1.3.1.pom<-------------> 0% CONFIGURING [29s]> root project > Resolve dependencies :classpath > xpp3_min-1.1.4c.pom> xmlpull-1.1.3.1.pom<-------------> 0% CONFIGURING [29s]> root project > Resolve dependencies :classpath > xpp3_min-1.1.4c.pom> xmlpull-1.1.3.1.pomDownload https://plugins.gradle.org/m2/xpp3/xpp3_min/1.1.4c/xpp3_min-1.1.4c.pom
Download https://plugins.gradle.org/m2/xmlpull/xmlpull/1.1.3.1/xmlpull-1.1.3.1.pom
<-------------> 0% CONFIGURING [29s]> root project > Resolve dependencies :classpath > maven-plugin-api-3.0.1.pom> xmltool-3.3.pom> plexus-utils-2.0.5.pom> maven-project-3.0-alpha-2.pom<-------------> 0% CONFIGURING [29s]> root project > Resolve dependencies :classpath > maven-plugin-api-3.0.1.pom> xmltool-3.3.pom> plexus-utils-2.0.5.pom> maven-project-3.0-alpha-2.pom<-------------> 0% CONFIGURING [29s]> root project > Resolve dependencies :classpath > maven-plugin-api-3.0.1.pom> xmltool-3.3.pom> plexus-utils-2.0.5.pom> maven-project-3.0-alpha-2.pom<-------------> 0% CONFIGURING [29s]> root project > Resolve dependencies :classpath > maven-plugin-api-3.0.1.pom> xmltool-3.3.pom> plexus-utils-2.0.5.pom> maven-project-3.0-alpha-2.pomDownload https://plugins.gradle.org/m2/org/apache/maven/maven-plugin-api/3.0.1/maven-plugin-api-3.0.1.pom
Download https://plugins.gradle.org/m2/com/mycila/xmltool/xmltool/3.3/xmltool-3.3.pom
<-------------> 0% CONFIGURING [30s]> root project > Resolve dependencies :classpath > maven-3.0.1.pom> IDLE> plexus-utils-2.0.5.pom> maven-project-3.0-alpha-2.pomDownload https://plugins.gradle.org/m2/org/codehaus/plexus/plexus-utils/2.0.5/plexus-utils-2.0.5.pom
Download https://plugins.gradle.org/m2/org/apache/maven/maven-project/3.0-alpha-2/maven-project-3.0-alpha-2.pom
<-------------> 0% CONFIGURING [30s]> root project > Resolve dependencies :classpath > maven-3.0.1.pom> IDLE> plexus-2.0.6.pom> maven-3.0-alpha-2.pom<-------------> 0% CONFIGURING [30s]> root project > Resolve dependencies :classpath > maven-3.0.1.pom> plexus-2.0.6.pom> maven-3.0-alpha-2.pom<-------------> 0% CONFIGURING [30s]> root project > Resolve dependencies :classpath > maven-3.0.1.pom> plexus-2.0.6.pom> maven-3.0-alpha-2.pomDownload https://plugins.gradle.org/m2/org/apache/maven/maven/3.0.1/maven-3.0.1.pom
<-------------> 0% CONFIGURING [30s]> root project > Resolve dependencies :classpath> IDLE> plexus-2.0.6.pom> maven-3.0-alpha-2.pomDownload https://plugins.gradle.org/m2/org/codehaus/plexus/plexus/2.0.6/plexus-2.0.6.pom
<-------------> 0% CONFIGURING [30s]> root project > Resolve dependencies :classpath > maven-parent-15.pom> IDLE> IDLE> maven-3.0-alpha-2.pomDownload https://plugins.gradle.org/m2/org/apache/maven/maven/3.0-alpha-2/maven-3.0-alpha-2.pom
<-------------> 0% CONFIGURING [30s]> root project > Resolve dependencies :classpath > maven-parent-15.pom> IDLE> IDLE> maven-parent-10.pom<-------------> 0% CONFIGURING [30s]> root project > Resolve dependencies :classpath > maven-parent-15.pom> maven-parent-10.pomDownload https://plugins.gradle.org/m2/org/apache/maven/maven-parent/15/maven-parent-15.pom
<-------------> 0% CONFIGURING [30s]> root project > Resolve dependencies :classpath > maven-parent-15.pom > 5 KB/23 KB downloaded> IDLE> IDLE> maven-parent-10.pom<-------------> 0% CONFIGURING [31s]> root project > Resolve dependencies :classpath > apache-6.pom> maven-parent-10.pomDownload https://plugins.gradle.org/m2/org/apache/maven/maven-parent/10/maven-parent-10.pom
<-------------> 0% CONFIGURING [31s]> root project > Resolve dependencies :classpath > apache-6.pom> IDLE> IDLE> apache-4.pom<-------------> 0% CONFIGURING [31s]> root project > Resolve dependencies :classpath > apache-6.pom> apache-4.pom<-------------> 0% CONFIGURING [31s]> root project > Resolve dependencies :classpath > apache-6.pom> apache-4.pomDownload https://plugins.gradle.org/m2/org/apache/apache/6/apache-6.pom
<-------------> 0% CONFIGURING [31s]> root project > Resolve dependencies :classpath> IDLE> IDLE> apache-4.pomDownload https://plugins.gradle.org/m2/org/apache/apache/4/apache-4.pom
<-------------> 0% CONFIGURING [31s]> root project > Resolve dependencies :classpath > jopt-simple-4.6.pom> IDLE> IDLE> commons-math3-3.2.pom<-------------> 0% CONFIGURING [31s]> root project > Resolve dependencies :classpath > jopt-simple-4.6.pom> commons-math3-3.2.pom<-------------> 0% CONFIGURING [31s]> root project > Resolve dependencies :classpath > jopt-simple-4.6.pom> commons-math3-3.2.pom<-------------> 0% CONFIGURING [31s]> root project > Resolve dependencies :classpath > jopt-simple-4.6.pom> commons-math3-3.2.pomDownload https://plugins.gradle.org/m2/net/sf/jopt-simple/jopt-simple/4.6/jopt-simple-4.6.pom
<-------------> 0% CONFIGURING [31s]> root project > Resolve dependencies :classpath> IDLE> IDLE> commons-math3-3.2.pomDownload https://plugins.gradle.org/m2/org/apache/commons/commons-math3/3.2/commons-math3-3.2.pom
<-------------> 0% CONFIGURING [32s]> root project > Resolve dependencies :classpath> IDLE> IDLE> commons-parent-28.pom<-------------> 0% CONFIGURING [32s]> root project > Resolve dependencies :classpath> commons-parent-28.pom<-------------> 0% CONFIGURING [32s]> root project > Resolve dependencies :classpath> commons-parent-28.pomDownload https://plugins.gradle.org/m2/org/apache/commons/commons-parent/28/commons-parent-28.pom
<-------------> 0% CONFIGURING [32s]> root project > Resolve dependencies :classpath> IDLE> IDLE> apache-13.pom<-------------> 0% CONFIGURING [32s]> root project > Resolve dependencies :classpath> apache-13.pom<-------------> 0% CONFIGURING [32s]> root project > Resolve dependencies :classpath> apache-13.pom<-------------> 0% CONFIGURING [32s]> root project > Resolve dependencies :classpath> apache-13.pomDownload https://plugins.gradle.org/m2/org/apache/apache/13/apache-13.pom
<-------------> 0% CONFIGURING [32s]> root project > Resolve dependencies :classpath > asm-6.0.pom> asm-tree-6.0.pom> asm-util-6.0.pom> asm-analysis-6.0.pom<-------------> 0% CONFIGURING [32s]> root project > Resolve dependencies :classpath > asm-6.0.pom> asm-tree-6.0.pom> asm-util-6.0.pom> asm-analysis-6.0.pom<-------------> 0% CONFIGURING [32s]> root project > Resolve dependencies :classpath > asm-6.0.pom> asm-tree-6.0.pom> asm-util-6.0.pom> asm-analysis-6.0.pom<-------------> 0% CONFIGURING [33s]> root project > Resolve dependencies :classpath > asm-6.0.pom> asm-tree-6.0.pom> asm-util-6.0.pom> asm-analysis-6.0.pomDownload https://plugins.gradle.org/m2/org/ow2/asm/asm-util/6.0/asm-util-6.0.pom
Download https://plugins.gradle.org/m2/org/ow2/asm/asm-analysis/6.0/asm-analysis-6.0.pom
Download https://plugins.gradle.org/m2/org/ow2/asm/asm/6.0/asm-6.0.pom
<-------------> 0% CONFIGURING [33s]> root project > Resolve dependencies :classpath> asm-tree-6.0.pom> IDLE> asm-parent-6.0.pom<-------------> 0% CONFIGURING [33s]> root project > Resolve dependencies :classpath> asm-tree-6.0.pom> asm-parent-6.0.pomDownload https://plugins.gradle.org/m2/org/ow2/asm/asm-tree/6.0/asm-tree-6.0.pom
<-------------> 0% CONFIGURING [33s]> root project > Resolve dependencies :classpath> IDLE> IDLE> asm-parent-6.0.pom<-------------> 0% CONFIGURING [33s]> root project > Resolve dependencies :classpath> asm-parent-6.0.pomDownload https://plugins.gradle.org/m2/org/ow2/asm/asm-parent/6.0/asm-parent-6.0.pom
<-------------> 0% CONFIGURING [33s]> root project > Resolve dependencies :classpath> IDLE> IDLE> ow2-1.3.pom<-------------> 0% CONFIGURING [33s]> root project > Resolve dependencies :classpath> ow2-1.3.pom<-------------> 0% CONFIGURING [33s]> root project > Resolve dependencies :classpath> ow2-1.3.pom<-------------> 0% CONFIGURING [33s]> root project > Resolve dependencies :classpath> ow2-1.3.pomDownload https://plugins.gradle.org/m2/org/ow2/ow2/1.3/ow2-1.3.pom
<-------------> 0% CONFIGURING [33s]> root project > Resolve dependencies :classpath > bcel-6.1.pom> jcip-annotations-1.0.pom> dom4j-1.6.1.pom> asm-xml-6.0.pom<-------------> 0% CONFIGURING [34s]> root project > Resolve dependencies :classpath > bcel-6.1.pom> jcip-annotations-1.0.pom> dom4j-1.6.1.pom> asm-xml-6.0.pom<-------------> 0% CONFIGURING [34s]> root project > Resolve dependencies :classpath > bcel-6.1.pom> jcip-annotations-1.0.pom> dom4j-1.6.1.pom> asm-xml-6.0.pom<-------------> 0% CONFIGURING [34s]> root project > Resolve dependencies :classpath > bcel-6.1.pom> jcip-annotations-1.0.pom> dom4j-1.6.1.pom> asm-xml-6.0.pomDownload https://plugins.gradle.org/m2/org/apache/bcel/bcel/6.1/bcel-6.1.pom
Download https://plugins.gradle.org/m2/org/ow2/asm/asm-xml/6.0/asm-xml-6.0.pom
Download https://plugins.gradle.org/m2/dom4j/dom4j/1.6.1/dom4j-1.6.1.pom
<-------------> 0% CONFIGURING [34s]> root project > Resolve dependencies :classpath > commons-parent-42.pom> jcip-annotations-1.0.pom> commons-lang-2.6.pom> jaxen-1.1.6.pomDownload https://plugins.gradle.org/m2/net/jcip/jcip-annotations/1.0/jcip-annotations-1.0.pom
<-------------> 0% CONFIGURING [34s]> root project > Resolve dependencies :classpath > commons-parent-42.pom> jFormatString-3.0.0.pom> commons-lang-2.6.pom> jaxen-1.1.6.pom<-------------> 0% CONFIGURING [34s]> root project > Resolve dependencies :classpath > commons-parent-42.pom> jFormatString-3.0.0.pom> commons-lang-2.6.pom> jaxen-1.1.6.pom<-------------> 0% CONFIGURING [34s]> root project > Resolve dependencies :classpath > commons-parent-42.pom> jFormatString-3.0.0.pom> commons-lang-2.6.pom> jaxen-1.1.6.pomDownload https://plugins.gradle.org/m2/org/apache/commons/commons-parent/42/commons-parent-42.pom
Download https://plugins.gradle.org/m2/jaxen/jaxen/1.1.6/jaxen-1.1.6.pom
Download https://plugins.gradle.org/m2/commons-lang/commons-lang/2.6/commons-lang-2.6.pom
<-------------> 0% CONFIGURING [34s]> root project > Resolve dependencies :classpath > apache-18.pom> jFormatString-3.0.0.pom> commons-parent-17.pom> spotbugs-annotations-3.1.0.pom<-------------> 0% CONFIGURING [34s]> root project > Resolve dependencies :classpath > apache-18.pom> jFormatString-3.0.0.pom> commons-parent-17.pom> spotbugs-annotations-3.1.0.pomDownload https://plugins.gradle.org/m2/com/google/code/findbugs/jFormatString/3.0.0/jFormatString-3.0.0.pom
<-------------> 0% CONFIGURING [34s]> root project > Resolve dependencies :classpath > apache-18.pom> asm-commons-6.0.pom> commons-parent-17.pom> spotbugs-annotations-3.1.0.pomDownload https://plugins.gradle.org/m2/org/apache/apache/18/apache-18.pom
<-------------> 0% CONFIGURING [35s]> root project > Resolve dependencies :classpath> asm-commons-6.0.pom> commons-parent-17.pom> spotbugs-annotations-3.1.0.pomDownload https://plugins.gradle.org/m2/org/apache/commons/commons-parent/17/commons-parent-17.pom
Download https://plugins.gradle.org/m2/com/github/spotbugs/spotbugs-annotations/3.1.0/spotbugs-annotations-3.1.0.pom
<-------------> 0% CONFIGURING [35s]> root project > Resolve dependencies :classpath> asm-commons-6.0.pom> IDLE> apache-7.pom<-------------> 0% CONFIGURING [35s]> root project > Resolve dependencies :classpath> asm-commons-6.0.pom> apache-7.pomDownload https://plugins.gradle.org/m2/org/ow2/asm/asm-commons/6.0/asm-commons-6.0.pom
<-------------> 0% CONFIGURING [35s]> root project > Resolve dependencies :classpath> IDLE> IDLE> apache-7.pom<-------------> 0% CONFIGURING [35s]> root project > Resolve dependencies :classpath> apache-7.pomDownload https://plugins.gradle.org/m2/org/apache/apache/7/apache-7.pom
<-------------> 0% CONFIGURING [35s]> root project > Resolve dependencies :classpath> IDLE> IDLE> IDLE<-------------> 0% CONFIGURING [35s]> root project > Resolve dependencies :classpath > maven-model-3.0.1.pom> maven-artifact-3.0.1.pom> sisu-inject-plexus-1.4.3.1.pom<-------------> 0% CONFIGURING [35s]> root project > Resolve dependencies :classpath > maven-model-3.0.1.pom> maven-artifact-3.0.1.pom> sisu-inject-plexus-1.4.3.1.pom<-------------> 0% CONFIGURING [35s]> root project > Resolve dependencies :classpath > maven-model-3.0.1.pom> maven-artifact-3.0.1.pom> sisu-inject-plexus-1.4.3.1.pom<-------------> 0% CONFIGURING [35s]> root project > Resolve dependencies :classpath > maven-model-3.0.1.pom> maven-artifact-3.0.1.pom> sisu-inject-plexus-1.4.3.1.pomDownload https://plugins.gradle.org/m2/org/apache/maven/maven-artifact/3.0.1/maven-artifact-3.0.1.pom
Download https://plugins.gradle.org/m2/org/apache/maven/maven-model/3.0.1/maven-model-3.0.1.pom
Download https://plugins.gradle.org/m2/org/sonatype/sisu/sisu-inject-plexus/1.4.3.1/sisu-inject-plexus-1.4.3.1.pom
<-------------> 0% CONFIGURING [36s]> root project > Resolve dependencies :classpath> IDLE> IDLE> guice-plexus-1.4.3.1.pom<-------------> 0% CONFIGURING [36s]> root project > Resolve dependencies :classpath> guice-plexus-1.4.3.1.pom<-------------> 0% CONFIGURING [36s]> root project > Resolve dependencies :classpath> guice-plexus-1.4.3.1.pom<-------------> 0% CONFIGURING [36s]> root project > Resolve dependencies :classpath> guice-plexus-1.4.3.1.pomDownload https://plugins.gradle.org/m2/org/sonatype/sisu/inject/guice-plexus/1.4.3.1/guice-plexus-1.4.3.1.pom
<-------------> 0% CONFIGURING [36s]> root project > Resolve dependencies :classpath> IDLE> IDLE> guice-bean-1.4.3.1.pom<-------------> 0% CONFIGURING [36s]> root project > Resolve dependencies :classpath> guice-bean-1.4.3.1.pom<-------------> 0% CONFIGURING [36s]> root project > Resolve dependencies :classpath> guice-bean-1.4.3.1.pom<-------------> 0% CONFIGURING [36s]> root project > Resolve dependencies :classpath> guice-bean-1.4.3.1.pomDownload https://plugins.gradle.org/m2/org/sonatype/sisu/inject/guice-bean/1.4.3.1/guice-bean-1.4.3.1.pom
<-------------> 0% CONFIGURING [36s]> root project > Resolve dependencies :classpath> IDLE> IDLE> sisu-inject-1.4.3.1.pom<-------------> 0% CONFIGURING [36s]> root project > Resolve dependencies :classpath> sisu-inject-1.4.3.1.pom<-------------> 0% CONFIGURING [37s]> root project > Resolve dependencies :classpath> sisu-inject-1.4.3.1.pom<-------------> 0% CONFIGURING [37s]> root project > Resolve dependencies :classpath> sisu-inject-1.4.3.1.pomDownload https://plugins.gradle.org/m2/org/sonatype/sisu/sisu-inject/1.4.3.1/sisu-inject-1.4.3.1.pom
<-------------> 0% CONFIGURING [37s]> root project > Resolve dependencies :classpath> IDLE> IDLE> sisu-parent-1.4.3.1.pom<-------------> 0% CONFIGURING [37s]> root project > Resolve dependencies :classpath> sisu-parent-1.4.3.1.pom<-------------> 0% CONFIGURING [37s]> root project > Resolve dependencies :classpath> sisu-parent-1.4.3.1.pom<-------------> 0% CONFIGURING [37s]> root project > Resolve dependencies :classpath> sisu-parent-1.4.3.1.pomDownload https://plugins.gradle.org/m2/org/sonatype/sisu/sisu-parent/1.4.3.1/sisu-parent-1.4.3.1.pom
<-------------> 0% CONFIGURING [37s]> root project > Resolve dependencies :classpath> IDLE> IDLE> forge-parent-6.pom<-------------> 0% CONFIGURING [37s]> root project > Resolve dependencies :classpath> forge-parent-6.pom<-------------> 0% CONFIGURING [37s]> root project > Resolve dependencies :classpath> forge-parent-6.pom<-------------> 0% CONFIGURING [37s]> root project > Resolve dependencies :classpath> forge-parent-6.pom<-------------> 0% CONFIGURING [37s]> root project > Resolve dependencies :classpath> forge-parent-6.pomDownload https://plugins.gradle.org/m2/org/sonatype/forge/forge-parent/6/forge-parent-6.pom
<-------------> 0% CONFIGURING [38s]> root project > Resolve dependencies :classpath > plexus-interpolation-1.1.pom> wstx-asl-3.2.6.pom> plexus-container-default-1.0-beta-3.0.5.pom> maven-compat-3.0-alpha-2.pom<-------------> 0% CONFIGURING [38s]> root project > Resolve dependencies :classpath > plexus-interpolation-1.1.pom> wstx-asl-3.2.6.pom> plexus-container-default-1.0-beta-3.0.5.pom> maven-compat-3.0-alpha-2.pom<-------------> 0% CONFIGURING [38s]> root project > Resolve dependencies :classpath > plexus-interpolation-1.1.pom> wstx-asl-3.2.6.pom> plexus-container-default-1.0-beta-3.0.5.pom> maven-compat-3.0-alpha-2.pom<-------------> 0% CONFIGURING [38s]> root project > Resolve dependencies :classpath > plexus-interpolation-1.1.pom> wstx-asl-3.2.6.pom> plexus-container-default-1.0-beta-3.0.5.pom> maven-compat-3.0-alpha-2.pomDownload https://plugins.gradle.org/m2/org/codehaus/plexus/plexus-interpolation/1.1/plexus-interpolation-1.1.pom
Download https://plugins.gradle.org/m2/org/codehaus/plexus/plexus-container-default/1.0-beta-3.0.5/plexus-container-default-1.0-beta-3.0.5.pom
<-------------> 0% CONFIGURING [38s]> root project > Resolve dependencies :classpath > plexus-1.0.11.pom> wstx-asl-3.2.6.pom> IDLE> maven-compat-3.0-alpha-2.pomDownload https://plugins.gradle.org/m2/org/apache/maven/maven-compat/3.0-alpha-2/maven-compat-3.0-alpha-2.pom
Download https://plugins.gradle.org/m2/org/codehaus/woodstox/wstx-asl/3.2.6/wstx-asl-3.2.6.pom
<-------------> 0% CONFIGURING [38s]> root project > Resolve dependencies :classpath > plexus-1.0.11.pom> maven-project-builder-3.0-alpha-2.pom> plexus-containers-1.0-beta-3.0.5.pom> model-builder-1.3.pom<-------------> 0% CONFIGURING [38s]> root project > Resolve dependencies :classpath > plexus-1.0.11.pom> maven-project-builder-3.0-alpha-2.pom> plexus-containers-1.0-beta-3.0.5.pom> model-builder-1.3.pom<-------------> 0% CONFIGURING [38s]> root project > Resolve dependencies :classpath > plexus-1.0.11.pom> maven-project-builder-3.0-alpha-2.pom> plexus-containers-1.0-beta-3.0.5.pom> model-builder-1.3.pomDownload https://plugins.gradle.org/m2/org/codehaus/plexus/plexus/1.0.11/plexus-1.0.11.pom
<-------------> 0% CONFIGURING [38s]> root project > Resolve dependencies :classpath> maven-project-builder-3.0-alpha-2.pom> plexus-containers-1.0-beta-3.0.5.pom> model-builder-1.3.pomDownload https://plugins.gradle.org/m2/org/codehaus/plexus/plexus-containers/1.0-beta-3.0.5/plexus-containers-1.0-beta-3.0.5.pom
Download https://plugins.gradle.org/m2/org/apache/maven/maven-project-builder/3.0-alpha-2/maven-project-builder-3.0-alpha-2.pom
<-------------> 0% CONFIGURING [39s]> root project > Resolve dependencies :classpath> IDLE> plexus-2.0.2.pom> model-builder-1.3.pomDownload https://plugins.gradle.org/m2/org/sonatype/spice/model-builder/1.3/model-builder-1.3.pom
<-------------> 0% CONFIGURING [39s]> root project > Resolve dependencies :classpath> IDLE> plexus-2.0.2.pom> spice-parent-10.pom<-------------> 0% CONFIGURING [39s]> root project > Resolve dependencies :classpath> plexus-2.0.2.pom> spice-parent-10.pom<-------------> 0% CONFIGURING [39s]> root project > Resolve dependencies :classpath> IDLE> spice-parent-10.pom<-------------> 0% CONFIGURING [39s]> root project > Resolve dependencies :classpath> spice-parent-10.pomDownload https://plugins.gradle.org/m2/org/sonatype/spice/spice-parent/10/spice-parent-10.pom
<-------------> 0% CONFIGURING [39s]> root project > Resolve dependencies :classpath> IDLE> IDLE> forge-parent-3.pom<-------------> 0% CONFIGURING [39s]> root project > Resolve dependencies :classpath> forge-parent-3.pom<-------------> 0% CONFIGURING [39s]> root project > Resolve dependencies :classpath > xml-apis-1.0.b2.pom> IDLE<-------------> 0% CONFIGURING [39s]> root project > Resolve dependencies :classpath > xml-apis-1.0.b2.pom<-------------> 0% CONFIGURING [39s]> root project > Resolve dependencies :classpath > xml-apis-1.0.b2.pomDownload https://plugins.gradle.org/m2/xml-apis/xml-apis/1.0.b2/xml-apis-1.0.b2.pom
<-------------> 0% CONFIGURING [39s]> root project > Resolve dependencies :classpath > plexus-classworlds-2.2.3.pom> IDLE> sisu-inject-bean-1.4.3.1.pom> plexus-component-annotations-1.5.5.pom<-------------> 0% CONFIGURING [40s]> root project > Resolve dependencies :classpath > plexus-classworlds-2.2.3.pom> sisu-inject-bean-1.4.3.1.pom> plexus-component-annotations-1.5.5.pom<-------------> 0% CONFIGURING [40s]> root project > Resolve dependencies :classpath > plexus-classworlds-2.2.3.pom> sisu-inject-bean-1.4.3.1.pom> plexus-component-annotations-1.5.5.pom<-------------> 0% CONFIGURING [40s]> root project > Resolve dependencies :classpath > plexus-classworlds-2.2.3.pom> sisu-inject-bean-1.4.3.1.pom> plexus-component-annotations-1.5.5.pomDownload https://plugins.gradle.org/m2/org/codehaus/plexus/plexus-classworlds/2.2.3/plexus-classworlds-2.2.3.pom
Download https://plugins.gradle.org/m2/org/codehaus/plexus/plexus-component-annotations/1.5.5/plexus-component-annotations-1.5.5.pom
<-------------> 0% CONFIGURING [40s]> root project > Resolve dependencies :classpath> IDLE> sisu-inject-bean-1.4.3.1.pom> plexus-containers-1.5.5.pomDownload https://plugins.gradle.org/m2/org/sonatype/sisu/sisu-inject-bean/1.4.3.1/sisu-inject-bean-1.4.3.1.pom
<-------------> 0% CONFIGURING [40s]> root project > Resolve dependencies :classpath> IDLE> IDLE> plexus-containers-1.5.5.pom<-------------> 0% CONFIGURING [40s]> root project > Resolve dependencies :classpath> plexus-containers-1.5.5.pom<-------------> 0% CONFIGURING [40s]> root project > Resolve dependencies :classpath> plexus-containers-1.5.5.pomDownload https://plugins.gradle.org/m2/org/codehaus/plexus/plexus-containers/1.5.5/plexus-containers-1.5.5.pom
<-------------> 0% CONFIGURING [40s]> root project > Resolve dependencies :classpath> IDLE> IDLE> plexus-2.0.7.pom<-------------> 0% CONFIGURING [40s]> root project > Resolve dependencies :classpath> plexus-2.0.7.pom<-------------> 0% CONFIGURING [40s]> root project > Resolve dependencies :classpath> plexus-2.0.7.pom<-------------> 0% CONFIGURING [41s]> root project > Resolve dependencies :classpath> plexus-2.0.7.pomDownload https://plugins.gradle.org/m2/org/codehaus/plexus/plexus/2.0.7/plexus-2.0.7.pom
<-------------> 0% CONFIGURING [41s]> root project > Resolve dependencies :classpath > wagon-provider-api-1.0-beta-4.pom> IDLE> IDLE> IDLE<-------------> 0% CONFIGURING [41s]> root project > Resolve dependencies :classpath > wagon-provider-api-1.0-beta-4.pom<-------------> 0% CONFIGURING [41s]> root project > Resolve dependencies :classpath > wagon-provider-api-1.0-beta-4.pom<-------------> 0% CONFIGURING [41s]> root project > Resolve dependencies :classpath > wagon-provider-api-1.0-beta-4.pomDownload https://plugins.gradle.org/m2/org/apache/maven/wagon/wagon-provider-api/1.0-beta-4/wagon-provider-api-1.0-beta-4.pom
<-------------> 0% CONFIGURING [41s]> root project > Resolve dependencies :classpath > wagon-1.0-beta-4.pom> IDLE> IDLE> IDLE<-------------> 0% CONFIGURING [41s]> root project > Resolve dependencies :classpath > wagon-1.0-beta-4.pom<-------------> 0% CONFIGURING [41s]> root project > Resolve dependencies :classpath > wagon-1.0-beta-4.pom<-------------> 0% CONFIGURING [41s]> root project > Resolve dependencies :classpath > wagon-1.0-beta-4.pomDownload https://plugins.gradle.org/m2/org/apache/maven/wagon/wagon/1.0-beta-4/wagon-1.0-beta-4.pom
<-------------> 0% CONFIGURING [42s]> root project > Resolve dependencies :classpath > maven-parent-8.pom> IDLE> IDLE> IDLE<-------------> 0% CONFIGURING [42s]> root project > Resolve dependencies :classpath > maven-parent-8.pom<-------------> 0% CONFIGURING [42s]> root project > Resolve dependencies :classpath > maven-parent-8.pom<-------------> 0% CONFIGURING [42s]> root project > Resolve dependencies :classpath > maven-parent-8.pomDownload https://plugins.gradle.org/m2/org/apache/maven/maven-parent/8/maven-parent-8.pom
<-------------> 0% CONFIGURING [42s]> root project > Resolve dependencies :classpath > stax-api-1.0.1.pom> IDLE> IDLE> IDLE<-------------> 0% CONFIGURING [42s]> root project > Resolve dependencies :classpath > stax-api-1.0.1.pom<-------------> 0% CONFIGURING [42s]> root project > Resolve dependencies :classpath > stax-api-1.0.1.pom<-------------> 0% CONFIGURING [42s]> root project > Resolve dependencies :classpath > stax-api-1.0.1.pomDownload https://plugins.gradle.org/m2/stax/stax-api/1.0.1/stax-api-1.0.1.pom
<-------------> 0% CONFIGURING [42s]> root project > Resolve dependencies :classpath > sisu-guice-2.9.1.pom> IDLE> IDLE> IDLE<-------------> 0% CONFIGURING [42s]> root project > Resolve dependencies :classpath > sisu-guice-2.9.1.pom<-------------> 0% CONFIGURING [42s]> root project > Resolve dependencies :classpath > sisu-guice-2.9.1.pom<-------------> 0% CONFIGURING [43s]> root project > Resolve dependencies :classpath > sisu-guice-2.9.1.pomDownload https://plugins.gradle.org/m2/org/sonatype/sisu/sisu-guice/2.9.1/sisu-guice-2.9.1.pom
<-------------> 0% CONFIGURING [43s]> root project > Resolve dependencies :classpath > guice-parent-2.9.1.pom> IDLE> IDLE> IDLE<-------------> 0% CONFIGURING [43s]> root project > Resolve dependencies :classpath > guice-parent-2.9.1.pom<-------------> 0% CONFIGURING [43s]> root project > Resolve dependencies :classpath > guice-parent-2.9.1.pom<-------------> 0% CONFIGURING [43s]> root project > Resolve dependencies :classpath > guice-parent-2.9.1.pomDownload https://plugins.gradle.org/m2/org/sonatype/sisu/inject/guice-parent/2.9.1/guice-parent-2.9.1.pom
<-------------> 0% CONFIGURING [43s]> root project > Resolve dependencies :classpath> IDLE> IDLE> IDLE<-------------> 0% CONFIGURING [43s]> root project > Resolve dependencies :classpath > jsr305-3.0.2.pom<-------------> 0% CONFIGURING [43s]> root project > Resolve dependencies :classpath > jsr305-3.0.2.pom<-------------> 0% CONFIGURING [43s]> root project > Resolve dependencies :classpath > jsr305-3.0.2.pom<-------------> 0% CONFIGURING [43s]> root project > Resolve dependencies :classpath > jsr305-3.0.2.pomDownload https://plugins.gradle.org/m2/com/google/code/findbugs/jsr305/3.0.2/jsr305-3.0.2.pom
FAILURE: Build failed with an exception.
* What went wrong:
A problem occurred configuring root project 'aurora'.
> Could not resolve all files for configuration ':classpath'.
> Could not resolve org.codehaus.plexus:plexus-container-default:1.0-beta-3.0.5.
Required by:
project : > nl.javadude.gradle.plugins:license-gradle-plugin:0.11.0 > com.mycila.maven-license-plugin:maven-license-plugin:1.10.b1 > org.apache.maven:maven-project:3.0-alpha-2
project : > nl.javadude.gradle.plugins:license-gradle-plugin:0.11.0 > com.mycila.maven-license-plugin:maven-license-plugin:1.10.b1 > org.apache.maven:maven-project:3.0-alpha-2 > org.apache.maven:maven-compat:3.0-alpha-2
> Could not resolve org.codehaus.plexus:plexus-container-default:1.0-beta-3.0.5.
> Could not parse POM https://plugins.gradle.org/m2/org/codehaus/plexus/plexus-container-default/1.0-beta-3.0.5/plexus-container-default-1.0-beta-3.0.5.pom
> Could not resolve org.codehaus.plexus:plexus-containers:1.0-beta-3.0.5.
> Could not resolve org.codehaus.plexus:plexus-containers:1.0-beta-3.0.5.
> Could not parse POM https://plugins.gradle.org/m2/org/codehaus/plexus/plexus-containers/1.0-beta-3.0.5/plexus-containers-1.0-beta-3.0.5.pom
> Could not resolve org.codehaus.plexus:plexus:2.0.2.
> Could not resolve org.codehaus.plexus:plexus:2.0.2.
> Could not get resource 'https://plugins.gradle.org/m2/org/codehaus/plexus/plexus/2.0.2/plexus-2.0.2.pom'.
> Could not GET 'https://plugins.gradle.org/m2/org/codehaus/plexus/plexus/2.0.2/plexus-2.0.2.pom'. Received status code 520 from server: Origin Error
> Could not resolve org.sonatype.spice:model-builder:1.3.
Required by:
project : > nl.javadude.gradle.plugins:license-gradle-plugin:0.11.0 > com.mycila.maven-license-plugin:maven-license-plugin:1.10.b1 > org.apache.maven:maven-project:3.0-alpha-2
project : > nl.javadude.gradle.plugins:license-gradle-plugin:0.11.0 > com.mycila.maven-license-plugin:maven-license-plugin:1.10.b1 > org.apache.maven:maven-project:3.0-alpha-2 > org.apache.maven:maven-project-builder:3.0-alpha-2
> Could not resolve org.sonatype.spice:model-builder:1.3.
> Could not parse POM https://plugins.gradle.org/m2/org/sonatype/spice/model-builder/1.3/model-builder-1.3.pom
> Could not resolve org.sonatype.spice:spice-parent:10.
> Could not resolve org.sonatype.spice:spice-parent:10.
> Could not parse POM https://plugins.gradle.org/m2/org/sonatype/spice/spice-parent/10/spice-parent-10.pom
> Could not resolve org.sonatype.forge:forge-parent:3.
> Could not resolve org.sonatype.forge:forge-parent:3.
> Could not get resource 'https://plugins.gradle.org/m2/org/sonatype/forge/forge-parent/3/forge-parent-3.pom'.
> Could not GET 'https://plugins.gradle.org/m2/org/sonatype/forge/forge-parent/3/forge-parent-3.pom'. Received status code 520 from server: Origin Error
* Try:
Run with --stacktrace option to get the stack trace. Run with --info or --debug option to get more log output.
* Get more help at https://help.gradle.org
BUILD FAILED in 47s
<-------------> 0% WAITING> IDLE> IDLE> IDLE> IDLE<-------------> 0% WAITINGmake[1]: *** [__gradle_build] Error 1
make[1]: Leaving directory `/scratch'
make: *** [build] Error 2
dpkg-buildpackage: error: debian/rules build gave error exit status 2
Build step 'Execute shell' marked build as failure
Skipped archiving because build is not successful
Build failed in Jenkins: aurora-packaging-nightly #1072
Posted by Apache Jenkins Server <je...@builds.apache.org>.
See <https://builds.apache.org/job/aurora-packaging-nightly/1072/display/redirect?page=changes>
Changes:
[david] Prune updates that have no surviving job keys in the TaskStore.
------------------------------------------
[...truncated 14.23 MB...]
| `-- react-is@16.4.1
+-- sass.js@0.10.10
+-- sassjs-loader@1.0.0
| +-- q@1.5.1
| `-- q-io@1.13.6
| +-- es6-set@0.1.5
| | +-- d@1.0.0
| | +-- es5-ext@0.10.45
| | | `-- next-tick@1.0.0
| | +-- es6-iterator@2.0.3
| | +-- es6-symbol@3.1.1
| | `-- event-emitter@0.3.5
| +-- mimeparse@0.1.4
| +-- qs@1.2.2
| `-- url2@0.0.0
+-- style-loader@0.18.2
| `-- schema-utils@0.3.0
+-- url-loader@0.6.2
| +-- mime@1.6.0
| `-- schema-utils@0.3.0
`-- webpack@2.7.0
+-- acorn@5.7.1
+-- acorn-dynamic-import@2.0.2
| `-- acorn@4.0.13
+-- ajv@4.11.8
+-- ajv-keywords@1.5.1
+-- async@2.6.1
+-- enhanced-resolve@3.4.1
+-- interpret@1.1.0
+-- json-loader@0.5.7
+-- loader-runner@2.3.0
+-- loader-utils@0.2.17
+-- memory-fs@0.4.1
+-- node-libs-browser@2.1.0
| +-- assert@1.4.1
| | `-- util@0.10.3
| | `-- inherits@2.0.1
| +-- browserify-zlib@0.2.0
| | `-- pako@1.0.6
| +-- buffer@4.9.1
| | +-- base64-js@1.3.0
| | +-- ieee754@1.1.12
| | `-- isarray@1.0.0
| +-- console-browserify@1.1.0
| | `-- date-now@0.1.4
| +-- constants-browserify@1.0.0
| +-- crypto-browserify@3.12.0
| | +-- browserify-cipher@1.0.1
| | | +-- browserify-aes@1.2.0
| | | | `-- buffer-xor@1.0.3
| | | +-- browserify-des@1.0.2
| | | | `-- des.js@1.0.0
| | | `-- evp_bytestokey@1.0.3
| | +-- browserify-sign@4.0.4
| | | +-- bn.js@4.11.8
| | | +-- browserify-rsa@4.0.1
| | | +-- elliptic@6.4.0
| | | | +-- brorand@1.1.0
| | | | +-- hash.js@1.1.5
| | | | +-- hmac-drbg@1.0.1
| | | | +-- minimalistic-assert@1.0.1
| | | | `-- minimalistic-crypto-utils@1.0.1
| | | `-- parse-asn1@5.1.1
| | | `-- asn1.js@4.10.1
| | +-- create-ecdh@4.0.3
| | +-- create-hash@1.2.0
| | | +-- cipher-base@1.0.4
| | | +-- md5.js@1.3.4
| | | | `-- hash-base@3.0.4
| | | +-- ripemd160@2.0.2
| | | `-- sha.js@2.4.11
| | +-- create-hmac@1.1.7
| | +-- diffie-hellman@5.0.3
| | | `-- miller-rabin@4.0.1
| | +-- pbkdf2@3.0.16
| | +-- public-encrypt@4.0.2
| | +-- randombytes@2.0.6
| | `-- randomfill@1.0.4
| +-- domain-browser@1.2.0
| +-- events@1.1.1
| +-- https-browserify@1.0.0
| +-- os-browserify@0.3.0
| +-- path-browserify@0.0.0
| +-- process@0.11.10
| +-- punycode@1.4.1
| +-- querystring-es3@0.2.1
| +-- stream-browserify@2.0.1
| +-- stream-http@2.8.3
| | +-- builtin-status-codes@3.0.0
| | +-- to-arraybuffer@1.0.1
| | `-- xtend@4.0.1
| +-- string_decoder@1.1.1
| +-- timers-browserify@2.0.10
| +-- tty-browserify@0.0.0
| +-- url@0.11.0
| | +-- punycode@1.3.2
| | `-- querystring@0.2.0
| +-- util@0.10.4
| `-- vm-browserify@0.0.4
| `-- indexof@0.0.1
+-- supports-color@3.2.3
| `-- has-flag@1.0.0
+-- tapable@0.2.8
+-- uglify-js@2.8.29
| +-- uglify-to-browserify@1.0.2
| `-- yargs@3.10.0
| +-- camelcase@1.2.1
| +-- cliui@2.1.0
| | +-- center-align@0.1.3
| | | +-- align-text@0.1.4
| | | | +-- kind-of@3.2.2
| | | | `-- longest@1.0.1
| | | `-- lazy-cache@1.0.4
| | +-- right-align@0.1.3
| | `-- wordwrap@0.0.2
| `-- window-size@0.1.0
+-- watchpack@1.6.0
| +-- chokidar@2.0.4
| | +-- async-each@1.0.1
| | +-- braces@2.3.2
| | | +-- extend-shallow@2.0.1
| | | +-- fill-range@4.0.0
| | | | +-- extend-shallow@2.0.1
| | | | +-- is-number@3.0.0
| | | | | `-- kind-of@3.2.2
| | | | `-- to-regex-range@2.1.1
| | | +-- isobject@3.0.1
| | | +-- snapdragon-node@2.1.1
| | | | +-- define-property@1.0.0
| | | | | `-- is-descriptor@1.0.2
| | | | | +-- is-accessor-descriptor@1.0.0
| | | | | `-- is-data-descriptor@1.0.0
| | | | `-- snapdragon-util@3.0.1
| | | | `-- kind-of@3.2.2
| | | `-- split-string@3.1.0
| | +-- glob-parent@3.1.0
| | | +-- is-glob@3.1.0
| | | `-- path-dirname@1.0.2
| | +-- is-binary-path@1.0.1
| | | `-- binary-extensions@1.11.0
| | +-- is-glob@4.0.0
| | | `-- is-extglob@2.1.1
| | +-- lodash.debounce@4.0.8
| | +-- readdirp@2.1.0
| | | `-- set-immediate-shim@1.0.1
| | `-- upath@1.1.0
| `-- neo-async@2.5.1
+-- webpack-sources@1.1.0
| `-- source-map@0.6.1
`-- yargs@6.6.0
+-- camelcase@3.0.0
+-- cliui@3.2.0
+-- os-locale@1.4.0
+-- read-pkg-up@1.0.1
| +-- find-up@1.1.2
| | `-- path-exists@2.1.0
| `-- read-pkg@1.1.0
| +-- load-json-file@1.1.0
| | `-- strip-bom@2.0.0
| | `-- is-utf8@0.2.1
| `-- path-type@1.1.0
+-- string-width@1.0.2
| +-- code-point-at@1.1.0
| `-- is-fullwidth-code-point@1.0.0
| `-- number-is-nan@1.0.1
+-- which-module@1.0.0
`-- yargs-parser@4.2.1
<=========----> 71% EXECUTING [4m 45s]> maven-model-3.0.1.jar> maven-plugin-api-3.0.1.jar> gradle-js-plugin-1.12.1.jar> protobuf-java-2.4.1.jar<=========----> 71% EXECUTING [4m 45s]> maven-model-3.0.1.jar> maven-plugin-api-3.0.1.jar> gradle-js-plugin-1.12.1.jar> protobuf-java-2.4.1.jar<=========----> 71% EXECUTING [4m 45s]> maven-model-3.0.1.jar> maven-plugin-api-3.0.1.jar> gradle-js-plugin-1.12.1.jar> protobuf-java-2.4.1.jar<=========----> 71% EXECUTING [4m 45s]> maven-model-3.0.1.jar> maven-plugin-api-3.0.1.jar> gradle-js-plugin-1.12.1.jar> protobuf-java-2.4.1.jar<=========----> 71% EXECUTING [4m 45s]> maven-model-3.0.1.jar> maven-plugin-api-3.0.1.jar> gradle-js-plugin-1.12.1.jar> protobuf-java-2.4.1.jar<=========----> 71% EXECUTING [4m 45s]> maven-model-3.0.1.jar> maven-plugin-api-3.0.1.jar> gradle-js-plugin-1.12.1.jar> protobuf-java-2.4.1.jar<=========----> 71% EXECUTING [4m 45s]> maven-model-3.0.1.jar> maven-plugin-api-3.0.1.jar> gradle-js-plugin-1.12.1.jar> protobuf-java-2.4.1.jar<=========----> 71% EXECUTING [4m 46s]> maven-model-3.0.1.jar> maven-plugin-api-3.0.1.jar> gradle-js-plugin-1.12.1.jar> protobuf-java-2.4.1.jar<=========----> 71% EXECUTING [4m 46s]> maven-model-3.0.1.jar> maven-plugin-api-3.0.1.jar> gradle-js-plugin-1.12.1.jar> protobuf-java-2.4.1.jar<=========----> 71% EXECUTING [4m 46s]> maven-model-3.0.1.jar> maven-plugin-api-3.0.1.jar> gradle-js-plugin-1.12.1.jar> protobuf-java-2.4.1.jar<=========----> 71% EXECUTING [4m 46s]> maven-model-3.0.1.jar> maven-plugin-api-3.0.1.jar> gradle-js-plugin-1.12.1.jar> protobuf-java-2.4.1.jar<=========----> 71% EXECUTING [4m 46s]> maven-model-3.0.1.jar> maven-plugin-api-3.0.1.jar> gradle-js-plugin-1.12.1.jar> protobuf-java-2.4.1.jar<=========----> 71% EXECUTING [4m 46s]> maven-model-3.0.1.jar> maven-plugin-api-3.0.1.jar> gradle-js-plugin-1.12.1.jar> protobuf-java-2.4.1.jar<=========----> 71% EXECUTING [4m 46s]> maven-model-3.0.1.jar> maven-plugin-api-3.0.1.jar> gradle-js-plugin-1.12.1.jar> protobuf-java-2.4.1.jar<=========----> 71% EXECUTING [4m 46s]> maven-model-3.0.1.jar> maven-plugin-api-3.0.1.jar> gradle-js-plugin-1.12.1.jar> protobuf-java-2.4.1.jar<=========----> 71% EXECUTING [4m 46s]> maven-model-3.0.1.jar> maven-plugin-api-3.0.1.jar> gradle-js-plugin-1.12.1.jar> protobuf-java-2.4.1.jar<=========----> 71% EXECUTING [4m 46s]> maven-model-3.0.1.jar> maven-plugin-api-3.0.1.jar> gradle-js-plugin-1.12.1.jar> protobuf-java-2.4.1.jar<=========----> 71% EXECUTING [4m 47s]> maven-model-3.0.1.jar> maven-plugin-api-3.0.1.jar> gradle-js-plugin-1.12.1.jar> protobuf-java-2.4.1.jar<=========----> 71% EXECUTING [4m 47s]> maven-model-3.0.1.jar> maven-plugin-api-3.0.1.jar> gradle-js-plugin-1.12.1.jar> protobuf-java-2.4.1.jar<=========----> 71% EXECUTING [4m 47s]> maven-model-3.0.1.jar> maven-plugin-api-3.0.1.jar> gradle-js-plugin-1.12.1.jar> protobuf-java-2.4.1.jar<=========----> 71% EXECUTING [4m 47s]> maven-model-3.0.1.jar> maven-plugin-api-3.0.1.jar> gradle-js-plugin-1.12.1.jar> protobuf-java-2.4.1.jar<=========----> 71% EXECUTING [4m 47s]> maven-model-3.0.1.jar> maven-plugin-api-3.0.1.jar> gradle-js-plugin-1.12.1.jar> protobuf-java-2.4.1.jar<=========----> 71% EXECUTING [4m 47s]> maven-model-3.0.1.jar> maven-plugin-api-3.0.1.jar> gradle-js-plugin-1.12.1.jar> protobuf-java-2.4.1.jar<=========----> 71% EXECUTING [4m 47s]> maven-model-3.0.1.jar> maven-plugin-api-3.0.1.jar> gradle-js-plugin-1.12.1.jar> protobuf-java-2.4.1.jar<=========----> 71% EXECUTING [4m 47s]> maven-model-3.0.1.jar> maven-plugin-api-3.0.1.jar> gradle-js-plugin-1.12.1.jar> protobuf-java-2.4.1.jar<=========----> 71% EXECUTING [4m 47s]> maven-model-3.0.1.jar> maven-plugin-api-3.0.1.jar> gradle-js-plugin-1.12.1.jar> protobuf-java-2.4.1.jar<=========----> 71% EXECUTING [4m 47s]> maven-model-3.0.1.jar> maven-plugin-api-3.0.1.jar> gradle-js-plugin-1.12.1.jar> protobuf-java-2.4.1.jar<=========----> 71% EXECUTING [4m 48s]> maven-model-3.0.1.jar> maven-plugin-api-3.0.1.jar> gradle-js-plugin-1.12.1.jar> protobuf-java-2.4.1.jar<=========----> 71% EXECUTING [4m 48s]> maven-model-3.0.1.jar> maven-plugin-api-3.0.1.jar> gradle-js-plugin-1.12.1.jar> protobuf-java-2.4.1.jar<=========----> 71% EXECUTING [4m 48s]> maven-model-3.0.1.jar> maven-plugin-api-3.0.1.jar> gradle-js-plugin-1.12.1.jar> protobuf-java-2.4.1.jar<=========----> 71% EXECUTING [4m 48s]> maven-model-3.0.1.jar> maven-plugin-api-3.0.1.jar> gradle-js-plugin-1.12.1.jar> protobuf-java-2.4.1.jar<=========----> 71% EXECUTING [4m 48s]> maven-model-3.0.1.jar> maven-plugin-api-3.0.1.jar> gradle-js-plugin-1.12.1.jar> protobuf-java-2.4.1.jar<=========----> 71% EXECUTING [4m 48s]> maven-model-3.0.1.jar> maven-plugin-api-3.0.1.jar> gradle-js-plugin-1.12.1.jar> protobuf-java-2.4.1.jar<=========----> 71% EXECUTING [4m 48s]> maven-model-3.0.1.jar> maven-plugin-api-3.0.1.jar> gradle-js-plugin-1.12.1.jar> protobuf-java-2.4.1.jar<=========----> 71% EXECUTING [4m 48s]> maven-model-3.0.1.jar> maven-plugin-api-3.0.1.jar> gradle-js-plugin-1.12.1.jar> protobuf-java-2.4.1.jar<=========----> 71% EXECUTING [4m 48s]> maven-model-3.0.1.jar> maven-plugin-api-3.0.1.jar> gradle-js-plugin-1.12.1.jar> protobuf-java-2.4.1.jar<=========----> 71% EXECUTING [4m 48s]> maven-model-3.0.1.jar> maven-plugin-api-3.0.1.jar> gradle-js-plugin-1.12.1.jar> protobuf-java-2.4.1.jar<=========----> 71% EXECUTING [4m 49s]> maven-model-3.0.1.jar> maven-plugin-api-3.0.1.jar> gradle-js-plugin-1.12.1.jar> protobuf-java-2.4.1.jar<=========----> 71% EXECUTING [4m 49s]> maven-model-3.0.1.jar> maven-plugin-api-3.0.1.jar> gradle-js-plugin-1.12.1.jar> protobuf-java-2.4.1.jar<=========----> 71% EXECUTING [4m 49s]> maven-model-3.0.1.jar> maven-plugin-api-3.0.1.jar> gradle-js-plugin-1.12.1.jar> protobuf-java-2.4.1.jar<=========----> 71% EXECUTING [4m 49s]> maven-model-3.0.1.jar> maven-plugin-api-3.0.1.jar> gradle-js-plugin-1.12.1.jar> protobuf-java-2.4.1.jar<=========----> 71% EXECUTING [4m 49s]> maven-model-3.0.1.jar> maven-plugin-api-3.0.1.jar> gradle-js-plugin-1.12.1.jar> protobuf-java-2.4.1.jar<=========----> 71% EXECUTING [4m 49s]> maven-model-3.0.1.jar> maven-plugin-api-3.0.1.jar> gradle-js-plugin-1.12.1.jar> protobuf-java-2.4.1.jar<=========----> 71% EXECUTING [4m 49s]> maven-model-3.0.1.jar> maven-plugin-api-3.0.1.jar> gradle-js-plugin-1.12.1.jar> protobuf-java-2.4.1.jar<=========----> 75% EXECUTING [4m 49s]> maven-model-3.0.1.jar> maven-plugin-api-3.0.1.jar> gradle-js-plugin-1.12.1.jar> protobuf-java-2.4.1.jar<=========----> 75% EXECUTING [4m 49s]> maven-model-3.0.1.jar> maven-plugin-api-3.0.1.jar> gradle-js-plugin-1.12.1.jar> protobuf-java-2.4.1.jar<=========----> 75% EXECUTING [4m 49s]> maven-model-3.0.1.jar> maven-plugin-api-3.0.1.jar> gradle-js-plugin-1.12.1.jar> protobuf-java-2.4.1.jar<=========----> 75% EXECUTING [4m 50s]> maven-model-3.0.1.jar> maven-plugin-api-3.0.1.jar> gradle-js-plugin-1.12.1.jar> protobuf-java-2.4.1.jar<=========----> 75% EXECUTING [4m 50s]> maven-model-3.0.1.jar> maven-plugin-api-3.0.1.jar> gradle-js-plugin-1.12.1.jar> protobuf-java-2.4.1.jar<=========----> 75% EXECUTING [4m 50s]> maven-model-3.0.1.jar> maven-plugin-api-3.0.1.jar> gradle-js-plugin-1.12.1.jar> protobuf-java-2.4.1.jar<=========----> 75% EXECUTING [4m 50s]> maven-model-3.0.1.jar> maven-plugin-api-3.0.1.jar> gradle-js-plugin-1.12.1.jar> protobuf-java-2.4.1.jar<=========----> 75% EXECUTING [4m 50s]> maven-model-3.0.1.jar> maven-plugin-api-3.0.1.jar> gradle-js-plugin-1.12.1.jar> protobuf-java-2.4.1.jar<=========----> 75% EXECUTING [4m 50s]> maven-model-3.0.1.jar> maven-plugin-api-3.0.1.jar> gradle-js-plugin-1.12.1.jar> protobuf-java-2.4.1.jar<=========----> 75% EXECUTING [4m 50s]> maven-model-3.0.1.jar> maven-plugin-api-3.0.1.jar> gradle-js-plugin-1.12.1.jar> protobuf-java-2.4.1.jar<=========----> 75% EXECUTING [4m 50s]> maven-model-3.0.1.jar> maven-plugin-api-3.0.1.jar> gradle-js-plugin-1.12.1.jar> protobuf-java-2.4.1.jar<=========----> 75% EXECUTING [4m 50s]> maven-model-3.0.1.jar> maven-plugin-api-3.0.1.jar> gradle-js-plugin-1.12.1.jar> protobuf-java-2.4.1.jar<=========----> 75% EXECUTING [4m 50s]> maven-model-3.0.1.jar> maven-plugin-api-3.0.1.jar> gradle-js-plugin-1.12.1.jar> protobuf-java-2.4.1.jar<=========----> 75% EXECUTING [4m 51s]> maven-model-3.0.1.jar> maven-plugin-api-3.0.1.jar> gradle-js-plugin-1.12.1.jar> protobuf-java-2.4.1.jar<=========----> 75% EXECUTING [4m 51s]> maven-model-3.0.1.jar> maven-plugin-api-3.0.1.jar> gradle-js-plugin-1.12.1.jar> protobuf-java-2.4.1.jar<=========----> 75% EXECUTING [4m 51s]> maven-model-3.0.1.jar> maven-plugin-api-3.0.1.jar> gradle-js-plugin-1.12.1.jar> protobuf-java-2.4.1.jar<=========----> 75% EXECUTING [4m 51s]> maven-model-3.0.1.jar> maven-plugin-api-3.0.1.jar> gradle-js-plugin-1.12.1.jar> protobuf-java-2.4.1.jar<=========----> 75% EXECUTING [4m 51s]> maven-model-3.0.1.jar> maven-plugin-api-3.0.1.jar> gradle-js-plugin-1.12.1.jar> protobuf-java-2.4.1.jar<=========----> 75% EXECUTING [4m 51s]> maven-model-3.0.1.jar> maven-plugin-api-3.0.1.jar> gradle-js-plugin-1.12.1.jar> protobuf-java-2.4.1.jar<=========----> 75% EXECUTING [4m 51s]> maven-model-3.0.1.jar> maven-plugin-api-3.0.1.jar> gradle-js-plugin-1.12.1.jar> protobuf-java-2.4.1.jar<=========----> 75% EXECUTING [4m 51s]> maven-model-3.0.1.jar> maven-plugin-api-3.0.1.jar> gradle-js-plugin-1.12.1.jar> protobuf-java-2.4.1.jar<=========----> 75% EXECUTING [4m 51s]> maven-model-3.0.1.jar> maven-plugin-api-3.0.1.jar> gradle-js-plugin-1.12.1.jar> protobuf-java-2.4.1.jar<=========----> 75% EXECUTING [4m 51s]> maven-model-3.0.1.jar> maven-plugin-api-3.0.1.jar> gradle-js-plugin-1.12.1.jar> protobuf-java-2.4.1.jar<=========----> 75% EXECUTING [4m 52s]> maven-model-3.0.1.jar> maven-plugin-api-3.0.1.jar> gradle-js-plugin-1.12.1.jar> protobuf-java-2.4.1.jar<=========----> 75% EXECUTING [4m 52s]> maven-model-3.0.1.jar> maven-plugin-api-3.0.1.jar> gradle-js-plugin-1.12.1.jar> protobuf-java-2.4.1.jar<=========----> 75% EXECUTING [4m 52s]> maven-model-3.0.1.jar> maven-plugin-api-3.0.1.jar> gradle-js-plugin-1.12.1.jar> protobuf-java-2.4.1.jar<=========----> 75% EXECUTING [4m 52s]> maven-model-3.0.1.jar> maven-plugin-api-3.0.1.jar> gradle-js-plugin-1.12.1.jar> protobuf-java-2.4.1.jar<=========----> 75% EXECUTING [4m 52s]> maven-model-3.0.1.jar> maven-plugin-api-3.0.1.jar> gradle-js-plugin-1.12.1.jar> protobuf-java-2.4.1.jar<=========----> 75% EXECUTING [4m 52s]> maven-model-3.0.1.jar> maven-plugin-api-3.0.1.jar> gradle-js-plugin-1.12.1.jar> protobuf-java-2.4.1.jar<=========----> 75% EXECUTING [4m 52s]> maven-model-3.0.1.jar> maven-plugin-api-3.0.1.jar> gradle-js-plugin-1.12.1.jar> protobuf-java-2.4.1.jar<=========----> 75% EXECUTING [4m 52s]> maven-model-3.0.1.jar> maven-plugin-api-3.0.1.jar> gradle-js-plugin-1.12.1.jar> protobuf-java-2.4.1.jar<=========----> 75% EXECUTING [4m 52s]> maven-model-3.0.1.jar> maven-plugin-api-3.0.1.jar> gradle-js-plugin-1.12.1.jar> protobuf-java-2.4.1.jar<=========----> 75% EXECUTING [4m 52s]> maven-model-3.0.1.jar> maven-plugin-api-3.0.1.jar> gradle-js-plugin-1.12.1.jar> protobuf-java-2.4.1.jar<=========----> 75% EXECUTING [4m 53s]> maven-model-3.0.1.jar> maven-plugin-api-3.0.1.jar> gradle-js-plugin-1.12.1.jar> protobuf-java-2.4.1.jar<=========----> 75% EXECUTING [4m 53s]> maven-model-3.0.1.jar> maven-plugin-api-3.0.1.jar> gradle-js-plugin-1.12.1.jar> protobuf-java-2.4.1.jar<=========----> 75% EXECUTING [4m 53s]> maven-model-3.0.1.jar> maven-plugin-api-3.0.1.jar> gradle-js-plugin-1.12.1.jar> protobuf-java-2.4.1.jar<=========----> 75% EXECUTING [4m 53s]> maven-model-3.0.1.jar> maven-plugin-api-3.0.1.jar> gradle-js-plugin-1.12.1.jar> protobuf-java-2.4.1.jar<=========----> 75% EXECUTING [4m 53s]> maven-model-3.0.1.jar> maven-plugin-api-3.0.1.jar> gradle-js-plugin-1.12.1.jar> protobuf-java-2.4.1.jar<=========----> 75% EXECUTING [4m 53s]> maven-model-3.0.1.jar> maven-plugin-api-3.0.1.jar> gradle-js-plugin-1.12.1.jar> protobuf-java-2.4.1.jar<=========----> 75% EXECUTING [4m 53s]> maven-model-3.0.1.jar> maven-plugin-api-3.0.1.jar> gradle-js-plugin-1.12.1.jar> protobuf-java-2.4.1.jar<=========----> 75% EXECUTING [4m 53s]> maven-model-3.0.1.jar> maven-plugin-api-3.0.1.jar> gradle-js-plugin-1.12.1.jar> protobuf-java-2.4.1.jar<=========----> 75% EXECUTING [4m 53s]> maven-model-3.0.1.jar> maven-plugin-api-3.0.1.jar> gradle-js-plugin-1.12.1.jar> protobuf-java-2.4.1.jar<=========----> 75% EXECUTING [4m 53s]> maven-model-3.0.1.jar> maven-plugin-api-3.0.1.jar> gradle-js-plugin-1.12.1.jar> protobuf-java-2.4.1.jar<=========----> 75% EXECUTING [4m 54s]> maven-model-3.0.1.jar> maven-plugin-api-3.0.1.jar> gradle-js-plugin-1.12.1.jar> protobuf-java-2.4.1.jar<=========----> 75% EXECUTING [4m 54s]> maven-model-3.0.1.jar> maven-plugin-api-3.0.1.jar> gradle-js-plugin-1.12.1.jar> protobuf-java-2.4.1.jar<=========----> 75% EXECUTING [4m 54s]> maven-model-3.0.1.jar> maven-plugin-api-3.0.1.jar> gradle-js-plugin-1.12.1.jar> protobuf-java-2.4.1.jar<=========----> 75% EXECUTING [4m 54s]> maven-model-3.0.1.jar> maven-plugin-api-3.0.1.jar> gradle-js-plugin-1.12.1.jar> protobuf-java-2.4.1.jar<=========----> 75% EXECUTING [4m 54s]> maven-model-3.0.1.jar> maven-plugin-api-3.0.1.jar> gradle-js-plugin-1.12.1.jar> protobuf-java-2.4.1.jar<=========----> 75% EXECUTING [4m 54s]> maven-model-3.0.1.jar> maven-plugin-api-3.0.1.jar> gradle-js-plugin-1.12.1.jar> protobuf-java-2.4.1.jar<=========----> 75% EXECUTING [4m 54s]> maven-model-3.0.1.jar> maven-plugin-api-3.0.1.jar> gradle-js-plugin-1.12.1.jar> protobuf-java-2.4.1.jar<=========----> 75% EXECUTING [4m 54s]> maven-model-3.0.1.jar> maven-plugin-api-3.0.1.jar> gradle-js-plugin-1.12.1.jar> protobuf-java-2.4.1.jar<=========----> 75% EXECUTING [4m 54s]> maven-model-3.0.1.jar> maven-plugin-api-3.0.1.jar> gradle-js-plugin-1.12.1.jar> protobuf-java-2.4.1.jar<=========----> 75% EXECUTING [4m 54s]> maven-model-3.0.1.jar> maven-plugin-api-3.0.1.jar> gradle-js-plugin-1.12.1.jar> protobuf-java-2.4.1.jar<=========----> 75% EXECUTING [4m 55s]> maven-model-3.0.1.jar> maven-plugin-api-3.0.1.jar> gradle-js-plugin-1.12.1.jar> protobuf-java-2.4.1.jar<=========----> 75% EXECUTING [4m 55s]> maven-model-3.0.1.jar> maven-plugin-api-3.0.1.jar> gradle-js-plugin-1.12.1.jar> protobuf-java-2.4.1.jar<=========----> 75% EXECUTING [4m 55s]> maven-model-3.0.1.jar> maven-plugin-api-3.0.1.jar> gradle-js-plugin-1.12.1.jar> protobuf-java-2.4.1.jar<=========----> 75% EXECUTING [4m 55s]> maven-model-3.0.1.jar> maven-plugin-api-3.0.1.jar> gradle-js-plugin-1.12.1.jar> protobuf-java-2.4.1.jar<=========----> 75% EXECUTING [4m 55s]> maven-model-3.0.1.jar> maven-plugin-api-3.0.1.jar> gradle-js-plugin-1.12.1.jar> protobuf-java-2.4.1.jar<=========----> 75% EXECUTING [4m 55s]> maven-model-3.0.1.jar> maven-plugin-api-3.0.1.jar> gradle-js-plugin-1.12.1.jar> protobuf-java-2.4.1.jar<=========----> 75% EXECUTING [4m 55s]> maven-model-3.0.1.jar> maven-plugin-api-3.0.1.jar> gradle-js-plugin-1.12.1.jar> protobuf-java-2.4.1.jar<=========----> 75% EXECUTING [4m 55s]> maven-model-3.0.1.jar> maven-plugin-api-3.0.1.jar> gradle-js-plugin-1.12.1.jar> protobuf-java-2.4.1.jar<=========----> 75% EXECUTING [4m 55s]> maven-model-3.0.1.jar> maven-plugin-api-3.0.1.jar> gradle-js-plugin-1.12.1.jar> protobuf-java-2.4.1.jar<=========----> 75% EXECUTING [4m 55s]> maven-model-3.0.1.jar> maven-plugin-api-3.0.1.jar> gradle-js-plugin-1.12.1.jar> protobuf-java-2.4.1.jar<=========----> 75% EXECUTING [4m 56s]> maven-model-3.0.1.jar> maven-plugin-api-3.0.1.jar> gradle-js-plugin-1.12.1.jar> protobuf-java-2.4.1.jar<=========----> 75% EXECUTING [4m 56s]> maven-model-3.0.1.jar> maven-plugin-api-3.0.1.jar> gradle-js-plugin-1.12.1.jar> protobuf-java-2.4.1.jar<=========----> 75% EXECUTING [4m 56s]> maven-model-3.0.1.jar> maven-plugin-api-3.0.1.jar> gradle-js-plugin-1.12.1.jar> protobuf-java-2.4.1.jar<=========----> 75% EXECUTING [4m 56s]> maven-model-3.0.1.jar> maven-plugin-api-3.0.1.jar> gradle-js-plugin-1.12.1.jar> protobuf-java-2.4.1.jar<=========----> 75% EXECUTING [4m 56s]> maven-model-3.0.1.jar> maven-plugin-api-3.0.1.jar> gradle-js-plugin-1.12.1.jar> protobuf-java-2.4.1.jar<=========----> 75% EXECUTING [4m 56s]> maven-model-3.0.1.jar> maven-plugin-api-3.0.1.jar> gradle-js-plugin-1.12.1.jar> protobuf-java-2.4.1.jar<=========----> 75% EXECUTING [4m 56s]> maven-model-3.0.1.jar> maven-plugin-api-3.0.1.jar> gradle-js-plugin-1.12.1.jar> protobuf-java-2.4.1.jar<=========----> 75% EXECUTING [4m 56s]> maven-model-3.0.1.jar> maven-plugin-api-3.0.1.jar> gradle-js-plugin-1.12.1.jar> protobuf-java-2.4.1.jar<=========----> 75% EXECUTING [4m 56s]> maven-model-3.0.1.jar> maven-plugin-api-3.0.1.jar> gradle-js-plugin-1.12.1.jar> protobuf-java-2.4.1.jar<=========----> 75% EXECUTING [4m 56s]> maven-model-3.0.1.jar> maven-plugin-api-3.0.1.jar> gradle-js-plugin-1.12.1.jar> protobuf-java-2.4.1.jar<=========----> 75% EXECUTING [4m 57s]> maven-model-3.0.1.jar> maven-plugin-api-3.0.1.jar> gradle-js-plugin-1.12.1.jar> protobuf-java-2.4.1.jar<=========----> 75% EXECUTING [4m 57s]> maven-model-3.0.1.jar> maven-plugin-api-3.0.1.jar> gradle-js-plugin-1.12.1.jar> protobuf-java-2.4.1.jar<=========----> 75% EXECUTING [4m 57s]> maven-model-3.0.1.jar> maven-plugin-api-3.0.1.jar> gradle-js-plugin-1.12.1.jar> protobuf-java-2.4.1.jar<=========----> 75% EXECUTING [4m 57s]> maven-model-3.0.1.jar> maven-plugin-api-3.0.1.jar> gradle-js-plugin-1.12.1.jar> protobuf-java-2.4.1.jar<=========----> 75% EXECUTING [4m 57s]> maven-model-3.0.1.jar> maven-plugin-api-3.0.1.jar> gradle-js-plugin-1.12.1.jar> protobuf-java-2.4.1.jar<=========----> 75% EXECUTING [4m 57s]> maven-model-3.0.1.jar> maven-plugin-api-3.0.1.jar> gradle-js-plugin-1.12.1.jar> protobuf-java-2.4.1.jar<=========----> 75% EXECUTING [4m 57s]> maven-model-3.0.1.jar> maven-plugin-api-3.0.1.jar> gradle-js-plugin-1.12.1.jar> protobuf-java-2.4.1.jar<=========----> 75% EXECUTING [4m 57s]> maven-model-3.0.1.jar> maven-plugin-api-3.0.1.jar> gradle-js-plugin-1.12.1.jar> protobuf-java-2.4.1.jar<=========----> 75% EXECUTING [4m 57s]> maven-model-3.0.1.jar> maven-plugin-api-3.0.1.jar> gradle-js-plugin-1.12.1.jar> protobuf-java-2.4.1.jar<=========----> 75% EXECUTING [4m 57s]> maven-model-3.0.1.jar> maven-plugin-api-3.0.1.jar> gradle-js-plugin-1.12.1.jar> protobuf-java-2.4.1.jar<=========----> 75% EXECUTING [4m 58s]> maven-model-3.0.1.jar> maven-plugin-api-3.0.1.jar> gradle-js-plugin-1.12.1.jar> protobuf-java-2.4.1.jar<=========----> 75% EXECUTING [4m 58s]> maven-model-3.0.1.jar> maven-plugin-api-3.0.1.jar> gradle-js-plugin-1.12.1.jar> protobuf-java-2.4.1.jar<=========----> 75% EXECUTING [4m 58s]> maven-model-3.0.1.jar> maven-plugin-api-3.0.1.jar> gradle-js-plugin-1.12.1.jar> protobuf-java-2.4.1.jar<=========----> 75% EXECUTING [4m 58s]> maven-model-3.0.1.jar> maven-plugin-api-3.0.1.jar> gradle-js-plugin-1.12.1.jar> protobuf-java-2.4.1.jar<=========----> 75% EXECUTING [4m 58s]> maven-model-3.0.1.jar> maven-plugin-api-3.0.1.jar> gradle-js-plugin-1.12.1.jar> protobuf-java-2.4.1.jar<=========----> 75% EXECUTING [4m 58s]> maven-model-3.0.1.jar> maven-plugin-api-3.0.1.jar> gradle-js-plugin-1.12.1.jar> protobuf-java-2.4.1.jar<=========----> 75% EXECUTING [4m 58s]> maven-model-3.0.1.jar> maven-plugin-api-3.0.1.jar> gradle-js-plugin-1.12.1.jar> protobuf-java-2.4.1.jar<=========----> 75% EXECUTING [4m 58s]> maven-model-3.0.1.jar> maven-plugin-api-3.0.1.jar> gradle-js-plugin-1.12.1.jar> protobuf-java-2.4.1.jar<=========----> 75% EXECUTING [4m 58s]> maven-model-3.0.1.jar> maven-plugin-api-3.0.1.jar> gradle-js-plugin-1.12.1.jar> protobuf-java-2.4.1.jar<=========----> 75% EXECUTING [4m 58s]> maven-model-3.0.1.jar> maven-plugin-api-3.0.1.jar> gradle-js-plugin-1.12.1.jar> protobuf-java-2.4.1.jar<=========----> 75% EXECUTING [4m 59s]> maven-model-3.0.1.jar> maven-plugin-api-3.0.1.jar> gradle-js-plugin-1.12.1.jar> protobuf-java-2.4.1.jar<=========----> 75% EXECUTING [4m 59s]> maven-model-3.0.1.jar> maven-plugin-api-3.0.1.jar> gradle-js-plugin-1.12.1.jar> protobuf-java-2.4.1.jar<=========----> 75% EXECUTING [4m 59s]> maven-model-3.0.1.jar> maven-plugin-api-3.0.1.jar> gradle-js-plugin-1.12.1.jar> protobuf-java-2.4.1.jar<=========----> 75% EXECUTING [4m 59s]> maven-model-3.0.1.jar> maven-plugin-api-3.0.1.jar> gradle-js-plugin-1.12.1.jar> protobuf-java-2.4.1.jar<=========----> 75% EXECUTING [4m 59s]> maven-model-3.0.1.jar> maven-plugin-api-3.0.1.jar> gradle-js-plugin-1.12.1.jar> protobuf-java-2.4.1.jar<=========----> 75% EXECUTING [4m 59s]> maven-model-3.0.1.jar> maven-plugin-api-3.0.1.jar> gradle-js-plugin-1.12.1.jar> protobuf-java-2.4.1.jar<=========----> 75% EXECUTING [4m 59s]> maven-model-3.0.1.jar> maven-plugin-api-3.0.1.jar> gradle-js-plugin-1.12.1.jar> protobuf-java-2.4.1.jar<=========----> 75% EXECUTING [4m 59s]> maven-model-3.0.1.jar> maven-plugin-api-3.0.1.jar> gradle-js-plugin-1.12.1.jar> protobuf-java-2.4.1.jar<=========----> 75% EXECUTING [4m 59s]> maven-model-3.0.1.jar> maven-plugin-api-3.0.1.jar> gradle-js-plugin-1.12.1.jar> protobuf-java-2.4.1.jar<=========----> 75% EXECUTING [4m 59s]> maven-model-3.0.1.jar> maven-plugin-api-3.0.1.jar> gradle-js-plugin-1.12.1.jar> protobuf-java-2.4.1.jar<=========----> 75% EXECUTING [5m 0s]> maven-model-3.0.1.jar> maven-plugin-api-3.0.1.jar> gradle-js-plugin-1.12.1.jar> protobuf-java-2.4.1.jar<=========----> 75% EXECUTING [5m 0s]> maven-model-3.0.1.jar> maven-plugin-api-3.0.1.jar> gradle-js-plugin-1.12.1.jar> protobuf-java-2.4.1.jar<=========----> 75% EXECUTING [5m 0s]> maven-model-3.0.1.jar> maven-plugin-api-3.0.1.jar> gradle-js-plugin-1.12.1.jar> protobuf-java-2.4.1.jar<=========----> 75% EXECUTING [5m 0s]> maven-model-3.0.1.jar> maven-plugin-api-3.0.1.jar> gradle-js-plugin-1.12.1.jar> protobuf-java-2.4.1.jar<=========----> 75% EXECUTING [5m 0s]> maven-model-3.0.1.jar> maven-plugin-api-3.0.1.jar> gradle-js-plugin-1.12.1.jar> protobuf-java-2.4.1.jar<=========----> 75% EXECUTING [5m 0s]> maven-model-3.0.1.jar> maven-plugin-api-3.0.1.jar> gradle-js-plugin-1.12.1.jar> protobuf-java-2.4.1.jar<=========----> 75% EXECUTING [5m 0s]> maven-model-3.0.1.jar> maven-plugin-api-3.0.1.jar> gradle-js-plugin-1.12.1.jar> protobuf-java-2.4.1.jar<=========----> 75% EXECUTING [5m 0s]> maven-model-3.0.1.jar> maven-plugin-api-3.0.1.jar> gradle-js-plugin-1.12.1.jar> protobuf-java-2.4.1.jar<=========----> 75% EXECUTING [5m 0s]> maven-model-3.0.1.jar> maven-plugin-api-3.0.1.jar> gradle-js-plugin-1.12.1.jar> protobuf-java-2.4.1.jar<=========----> 75% EXECUTING [5m 0s]> maven-model-3.0.1.jar> maven-plugin-api-3.0.1.jar> gradle-js-plugin-1.12.1.jar> protobuf-java-2.4.1.jar<=========----> 75% EXECUTING [5m 1s]> maven-model-3.0.1.jar> maven-plugin-api-3.0.1.jar> gradle-js-plugin-1.12.1.jar> protobuf-java-2.4.1.jar<=========----> 75% EXECUTING [5m 1s]> maven-model-3.0.1.jar> maven-plugin-api-3.0.1.jar> gradle-js-plugin-1.12.1.jar> protobuf-java-2.4.1.jar<=========----> 75% EXECUTING [5m 1s]> maven-model-3.0.1.jar> maven-plugin-api-3.0.1.jar> gradle-js-plugin-1.12.1.jar> protobuf-java-2.4.1.jar<=========----> 75% EXECUTING [5m 1s]> maven-model-3.0.1.jar> maven-plugin-api-3.0.1.jar> gradle-js-plugin-1.12.1.jar> protobuf-java-2.4.1.jar<=========----> 75% EXECUTING [5m 1s]> maven-model-3.0.1.jar> maven-plugin-api-3.0.1.jar> gradle-js-plugin-1.12.1.jar> protobuf-java-2.4.1.jar<=========----> 75% EXECUTING [5m 1s]> maven-model-3.0.1.jar> maven-plugin-api-3.0.1.jar> gradle-js-plugin-1.12.1.jar> protobuf-java-2.4.1.jar<=========----> 75% EXECUTING [5m 1s]> maven-model-3.0.1.jar> maven-plugin-api-3.0.1.jar> gradle-js-plugin-1.12.1.jar> protobuf-java-2.4.1.jar<=========----> 75% EXECUTING [5m 1s]> maven-model-3.0.1.jar> maven-plugin-api-3.0.1.jar> gradle-js-plugin-1.12.1.jar> protobuf-java-2.4.1.jar<=========----> 75% EXECUTING [5m 1s]> maven-model-3.0.1.jar> maven-plugin-api-3.0.1.jar> gradle-js-plugin-1.12.1.jar> protobuf-java-2.4.1.jar<=========----> 75% EXECUTING [5m 1s]> maven-model-3.0.1.jar> maven-plugin-api-3.0.1.jar> gradle-js-plugin-1.12.1.jar> protobuf-java-2.4.1.jar<=========----> 75% EXECUTING [5m 2s]> maven-model-3.0.1.jar> maven-plugin-api-3.0.1.jar> gradle-js-plugin-1.12.1.jar> protobuf-java-2.4.1.jar<=========----> 75% EXECUTING [5m 2s]> maven-model-3.0.1.jar> maven-plugin-api-3.0.1.jar> gradle-js-plugin-1.12.1.jar> protobuf-java-2.4.1.jar<=========----> 75% EXECUTING [5m 2s]> maven-model-3.0.1.jar> maven-plugin-api-3.0.1.jar> gradle-js-plugin-1.12.1.jar> protobuf-java-2.4.1.jar<=========----> 75% EXECUTING [5m 2s]> maven-model-3.0.1.jar> maven-plugin-api-3.0.1.jar> gradle-js-plugin-1.12.1.jar> protobuf-java-2.4.1.jar<=========----> 75% EXECUTING [5m 2s]> maven-model-3.0.1.jar> maven-plugin-api-3.0.1.jar> gradle-js-plugin-1.12.1.jar> protobuf-java-2.4.1.jar<=========----> 75% EXECUTING [5m 2s]> maven-model-3.0.1.jar> maven-plugin-api-3.0.1.jar> gradle-js-plugin-1.12.1.jar> protobuf-java-2.4.1.jar<=========----> 75% EXECUTING [5m 2s]> maven-model-3.0.1.jar> maven-plugin-api-3.0.1.jar> gradle-js-plugin-1.12.1.jar> protobuf-java-2.4.1.jar<=========----> 75% EXECUTING [5m 2s]> maven-model-3.0.1.jar> maven-plugin-api-3.0.1.jar> gradle-js-plugin-1.12.1.jar> protobuf-java-2.4.1.jar<=========----> 75% EXECUTING [5m 2s]> maven-model-3.0.1.jar> maven-plugin-api-3.0.1.jar> gradle-js-plugin-1.12.1.jar> protobuf-java-2.4.1.jar<=========----> 75% EXECUTING [5m 2s]> maven-model-3.0.1.jar> maven-plugin-api-3.0.1.jar> gradle-js-plugin-1.12.1.jar> protobuf-java-2.4.1.jar<=========----> 75% EXECUTING [5m 3s]> maven-model-3.0.1.jar> maven-plugin-api-3.0.1.jar> gradle-js-plugin-1.12.1.jar> protobuf-java-2.4.1.jar<=========----> 75% EXECUTING [5m 3s]> maven-model-3.0.1.jar> maven-plugin-api-3.0.1.jar> gradle-js-plugin-1.12.1.jar> protobuf-java-2.4.1.jar<=========----> 75% EXECUTING [5m 3s]> maven-model-3.0.1.jar> maven-plugin-api-3.0.1.jar> gradle-js-plugin-1.12.1.jar> protobuf-java-2.4.1.jar<=========----> 75% EXECUTING [5m 3s]> maven-model-3.0.1.jar> maven-plugin-api-3.0.1.jar> gradle-js-plugin-1.12.1.jar> protobuf-java-2.4.1.jar<=========----> 75% EXECUTING [5m 3s]> maven-model-3.0.1.jar> maven-plugin-api-3.0.1.jar> gradle-js-plugin-1.12.1.jar> protobuf-java-2.4.1.jar<=========----> 75% EXECUTING [5m 3s]> maven-model-3.0.1.jar> maven-plugin-api-3.0.1.jar> gradle-js-plugin-1.12.1.jar> protobuf-java-2.4.1.jar<=========----> 75% EXECUTING [5m 3s]> maven-model-3.0.1.jar> maven-plugin-api-3.0.1.jar> gradle-js-plugin-1.12.1.jar> protobuf-java-2.4.1.jar<=========----> 75% EXECUTING [5m 3s]> maven-model-3.0.1.jar> maven-plugin-api-3.0.1.jar> gradle-js-plugin-1.12.1.jar> protobuf-java-2.4.1.jar<=========----> 75% EXECUTING [5m 3s]> maven-model-3.0.1.jar> maven-plugin-api-3.0.1.jar> gradle-js-plugin-1.12.1.jar> protobuf-java-2.4.1.jar<=========----> 75% EXECUTING [5m 3s]> maven-model-3.0.1.jar> maven-plugin-api-3.0.1.jar> gradle-js-plugin-1.12.1.jar> protobuf-java-2.4.1.jar<=========----> 75% EXECUTING [5m 4s]> maven-model-3.0.1.jar> maven-plugin-api-3.0.1.jar> gradle-js-plugin-1.12.1.jar> protobuf-java-2.4.1.jar<=========----> 75% EXECUTING [5m 4s]> maven-model-3.0.1.jar> maven-plugin-api-3.0.1.jar> gradle-js-plugin-1.12.1.jar> protobuf-java-2.4.1.jar<=========----> 75% EXECUTING [5m 4s]> maven-model-3.0.1.jar> maven-plugin-api-3.0.1.jar> gradle-js-plugin-1.12.1.jar> protobuf-java-2.4.1.jar<=========----> 75% EXECUTING [5m 4s]> maven-model-3.0.1.jar> maven-plugin-api-3.0.1.jar> gradle-js-plugin-1.12.1.jar> protobuf-java-2.4.1.jar<=========----> 75% EXECUTING [5m 4s]> maven-model-3.0.1.jar> maven-plugin-api-3.0.1.jar> gradle-js-plugin-1.12.1.jar> protobuf-java-2.4.1.jar<=========----> 75% EXECUTING [5m 4s]> maven-model-3.0.1.jar> maven-plugin-api-3.0.1.jar> gradle-js-plugin-1.12.1.jar> protobuf-java-2.4.1.jar<=========----> 75% EXECUTING [5m 4s]> maven-model-3.0.1.jar> maven-plugin-api-3.0.1.jar> gradle-js-plugin-1.12.1.jar> protobuf-java-2.4.1.jar<=========----> 75% EXECUTING [5m 4s]> maven-model-3.0.1.jar> maven-plugin-api-3.0.1.jar> gradle-js-plugin-1.12.1.jar> protobuf-java-2.4.1.jar<=========----> 75% EXECUTING [5m 4s]> maven-model-3.0.1.jar> maven-plugin-api-3.0.1.jar> gradle-js-plugin-1.12.1.jar> protobuf-java-2.4.1.jar<=========----> 75% EXECUTING [5m 4s]> maven-model-3.0.1.jar> maven-plugin-api-3.0.1.jar> gradle-js-plugin-1.12.1.jar> protobuf-java-2.4.1.jar<=========----> 75% EXECUTING [5m 5s]> maven-model-3.0.1.jar> maven-plugin-api-3.0.1.jar> gradle-js-plugin-1.12.1.jar> protobuf-java-2.4.1.jar<=========----> 75% EXECUTING [5m 5s]> maven-model-3.0.1.jar> maven-plugin-api-3.0.1.jar> gradle-js-plugin-1.12.1.jar> protobuf-java-2.4.1.jar<=========----> 75% EXECUTING [5m 5s]> maven-model-3.0.1.jar> maven-plugin-api-3.0.1.jar> gradle-js-plugin-1.12.1.jar> protobuf-java-2.4.1.jar<=========----> 75% EXECUTING [5m 5s]> maven-model-3.0.1.jar> maven-plugin-api-3.0.1.jar> gradle-js-plugin-1.12.1.jar> protobuf-java-2.4.1.jar<=========----> 75% EXECUTING [5m 5s]> maven-model-3.0.1.jar> maven-plugin-api-3.0.1.jar> gradle-js-plugin-1.12.1.jar> protobuf-java-2.4.1.jar<=========----> 75% EXECUTING [5m 5s]> maven-model-3.0.1.jar> maven-plugin-api-3.0.1.jar> gradle-js-plugin-1.12.1.jar> protobuf-java-2.4.1.jar<=========----> 75% EXECUTING [5m 5s]> maven-model-3.0.1.jar> maven-plugin-api-3.0.1.jar> gradle-js-plugin-1.12.1.jar> protobuf-java-2.4.1.jar<=========----> 75% EXECUTING [5m 5s]> maven-model-3.0.1.jar> maven-plugin-api-3.0.1.jar> gradle-js-plugin-1.12.1.jar> protobuf-java-2.4.1.jar<=========----> 75% EXECUTING [5m 5s]> maven-model-3.0.1.jar> maven-plugin-api-3.0.1.jar> gradle-js-plugin-1.12.1.jar> protobuf-java-2.4.1.jar<=========----> 75% EXECUTING [5m 5s]> maven-model-3.0.1.jar> maven-plugin-api-3.0.1.jar> gradle-js-plugin-1.12.1.jar> protobuf-java-2.4.1.jar<=========----> 75% EXECUTING [5m 6s]> maven-model-3.0.1.jar> maven-plugin-api-3.0.1.jar> gradle-js-plugin-1.12.1.jar> protobuf-java-2.4.1.jar<=========----> 75% EXECUTING [5m 6s]> maven-model-3.0.1.jar> maven-plugin-api-3.0.1.jar> gradle-js-plugin-1.12.1.jar> protobuf-java-2.4.1.jar<=========----> 75% EXECUTING [5m 6s]> maven-model-3.0.1.jar> maven-plugin-api-3.0.1.jar> gradle-js-plugin-1.12.1.jar> protobuf-java-2.4.1.jar<=========----> 75% EXECUTING [5m 6s]> maven-model-3.0.1.jar> maven-plugin-api-3.0.1.jar> gradle-js-plugin-1.12.1.jar> protobuf-java-2.4.1.jar<=========----> 75% EXECUTING [5m 6s]> maven-model-3.0.1.jar> maven-plugin-api-3.0.1.jar> gradle-js-plugin-1.12.1.jar> protobuf-java-2.4.1.jar<=========----> 75% EXECUTING [5m 6s]> maven-model-3.0.1.jar> maven-plugin-api-3.0.1.jar> gradle-js-plugin-1.12.1.jar> protobuf-java-2.4.1.jar<=========----> 75% EXECUTING [5m 6s]> maven-model-3.0.1.jar> maven-plugin-api-3.0.1.jar> gradle-js-plugin-1.12.1.jar> protobuf-java-2.4.1.jar<=========----> 75% EXECUTING [5m 6s]> maven-model-3.0.1.jar> maven-plugin-api-3.0.1.jar> gradle-js-plugin-1.12.1.jar> protobuf-java-2.4.1.jar<=========----> 75% EXECUTING [5m 6s]> maven-model-3.0.1.jar> maven-plugin-api-3.0.1.jar> gradle-js-plugin-1.12.1.jar> protobuf-java-2.4.1.jar<=========----> 75% EXECUTING [5m 6s]> maven-model-3.0.1.jar> maven-plugin-api-3.0.1.jar> gradle-js-plugin-1.12.1.jar> protobuf-java-2.4.1.jar<=========----> 75% EXECUTING [5m 7s]> maven-model-3.0.1.jar> maven-plugin-api-3.0.1.jar> gradle-js-plugin-1.12.1.jar> protobuf-java-2.4.1.jar<=========----> 75% EXECUTING [5m 7s]> maven-model-3.0.1.jar> maven-plugin-api-3.0.1.jar> gradle-js-plugin-1.12.1.jar> protobuf-java-2.4.1.jar<=========----> 75% EXECUTING [5m 7s]> maven-model-3.0.1.jar> maven-plugin-api-3.0.1.jar> gradle-js-plugin-1.12.1.jar> protobuf-java-2.4.1.jar<=========----> 75% EXECUTING [5m 7s]> maven-model-3.0.1.jar> maven-plugin-api-3.0.1.jar> gradle-js-plugin-1.12.1.jar> protobuf-java-2.4.1.jar<=========----> 75% EXECUTING [5m 7s]> maven-model-3.0.1.jar> maven-plugin-api-3.0.1.jar> gradle-js-plugin-1.12.1.jar> protobuf-java-2.4.1.jar<=========----> 75% EXECUTING [5m 7s]> maven-model-3.0.1.jar> maven-plugin-api-3.0.1.jar> gradle-js-plugin-1.12.1.jar> protobuf-java-2.4.1.jar<=========----> 75% EXECUTING [5m 7s]> maven-model-3.0.1.jar> maven-plugin-api-3.0.1.jar> gradle-js-plugin-1.12.1.jar> protobuf-java-2.4.1.jar<=========----> 75% EXECUTING [5m 7s]> maven-model-3.0.1.jar> maven-plugin-api-3.0.1.jar> gradle-js-plugin-1.12.1.jar> protobuf-java-2.4.1.jar<=========----> 75% EXECUTING [5m 7s]> maven-model-3.0.1.jar> maven-plugin-api-3.0.1.jar> gradle-js-plugin-1.12.1.jar> protobuf-java-2.4.1.jar<=========----> 75% EXECUTING [5m 7s]> maven-model-3.0.1.jar> maven-plugin-api-3.0.1.jar> gradle-js-plugin-1.12.1.jar> protobuf-java-2.4.1.jar<=========----> 75% EXECUTING [5m 8s]> maven-model-3.0.1.jar> maven-plugin-api-3.0.1.jar> gradle-js-plugin-1.12.1.jar> protobuf-java-2.4.1.jar<=========----> 75% EXECUTING [5m 8s]> maven-model-3.0.1.jar> maven-plugin-api-3.0.1.jar> gradle-js-plugin-1.12.1.jar> protobuf-java-2.4.1.jar<=========----> 75% EXECUTING [5m 8s]> maven-model-3.0.1.jar> maven-plugin-api-3.0.1.jar> gradle-js-plugin-1.12.1.jar> protobuf-java-2.4.1.jar<=========----> 75% EXECUTING [5m 8s]> maven-model-3.0.1.jar> maven-plugin-api-3.0.1.jar> gradle-js-plugin-1.12.1.jar> protobuf-java-2.4.1.jar<=========----> 75% EXECUTING [5m 8s]> maven-model-3.0.1.jar> maven-plugin-api-3.0.1.jar> gradle-js-plugin-1.12.1.jar> protobuf-java-2.4.1.jar<=========----> 75% EXECUTING [5m 8s]> maven-model-3.0.1.jar> maven-plugin-api-3.0.1.jar> gradle-js-plugin-1.12.1.jar> protobuf-java-2.4.1.jar<=========----> 75% EXECUTING [5m 8s]> maven-model-3.0.1.jar> maven-plugin-api-3.0.1.jar> gradle-js-plugin-1.12.1.jar> protobuf-java-2.4.1.jar<=========----> 75% EXECUTING [5m 8s]> maven-model-3.0.1.jar> maven-plugin-api-3.0.1.jar> gradle-js-plugin-1.12.1.jar> protobuf-java-2.4.1.jar<=========----> 75% EXECUTING [5m 8s]> maven-model-3.0.1.jar> maven-plugin-api-3.0.1.jar> gradle-js-plugin-1.12.1.jar> protobuf-java-2.4.1.jar<=========----> 75% EXECUTING [5m 8s]> maven-model-3.0.1.jar> maven-plugin-api-3.0.1.jar> gradle-js-plugin-1.12.1.jar> protobuf-java-2.4.1.jar<=========----> 75% EXECUTING [5m 9s]> maven-model-3.0.1.jar> maven-plugin-api-3.0.1.jar> gradle-js-plugin-1.12.1.jar> protobuf-java-2.4.1.jar<=========----> 75% EXECUTING [5m 9s]> maven-model-3.0.1.jar> maven-plugin-api-3.0.1.jar> gradle-js-plugin-1.12.1.jar> protobuf-java-2.4.1.jar<=========----> 75% EXECUTING [5m 9s]> maven-model-3.0.1.jar> maven-plugin-api-3.0.1.jar> gradle-js-plugin-1.12.1.jar> protobuf-java-2.4.1.jar
> Task :ui:webpack
Hash: c03a29682faeac046e39
Version: webpack 2.7.0
Time: 18693ms
Asset Size Chunks Chunk Names
bundle.js 3.18 MB 0 [emitted] [big] main
bundle.js.map 3.52 MB 0 [emitted] main
[1] ./~/react/index.js 190 bytes {0} [built]
[7] ./~/react-router-dom/es/index.js 1.01 kB {0} [built]
[177] ./src/main/js/client/scheduler-client.js 795 bytes {0} [built]
[179] ./src/main/js/pages/Home.js 3.72 kB {0} [built]
[180] ./src/main/js/pages/Instance.js 6.34 kB {0} [built]
[181] ./src/main/js/pages/Job.js 8.4 kB {0} [built]
[182] ./src/main/js/pages/Jobs.js 5.17 kB {0} [built]
[183] ./src/main/js/pages/Task.js 4.64 kB {0} [built]
[184] ./src/main/js/pages/Update.js 4.91 kB {0} [built]
[185] ./src/main/js/pages/Updates.js 5.06 kB {0} [built]
[186] ./~/react-dom/index.js 1.36 kB {0} [built]
[187] ./~/bootstrap/dist/css/bootstrap.css 984 bytes {0} [built]
[188] ./src/main/sass/app.scss 1.19 kB {0} [built]
[189] ./src/main/resources/source-sans-pro.css 1.05 kB {0} [built]
[221] ./src/main/js/index.js 3.43 kB {0} [built]
+ 264 hidden modules
<=========----> 75% EXECUTING [5m 9s]> maven-model-3.0.1.jar> maven-plugin-api-3.0.1.jar> gradle-js-plugin-1.12.1.jar> protobuf-java-2.4.1.jar<==========---> 78% EXECUTING [5m 9s]> maven-model-3.0.1.jar> maven-plugin-api-3.0.1.jar> gradle-js-plugin-1.12.1.jar> protobuf-java-2.4.1.jar<==========---> 78% EXECUTING [5m 9s]> maven-model-3.0.1.jar> maven-plugin-api-3.0.1.jar> gradle-js-plugin-1.12.1.jar> protobuf-java-2.4.1.jar<==========---> 78% EXECUTING [5m 9s]> maven-model-3.0.1.jar> maven-plugin-api-3.0.1.jar> gradle-js-plugin-1.12.1.jar> protobuf-java-2.4.1.jar<==========---> 78% EXECUTING [5m 9s]> maven-model-3.0.1.jar> maven-plugin-api-3.0.1.jar> gradle-js-plugin-1.12.1.jar> protobuf-java-2.4.1.jar<===========--> 85% EXECUTING [5m 9s]> maven-model-3.0.1.jar> maven-plugin-api-3.0.1.jar> gradle-js-plugin-1.12.1.jar> protobuf-java-2.4.1.jar<===========--> 85% EXECUTING [5m 9s]> maven-model-3.0.1.jar> maven-plugin-api-3.0.1.jar> gradle-js-plugin-1.12.1.jar> protobuf-java-2.4.1.jar<===========--> 85% EXECUTING [5m 10s]> maven-model-3.0.1.jar> maven-plugin-api-3.0.1.jar> gradle-js-plugin-1.12.1.jar> protobuf-java-2.4.1.jar<===========--> 85% EXECUTING [5m 10s]> maven-model-3.0.1.jar> maven-plugin-api-3.0.1.jar> gradle-js-plugin-1.12.1.jar> protobuf-java-2.4.1.jar<===========--> 85% EXECUTING [5m 10s]> maven-model-3.0.1.jar> maven-plugin-api-3.0.1.jar> gradle-js-plugin-1.12.1.jar> protobuf-java-2.4.1.jar<===========--> 85% EXECUTING [5m 10s]> maven-model-3.0.1.jar> maven-plugin-api-3.0.1.jar> gradle-js-plugin-1.12.1.jar> protobuf-java-2.4.1.jar<===========--> 85% EXECUTING [5m 10s]> maven-model-3.0.1.jar> maven-plugin-api-3.0.1.jar> gradle-js-plugin-1.12.1.jar> protobuf-java-2.4.1.jar<===========--> 85% EXECUTING [5m 10s]> maven-model-3.0.1.jar> maven-plugin-api-3.0.1.jar> gradle-js-plugin-1.12.1.jar> protobuf-java-2.4.1.jar<===========--> 85% EXECUTING [5m 10s]> maven-model-3.0.1.jar> maven-plugin-api-3.0.1.jar> gradle-js-plugin-1.12.1.jar> protobuf-java-2.4.1.jar<===========--> 85% EXECUTING [5m 10s]> maven-model-3.0.1.jar> maven-plugin-api-3.0.1.jar> gradle-js-plugin-1.12.1.jar> protobuf-java-2.4.1.jar<===========--> 89% EXECUTING [5m 10s]> maven-model-3.0.1.jar> maven-plugin-api-3.0.1.jar> gradle-js-plugin-1.12.1.jar> protobuf-java-2.4.1.jar<===========--> 89% EXECUTING [5m 10s]> maven-model-3.0.1.jar> maven-plugin-api-3.0.1.jar> gradle-js-plugin-1.12.1.jar> protobuf-java-2.4.1.jar<===========--> 89% EXECUTING [5m 11s]> maven-model-3.0.1.jar> maven-plugin-api-3.0.1.jar> gradle-js-plugin-1.12.1.jar> protobuf-java-2.4.1.jar<============-> 92% EXECUTING [5m 11s]> maven-model-3.0.1.jar> maven-plugin-api-3.0.1.jar> gradle-js-plugin-1.12.1.jar> protobuf-java-2.4.1.jar<============-> 96% EXECUTING [5m 11s]> maven-model-3.0.1.jar> maven-plugin-api-3.0.1.jar> gradle-js-plugin-1.12.1.jar> protobuf-java-2.4.1.jar<============-> 96% EXECUTING [5m 11s]> maven-model-3.0.1.jar> maven-plugin-api-3.0.1.jar> gradle-js-plugin-1.12.1.jar> protobuf-java-2.4.1.jar<============-> 96% EXECUTING [5m 11s]> maven-model-3.0.1.jar> maven-plugin-api-3.0.1.jar> gradle-js-plugin-1.12.1.jar> protobuf-java-2.4.1.jar<============-> 96% EXECUTING [5m 11s]> maven-model-3.0.1.jar> maven-plugin-api-3.0.1.jar> gradle-js-plugin-1.12.1.jar> protobuf-java-2.4.1.jar<============-> 96% EXECUTING [5m 11s]> maven-model-3.0.1.jar> maven-plugin-api-3.0.1.jar> gradle-js-plugin-1.12.1.jar> protobuf-java-2.4.1.jar<============-> 96% EXECUTING [5m 11s]> maven-model-3.0.1.jar> maven-plugin-api-3.0.1.jar> gradle-js-plugin-1.12.1.jar> protobuf-java-2.4.1.jar<============-> 96% EXECUTING [5m 11s]> maven-model-3.0.1.jar> maven-plugin-api-3.0.1.jar> gradle-js-plugin-1.12.1.jar> protobuf-java-2.4.1.jar<============-> 96% EXECUTING [5m 11s]> maven-model-3.0.1.jar> maven-plugin-api-3.0.1.jar> gradle-js-plugin-1.12.1.jar> protobuf-java-2.4.1.jar<============-> 96% EXECUTING [5m 12s]> maven-model-3.0.1.jar> maven-plugin-api-3.0.1.jar> gradle-js-plugin-1.12.1.jar> protobuf-java-2.4.1.jar<============-> 96% EXECUTING [5m 12s]> maven-model-3.0.1.jar> maven-plugin-api-3.0.1.jar> gradle-js-plugin-1.12.1.jar> protobuf-java-2.4.1.jar<============-> 96% EXECUTING [5m 12s]> maven-model-3.0.1.jar> maven-plugin-api-3.0.1.jar> gradle-js-plugin-1.12.1.jar> protobuf-java-2.4.1.jar<============-> 96% EXECUTING [5m 12s]> maven-model-3.0.1.jar> maven-plugin-api-3.0.1.jar> gradle-js-plugin-1.12.1.jar> protobuf-java-2.4.1.jar<============-> 96% EXECUTING [5m 12s]> maven-model-3.0.1.jar> maven-plugin-api-3.0.1.jar> gradle-js-plugin-1.12.1.jar> protobuf-java-2.4.1.jar<============-> 96% EXECUTING [5m 12s]> maven-model-3.0.1.jar> maven-plugin-api-3.0.1.jar> gradle-js-plugin-1.12.1.jar> protobuf-java-2.4.1.jar<============-> 96% EXECUTING [5m 12s]> maven-model-3.0.1.jar> maven-plugin-api-3.0.1.jar> gradle-js-plugin-1.12.1.jar> protobuf-java-2.4.1.jar<============-> 96% EXECUTING [5m 12s]> maven-model-3.0.1.jar> maven-plugin-api-3.0.1.jar> gradle-js-plugin-1.12.1.jar> protobuf-java-2.4.1.jar<============-> 96% EXECUTING [5m 12s]> maven-model-3.0.1.jar> maven-plugin-api-3.0.1.jar> gradle-js-plugin-1.12.1.jar> protobuf-java-2.4.1.jar<============-> 96% EXECUTING [5m 12s]> maven-model-3.0.1.jar> maven-plugin-api-3.0.1.jar> gradle-js-plugin-1.12.1.jar> protobuf-java-2.4.1.jar<=============> 100% EXECUTING [5m 13s]> maven-model-3.0.1.jar> maven-plugin-api-3.0.1.jar> gradle-js-plugin-1.12.1.jar> protobuf-java-2.4.1.jar
BUILD SUCCESSFUL in 5m 16s
20 actionable tasks: 20 executed
<-------------> 0% WAITING> maven-model-3.0.1.jar> maven-plugin-api-3.0.1.jar> gradle-js-plugin-1.12.1.jar> protobuf-java-2.4.1.jarmkdir -p third_party
/scratch/pants binary src/main/python/apache/aurora/executor:thermos_executor
/aurora/.cache/pants/setup/bootstrap-Linux-x86_64/1.6.0/local/lib/python2.7/site-packages/cryptography/hazmat/primitives/constant_time.py:26: CryptographyDeprecationWarning: Support for your Python version is deprecated. The next version of cryptography will remove support. Please upgrade to a 2.7.x release that supports hmac.compare_digest as soon as possible.
utils.DeprecatedIn23,
fatal: Not a git repository (or any of the parent directories): .git
fatal: Not a git repository (or any of the parent directories): .git
00:45:14 00:00 [main]
(To run a reporting server: ./pants server)
00:45:14 00:00 [setup]
00:45:14 00:00 [parse]fatal: Not a git repository (or any of the parent directories): .git
Executing tasks in goals: gen -> pyprep -> binary
00:45:14 00:00 [gen]
00:45:14 00:00 [thrift-py]
00:45:14 00:00 [cache]
No cached artifacts for 4 targets.
Invalidated 4 targets.....
00:45:15 00:01 [pyprep]
00:45:15 00:01 [interpreter]
00:45:20 00:06 [build-local-dists]
00:45:20 00:06 [requirements]
00:45:20 00:06 [cache]
No cached artifacts for 27 targets.
Invalidated 27 targets.
Waiting for background workers to finish.
00:45:23 00:09 [complete]
FAILURE
Exception caught: (<class 'pex.resolver.Unsatisfiable'>)
Exception message: Could not satisfy all requirements for mesos.executor==1.5.0:
mesos.executor==1.5.0
make[1]: *** [__pants_build] Error 1
make[1]: Leaving directory `/scratch'
make: *** [build] Error 2
dpkg-buildpackage: error: debian/rules build gave error exit status 2
Build step 'Execute shell' marked build as failure
Skipped archiving because build is not successful