You are viewing a plain text version of this content. The canonical link for it is here.
Posted to dev@zookeeper.apache.org by Apache Jenkins Server <je...@builds.apache.org> on 2016/06/23 14:59:01 UTC
Failed: ZOOKEEPER-2366 PreCommit Build #3246
Jira: https://issues.apache.org/jira/browse/ZOOKEEPER-2366
Build: https://builds.apache.org/job/PreCommit-ZOOKEEPER-Build/3246/
###################################################################################
########################## LAST 60 LINES OF THE CONSOLE ###########################
[...truncated 438387 lines...]
[exec] +1 @author. The patch does not contain any @author tags.
[exec]
[exec] +1 tests included. The patch appears to include 11 new or modified tests.
[exec]
[exec] +1 javadoc. The javadoc tool did not generate any warning messages.
[exec]
[exec] +1 javac. The applied patch does not increase the total number of javac compiler warnings.
[exec]
[exec] +1 findbugs. The patch does not introduce any new Findbugs (version 2.0.3) warnings.
[exec]
[exec] +1 release audit. The applied patch does not increase the total number of release audit warnings.
[exec]
[exec] -1 core tests. The patch failed core unit tests.
[exec]
[exec] +1 contrib tests. The patch passed contrib unit tests.
[exec]
[exec] Test results: https://builds.apache.org/job/PreCommit-ZOOKEEPER-Build/3246//testReport/
[exec] Findbugs warnings: https://builds.apache.org/job/PreCommit-ZOOKEEPER-Build/3246//artifact/trunk/build/test/findbugs/newPatchFindbugsWarnings.html
[exec] Console output: https://builds.apache.org/job/PreCommit-ZOOKEEPER-Build/3246//console
[exec]
[exec] This message is automatically generated.
[exec]
[exec]
[exec] ======================================================================
[exec] ======================================================================
[exec] Adding comment to Jira.
[exec] ======================================================================
[exec] ======================================================================
[exec]
[exec]
[exec] Comment added.
[exec] 4f4ba3a2f654dd059574d1de3ba4b4fbd8be0e57 logged out
[exec]
[exec]
[exec] ======================================================================
[exec] ======================================================================
[exec] Finished build.
[exec] ======================================================================
[exec] ======================================================================
[exec]
[exec]
BUILD FAILED
/home/jenkins/jenkins-slave/workspace/PreCommit-ZOOKEEPER-Build/trunk/build.xml:1605: exec returned: 1
Total time: 20 minutes 15 seconds
Build step 'Execute shell' marked build as failure
Archiving artifacts
Setting LATEST1_7_HOME=/home/jenkins/jenkins-slave/tools/hudson.model.JDK/latest1.7
Recording test results
Setting LATEST1_7_HOME=/home/jenkins/jenkins-slave/tools/hudson.model.JDK/latest1.7
Setting LATEST1_7_HOME=/home/jenkins/jenkins-slave/tools/hudson.model.JDK/latest1.7
[description-setter] Description set: ZOOKEEPER-2366
Email was triggered for: Failure - Any
Sending email for trigger: Failure - Any
Setting LATEST1_7_HOME=/home/jenkins/jenkins-slave/tools/hudson.model.JDK/latest1.7
Setting LATEST1_7_HOME=/home/jenkins/jenkins-slave/tools/hudson.model.JDK/latest1.7
Setting LATEST1_7_HOME=/home/jenkins/jenkins-slave/tools/hudson.model.JDK/latest1.7
Setting LATEST1_7_HOME=/home/jenkins/jenkins-slave/tools/hudson.model.JDK/latest1.7
###################################################################################
############################## FAILED TESTS (if any) ##############################
All tests passed
Success: ZOOKEEPER-2366 PreCommit Build #3248
Posted by Apache Jenkins Server <je...@builds.apache.org>.
Jira: https://issues.apache.org/jira/browse/ZOOKEEPER-2366
Build: https://builds.apache.org/job/PreCommit-ZOOKEEPER-Build/3248/
###################################################################################
########################## LAST 60 LINES OF THE CONSOLE ###########################
[...truncated 444804 lines...]
[exec] http://issues.apache.org/jira/secure/attachment/12812901/ZOOKEEPER-2366.patch
[exec] against trunk revision 1749951.
[exec]
[exec] +1 @author. The patch does not contain any @author tags.
[exec]
[exec] +1 tests included. The patch appears to include 11 new or modified tests.
[exec]
[exec] +1 javadoc. The javadoc tool did not generate any warning messages.
[exec]
[exec] +1 javac. The applied patch does not increase the total number of javac compiler warnings.
[exec]
[exec] +1 findbugs. The patch does not introduce any new Findbugs (version 2.0.3) warnings.
[exec]
[exec] +1 release audit. The applied patch does not increase the total number of release audit warnings.
[exec]
[exec] +1 core tests. The patch passed core unit tests.
[exec]
[exec] +1 contrib tests. The patch passed contrib unit tests.
[exec]
[exec] Test results: https://builds.apache.org/job/PreCommit-ZOOKEEPER-Build/3248//testReport/
[exec] Findbugs warnings: https://builds.apache.org/job/PreCommit-ZOOKEEPER-Build/3248//artifact/trunk/build/test/findbugs/newPatchFindbugsWarnings.html
[exec] Console output: https://builds.apache.org/job/PreCommit-ZOOKEEPER-Build/3248//console
[exec]
[exec] This message is automatically generated.
[exec]
[exec]
[exec] ======================================================================
[exec] ======================================================================
[exec] Adding comment to Jira.
[exec] ======================================================================
[exec] ======================================================================
[exec]
[exec]
[exec] Comment added.
[exec] 2d23a84aca8a13c62fe23f20b81e48bff6178990 logged out
[exec]
[exec]
[exec] ======================================================================
[exec] ======================================================================
[exec] Finished build.
[exec] ======================================================================
[exec] ======================================================================
[exec]
[exec]
BUILD SUCCESSFUL
Total time: 20 minutes 25 seconds
Archiving artifacts
Setting LATEST1_7_HOME=/home/jenkins/jenkins-slave/tools/hudson.model.JDK/latest1.7
Recording test results
Setting LATEST1_7_HOME=/home/jenkins/jenkins-slave/tools/hudson.model.JDK/latest1.7
Setting LATEST1_7_HOME=/home/jenkins/jenkins-slave/tools/hudson.model.JDK/latest1.7
[description-setter] Description set: ZOOKEEPER-2366
Email was triggered for: Success
Sending email for trigger: Success
Setting LATEST1_7_HOME=/home/jenkins/jenkins-slave/tools/hudson.model.JDK/latest1.7
Setting LATEST1_7_HOME=/home/jenkins/jenkins-slave/tools/hudson.model.JDK/latest1.7
Setting LATEST1_7_HOME=/home/jenkins/jenkins-slave/tools/hudson.model.JDK/latest1.7
Setting LATEST1_7_HOME=/home/jenkins/jenkins-slave/tools/hudson.model.JDK/latest1.7
###################################################################################
############################## FAILED TESTS (if any) ##############################
All tests passed
Failed: ZOOKEEPER-2247 PreCommit Build #3247
Posted by Apache Jenkins Server <je...@builds.apache.org>.
Jira: https://issues.apache.org/jira/browse/ZOOKEEPER-2247
Build: https://builds.apache.org/job/PreCommit-ZOOKEEPER-Build/3247/
###################################################################################
########################## LAST 60 LINES OF THE CONSOLE ###########################
[...truncated 383588 lines...]
[exec]
[exec] +1 tests included. The patch appears to include 9 new or modified tests.
[exec]
[exec] +1 javadoc. The javadoc tool did not generate any warning messages.
[exec]
[exec] +1 javac. The applied patch does not increase the total number of javac compiler warnings.
[exec]
[exec] +1 findbugs. The patch does not introduce any new Findbugs (version 2.0.3) warnings.
[exec]
[exec] +1 release audit. The applied patch does not increase the total number of release audit warnings.
[exec]
[exec] -1 core tests. The patch failed core unit tests.
[exec]
[exec] +1 contrib tests. The patch passed contrib unit tests.
[exec]
[exec] Test results: https://builds.apache.org/job/PreCommit-ZOOKEEPER-Build/3247//testReport/
[exec] Findbugs warnings: https://builds.apache.org/job/PreCommit-ZOOKEEPER-Build/3247//artifact/trunk/build/test/findbugs/newPatchFindbugsWarnings.html
[exec] Console output: https://builds.apache.org/job/PreCommit-ZOOKEEPER-Build/3247//console
[exec]
[exec] This message is automatically generated.
[exec]
[exec]
[exec] ======================================================================
[exec] ======================================================================
[exec] Adding comment to Jira.
[exec] ======================================================================
[exec] ======================================================================
[exec]
[exec]
[exec] Comment added.
[exec] d44745ce5321b403362ee217f1a946052e1d85d5 logged out
[exec]
[exec]
[exec] ======================================================================
[exec] ======================================================================
[exec] Finished build.
[exec] ======================================================================
[exec] ======================================================================
[exec]
[exec]
BUILD FAILED
/home/jenkins/jenkins-slave/workspace/PreCommit-ZOOKEEPER-Build/trunk/build.xml:1605: exec returned: 1
Total time: 12 minutes 20 seconds
Build step 'Execute shell' marked build as failure
Archiving artifacts
Setting LATEST1_7_HOME=/home/jenkins/jenkins-slave/tools/hudson.model.JDK/latest1.7
Compressed 553.18 KB of artifacts by 23.1% relative to #3239
Recording test results
Setting LATEST1_7_HOME=/home/jenkins/jenkins-slave/tools/hudson.model.JDK/latest1.7
Setting LATEST1_7_HOME=/home/jenkins/jenkins-slave/tools/hudson.model.JDK/latest1.7
[description-setter] Description set: ZOOKEEPER-2247
Email was triggered for: Failure - Any
Sending email for trigger: Failure - Any
Setting LATEST1_7_HOME=/home/jenkins/jenkins-slave/tools/hudson.model.JDK/latest1.7
Setting LATEST1_7_HOME=/home/jenkins/jenkins-slave/tools/hudson.model.JDK/latest1.7
Setting LATEST1_7_HOME=/home/jenkins/jenkins-slave/tools/hudson.model.JDK/latest1.7
Setting LATEST1_7_HOME=/home/jenkins/jenkins-slave/tools/hudson.model.JDK/latest1.7
###################################################################################
############################## FAILED TESTS (if any) ##############################
1 tests failed.
FAILED: org.apache.zookeeper.server.quorum.StandaloneDisabledTest.startSingleServerTest
Error Message:
Server 2 is not up
Stack Trace:
junit.framework.AssertionFailedError: Server 2 is not up
at org.apache.zookeeper.server.quorum.StandaloneDisabledTest.startServer(StandaloneDisabledTest.java:167)
at org.apache.zookeeper.server.quorum.StandaloneDisabledTest.startFollowers(StandaloneDisabledTest.java:195)
at org.apache.zookeeper.server.quorum.StandaloneDisabledTest.startSingleServerTest(StandaloneDisabledTest.java:64)
at org.apache.zookeeper.JUnit4ZKTestRunner$LoggedInvokeMethod.evaluate(JUnit4ZKTestRunner.java:79)