You are viewing a plain text version of this content. The canonical link for it is here.
Posted to dev@lucene.apache.org by Apache Jenkins Server <je...@builds.apache.org> on 2019/03/16 14:04:37 UTC
[JENKINS] Lucene-Solr-NightlyTests-master - Build # 1793 - Unstable
Build: https://builds.apache.org/job/Lucene-Solr-NightlyTests-master/1793/
3 tests failed.
FAILED: org.apache.solr.cloud.api.collections.ShardSplitTest.testSplitWithChaosMonkey
Error Message:
Address already in use
Stack Trace:
java.net.BindException: Address already in use
at __randomizedtesting.SeedInfo.seed([76BA9AD6097A2124:FD9D4907487C8AA0]:0)
at sun.nio.ch.Net.bind0(Native Method)
at sun.nio.ch.Net.bind(Net.java:433)
at sun.nio.ch.Net.bind(Net.java:425)
at sun.nio.ch.ServerSocketChannelImpl.bind(ServerSocketChannelImpl.java:223)
at sun.nio.ch.ServerSocketAdaptor.bind(ServerSocketAdaptor.java:74)
at org.eclipse.jetty.server.ServerConnector.openAcceptChannel(ServerConnector.java:342)
at org.eclipse.jetty.server.ServerConnector.open(ServerConnector.java:308)
at org.eclipse.jetty.server.AbstractNetworkConnector.doStart(AbstractNetworkConnector.java:80)
at org.eclipse.jetty.server.ServerConnector.doStart(ServerConnector.java:236)
at org.eclipse.jetty.util.component.AbstractLifeCycle.start(AbstractLifeCycle.java:68)
at org.eclipse.jetty.server.Server.doStart(Server.java:394)
at org.eclipse.jetty.util.component.AbstractLifeCycle.start(AbstractLifeCycle.java:68)
at org.apache.solr.client.solrj.embedded.JettySolrRunner.retryOnPortBindFailure(JettySolrRunner.java:558)
at org.apache.solr.client.solrj.embedded.JettySolrRunner.start(JettySolrRunner.java:497)
at org.apache.solr.client.solrj.embedded.JettySolrRunner.start(JettySolrRunner.java:465)
at org.apache.solr.cloud.api.collections.ShardSplitTest.testSplitWithChaosMonkey(ShardSplitTest.java:499)
at sun.reflect.NativeMethodAccessorImpl.invoke0(Native Method)
at sun.reflect.NativeMethodAccessorImpl.invoke(NativeMethodAccessorImpl.java:62)
at sun.reflect.DelegatingMethodAccessorImpl.invoke(DelegatingMethodAccessorImpl.java:43)
at java.lang.reflect.Method.invoke(Method.java:498)
at com.carrotsearch.randomizedtesting.RandomizedRunner.invoke(RandomizedRunner.java:1750)
at com.carrotsearch.randomizedtesting.RandomizedRunner$8.evaluate(RandomizedRunner.java:938)
at com.carrotsearch.randomizedtesting.RandomizedRunner$9.evaluate(RandomizedRunner.java:974)
at com.carrotsearch.randomizedtesting.RandomizedRunner$10.evaluate(RandomizedRunner.java:988)
at org.apache.solr.BaseDistributedSearchTestCase$ShardsRepeatRule$ShardsFixedStatement.callStatement(BaseDistributedSearchTestCase.java:1082)
at org.apache.solr.BaseDistributedSearchTestCase$ShardsRepeatRule$ShardsStatement.evaluate(BaseDistributedSearchTestCase.java:1054)
at com.carrotsearch.randomizedtesting.rules.SystemPropertiesRestoreRule$1.evaluate(SystemPropertiesRestoreRule.java:57)
at org.apache.lucene.util.TestRuleSetupTeardownChained$1.evaluate(TestRuleSetupTeardownChained.java:49)
at org.apache.lucene.util.AbstractBeforeAfterRule$1.evaluate(AbstractBeforeAfterRule.java:45)
at org.apache.lucene.util.TestRuleThreadAndTestName$1.evaluate(TestRuleThreadAndTestName.java:48)
at org.apache.lucene.util.TestRuleIgnoreAfterMaxFailures$1.evaluate(TestRuleIgnoreAfterMaxFailures.java:64)
at org.apache.lucene.util.TestRuleMarkFailure$1.evaluate(TestRuleMarkFailure.java:47)
at com.carrotsearch.randomizedtesting.rules.StatementAdapter.evaluate(StatementAdapter.java:36)
at com.carrotsearch.randomizedtesting.ThreadLeakControl$StatementRunner.run(ThreadLeakControl.java:368)
at com.carrotsearch.randomizedtesting.ThreadLeakControl.forkTimeoutingTask(ThreadLeakControl.java:817)
at com.carrotsearch.randomizedtesting.ThreadLeakControl$3.evaluate(ThreadLeakControl.java:468)
at com.carrotsearch.randomizedtesting.RandomizedRunner.runSingleTest(RandomizedRunner.java:947)
at com.carrotsearch.randomizedtesting.RandomizedRunner$5.evaluate(RandomizedRunner.java:832)
at com.carrotsearch.randomizedtesting.RandomizedRunner$6.evaluate(RandomizedRunner.java:883)
at com.carrotsearch.randomizedtesting.RandomizedRunner$7.evaluate(RandomizedRunner.java:894)
at com.carrotsearch.randomizedtesting.rules.StatementAdapter.evaluate(StatementAdapter.java:36)
at com.carrotsearch.randomizedtesting.rules.SystemPropertiesRestoreRule$1.evaluate(SystemPropertiesRestoreRule.java:57)
at org.apache.lucene.util.AbstractBeforeAfterRule$1.evaluate(AbstractBeforeAfterRule.java:45)
at com.carrotsearch.randomizedtesting.rules.StatementAdapter.evaluate(StatementAdapter.java:36)
at org.apache.lucene.util.TestRuleStoreClassName$1.evaluate(TestRuleStoreClassName.java:41)
at com.carrotsearch.randomizedtesting.rules.NoShadowingOrOverridesOnMethodsRule$1.evaluate(NoShadowingOrOverridesOnMethodsRule.java:40)
at com.carrotsearch.randomizedtesting.rules.NoShadowingOrOverridesOnMethodsRule$1.evaluate(NoShadowingOrOverridesOnMethodsRule.java:40)
at com.carrotsearch.randomizedtesting.rules.StatementAdapter.evaluate(StatementAdapter.java:36)
at com.carrotsearch.randomizedtesting.rules.StatementAdapter.evaluate(StatementAdapter.java:36)
at com.carrotsearch.randomizedtesting.rules.StatementAdapter.evaluate(StatementAdapter.java:36)
at org.apache.lucene.util.TestRuleAssertionsRequired$1.evaluate(TestRuleAssertionsRequired.java:53)
at org.apache.lucene.util.TestRuleMarkFailure$1.evaluate(TestRuleMarkFailure.java:47)
at org.apache.lucene.util.TestRuleIgnoreAfterMaxFailures$1.evaluate(TestRuleIgnoreAfterMaxFailures.java:64)
at org.apache.lucene.util.TestRuleIgnoreTestSuites$1.evaluate(TestRuleIgnoreTestSuites.java:54)
at com.carrotsearch.randomizedtesting.rules.StatementAdapter.evaluate(StatementAdapter.java:36)
at com.carrotsearch.randomizedtesting.ThreadLeakControl$StatementRunner.run(ThreadLeakControl.java:368)
at java.lang.Thread.run(Thread.java:748)
FAILED: junit.framework.TestSuite.org.apache.solr.cloud.api.collections.ShardSplitTest
Error Message:
10 threads leaked from SUITE scope at org.apache.solr.cloud.api.collections.ShardSplitTest: 1) Thread[id=39735, name=qtp1570897077-39735, state=TIMED_WAITING, group=TGRP-ShardSplitTest] at sun.misc.Unsafe.park(Native Method) at java.util.concurrent.locks.LockSupport.parkNanos(LockSupport.java:215) at java.util.concurrent.locks.AbstractQueuedSynchronizer$ConditionObject.awaitNanos(AbstractQueuedSynchronizer.java:2078) at org.eclipse.jetty.util.BlockingArrayQueue.poll(BlockingArrayQueue.java:392) at org.eclipse.jetty.util.thread.QueuedThreadPool.idleJobPoll(QueuedThreadPool.java:656) at org.eclipse.jetty.util.thread.QueuedThreadPool.access$800(QueuedThreadPool.java:46) at org.eclipse.jetty.util.thread.QueuedThreadPool$2.run(QueuedThreadPool.java:720) at java.lang.Thread.run(Thread.java:748) 2) Thread[id=39734, name=qtp1570897077-39734-acceptor-0@70ee903e-ServerConnector@1636d386{HTTP/1.1,[http/1.1, h2c]}{127.0.0.1:37371}, state=RUNNABLE, group=TGRP-ShardSplitTest] at sun.nio.ch.ServerSocketChannelImpl.accept0(Native Method) at sun.nio.ch.ServerSocketChannelImpl.accept(ServerSocketChannelImpl.java:422) at sun.nio.ch.ServerSocketChannelImpl.accept(ServerSocketChannelImpl.java:250) at org.eclipse.jetty.server.ServerConnector.accept(ServerConnector.java:385) at org.eclipse.jetty.server.AbstractConnector$Acceptor.run(AbstractConnector.java:648) at org.eclipse.jetty.util.thread.QueuedThreadPool.runJob(QueuedThreadPool.java:765) at org.eclipse.jetty.util.thread.QueuedThreadPool$2.run(QueuedThreadPool.java:683) at java.lang.Thread.run(Thread.java:748) 3) Thread[id=39733, name=qtp1570897077-39733, state=RUNNABLE, group=TGRP-ShardSplitTest] at sun.nio.ch.EPollArrayWrapper.epollWait(Native Method) at sun.nio.ch.EPollArrayWrapper.poll(EPollArrayWrapper.java:269) at sun.nio.ch.EPollSelectorImpl.doSelect(EPollSelectorImpl.java:93) at sun.nio.ch.SelectorImpl.lockAndDoSelect(SelectorImpl.java:86) at sun.nio.ch.SelectorImpl.select(SelectorImpl.java:97) at sun.nio.ch.SelectorImpl.select(SelectorImpl.java:101) at org.eclipse.jetty.io.ManagedSelector$SelectorProducer.select(ManagedSelector.java:423) at org.eclipse.jetty.io.ManagedSelector$SelectorProducer.produce(ManagedSelector.java:360) at org.eclipse.jetty.util.thread.strategy.EatWhatYouKill.produceTask(EatWhatYouKill.java:357) at org.eclipse.jetty.util.thread.strategy.EatWhatYouKill.doProduce(EatWhatYouKill.java:181) at org.eclipse.jetty.util.thread.strategy.EatWhatYouKill.tryProduce(EatWhatYouKill.java:168) at org.eclipse.jetty.util.thread.strategy.EatWhatYouKill.produce(EatWhatYouKill.java:132) at org.eclipse.jetty.io.ManagedSelector$$Lambda$64/385660182.run(Unknown Source) at org.eclipse.jetty.util.thread.QueuedThreadPool.runJob(QueuedThreadPool.java:765) at org.eclipse.jetty.util.thread.QueuedThreadPool$2.run(QueuedThreadPool.java:683) at java.lang.Thread.run(Thread.java:748) 4) Thread[id=39736, name=qtp1570897077-39736, state=TIMED_WAITING, group=TGRP-ShardSplitTest] at sun.misc.Unsafe.park(Native Method) at java.util.concurrent.locks.LockSupport.parkNanos(LockSupport.java:215) at java.util.concurrent.locks.AbstractQueuedSynchronizer$ConditionObject.awaitNanos(AbstractQueuedSynchronizer.java:2078) at org.eclipse.jetty.util.BlockingArrayQueue.poll(BlockingArrayQueue.java:392) at org.eclipse.jetty.util.thread.QueuedThreadPool.idleJobPoll(QueuedThreadPool.java:656) at org.eclipse.jetty.util.thread.QueuedThreadPool.access$800(QueuedThreadPool.java:46) at org.eclipse.jetty.util.thread.QueuedThreadPool$2.run(QueuedThreadPool.java:720) at java.lang.Thread.run(Thread.java:748) 5) Thread[id=39740, name=Scheduler-318829532, state=TIMED_WAITING, group=TGRP-ShardSplitTest] at sun.misc.Unsafe.park(Native Method) at java.util.concurrent.locks.LockSupport.parkNanos(LockSupport.java:215) at java.util.concurrent.locks.AbstractQueuedSynchronizer$ConditionObject.awaitNanos(AbstractQueuedSynchronizer.java:2078) at java.util.concurrent.ScheduledThreadPoolExecutor$DelayedWorkQueue.take(ScheduledThreadPoolExecutor.java:1093) at java.util.concurrent.ScheduledThreadPoolExecutor$DelayedWorkQueue.take(ScheduledThreadPoolExecutor.java:809) at java.util.concurrent.ThreadPoolExecutor.getTask(ThreadPoolExecutor.java:1074) at java.util.concurrent.ThreadPoolExecutor.runWorker(ThreadPoolExecutor.java:1134) at java.util.concurrent.ThreadPoolExecutor$Worker.run(ThreadPoolExecutor.java:624) at java.lang.Thread.run(Thread.java:748) 6) Thread[id=39739, name=qtp1570897077-39739, state=TIMED_WAITING, group=TGRP-ShardSplitTest] at sun.misc.Unsafe.park(Native Method) at java.util.concurrent.locks.LockSupport.parkNanos(LockSupport.java:215) at java.util.concurrent.locks.AbstractQueuedSynchronizer$ConditionObject.awaitNanos(AbstractQueuedSynchronizer.java:2078) at org.eclipse.jetty.util.BlockingArrayQueue.poll(BlockingArrayQueue.java:392) at org.eclipse.jetty.util.thread.QueuedThreadPool.idleJobPoll(QueuedThreadPool.java:656) at org.eclipse.jetty.util.thread.QueuedThreadPool.access$800(QueuedThreadPool.java:46) at org.eclipse.jetty.util.thread.QueuedThreadPool$2.run(QueuedThreadPool.java:720) at java.lang.Thread.run(Thread.java:748) 7) Thread[id=39732, name=qtp1570897077-39732, state=RUNNABLE, group=TGRP-ShardSplitTest] at sun.nio.ch.EPollArrayWrapper.epollWait(Native Method) at sun.nio.ch.EPollArrayWrapper.poll(EPollArrayWrapper.java:269) at sun.nio.ch.EPollSelectorImpl.doSelect(EPollSelectorImpl.java:93) at sun.nio.ch.SelectorImpl.lockAndDoSelect(SelectorImpl.java:86) at sun.nio.ch.SelectorImpl.select(SelectorImpl.java:97) at sun.nio.ch.SelectorImpl.select(SelectorImpl.java:101) at org.eclipse.jetty.io.ManagedSelector$SelectorProducer.select(ManagedSelector.java:423) at org.eclipse.jetty.io.ManagedSelector$SelectorProducer.produce(ManagedSelector.java:360) at org.eclipse.jetty.util.thread.strategy.EatWhatYouKill.produceTask(EatWhatYouKill.java:357) at org.eclipse.jetty.util.thread.strategy.EatWhatYouKill.doProduce(EatWhatYouKill.java:181) at org.eclipse.jetty.util.thread.strategy.EatWhatYouKill.tryProduce(EatWhatYouKill.java:168) at org.eclipse.jetty.util.thread.strategy.EatWhatYouKill.produce(EatWhatYouKill.java:132) at org.eclipse.jetty.io.ManagedSelector$$Lambda$64/385660182.run(Unknown Source) at org.eclipse.jetty.util.thread.QueuedThreadPool.runJob(QueuedThreadPool.java:765) at org.eclipse.jetty.util.thread.QueuedThreadPool$2.run(QueuedThreadPool.java:683) at java.lang.Thread.run(Thread.java:748) 8) Thread[id=39738, name=qtp1570897077-39738, state=TIMED_WAITING, group=TGRP-ShardSplitTest] at sun.misc.Unsafe.park(Native Method) at java.util.concurrent.locks.LockSupport.parkNanos(LockSupport.java:215) at java.util.concurrent.locks.AbstractQueuedSynchronizer$ConditionObject.awaitNanos(AbstractQueuedSynchronizer.java:2078) at org.eclipse.jetty.util.BlockingArrayQueue.poll(BlockingArrayQueue.java:392) at org.eclipse.jetty.util.thread.QueuedThreadPool.idleJobPoll(QueuedThreadPool.java:656) at org.eclipse.jetty.util.thread.QueuedThreadPool.access$800(QueuedThreadPool.java:46) at org.eclipse.jetty.util.thread.QueuedThreadPool$2.run(QueuedThreadPool.java:720) at java.lang.Thread.run(Thread.java:748) 9) Thread[id=39737, name=qtp1570897077-39737, state=TIMED_WAITING, group=TGRP-ShardSplitTest] at sun.misc.Unsafe.park(Native Method) at java.util.concurrent.locks.LockSupport.parkNanos(LockSupport.java:215) at java.util.concurrent.locks.AbstractQueuedSynchronizer$ConditionObject.awaitNanos(AbstractQueuedSynchronizer.java:2078) at org.eclipse.jetty.util.BlockingArrayQueue.poll(BlockingArrayQueue.java:392) at org.eclipse.jetty.util.thread.QueuedThreadPool.idleJobPoll(QueuedThreadPool.java:656) at org.eclipse.jetty.util.thread.QueuedThreadPool.access$800(QueuedThreadPool.java:46) at org.eclipse.jetty.util.thread.QueuedThreadPool$2.run(QueuedThreadPool.java:720) at java.lang.Thread.run(Thread.java:748) 10) Thread[id=39861, name=Scheduler-1503552473, state=TIMED_WAITING, group=TGRP-ShardSplitTest] at sun.misc.Unsafe.park(Native Method) at java.util.concurrent.locks.LockSupport.parkNanos(LockSupport.java:215) at java.util.concurrent.locks.AbstractQueuedSynchronizer$ConditionObject.awaitNanos(AbstractQueuedSynchronizer.java:2078) at java.util.concurrent.ScheduledThreadPoolExecutor$DelayedWorkQueue.take(ScheduledThreadPoolExecutor.java:1093) at java.util.concurrent.ScheduledThreadPoolExecutor$DelayedWorkQueue.take(ScheduledThreadPoolExecutor.java:809) at java.util.concurrent.ThreadPoolExecutor.getTask(ThreadPoolExecutor.java:1074) at java.util.concurrent.ThreadPoolExecutor.runWorker(ThreadPoolExecutor.java:1134) at java.util.concurrent.ThreadPoolExecutor$Worker.run(ThreadPoolExecutor.java:624) at java.lang.Thread.run(Thread.java:748)
Stack Trace:
com.carrotsearch.randomizedtesting.ThreadLeakError: 10 threads leaked from SUITE scope at org.apache.solr.cloud.api.collections.ShardSplitTest:
1) Thread[id=39735, name=qtp1570897077-39735, state=TIMED_WAITING, group=TGRP-ShardSplitTest]
at sun.misc.Unsafe.park(Native Method)
at java.util.concurrent.locks.LockSupport.parkNanos(LockSupport.java:215)
at java.util.concurrent.locks.AbstractQueuedSynchronizer$ConditionObject.awaitNanos(AbstractQueuedSynchronizer.java:2078)
at org.eclipse.jetty.util.BlockingArrayQueue.poll(BlockingArrayQueue.java:392)
at org.eclipse.jetty.util.thread.QueuedThreadPool.idleJobPoll(QueuedThreadPool.java:656)
at org.eclipse.jetty.util.thread.QueuedThreadPool.access$800(QueuedThreadPool.java:46)
at org.eclipse.jetty.util.thread.QueuedThreadPool$2.run(QueuedThreadPool.java:720)
at java.lang.Thread.run(Thread.java:748)
2) Thread[id=39734, name=qtp1570897077-39734-acceptor-0@70ee903e-ServerConnector@1636d386{HTTP/1.1,[http/1.1, h2c]}{127.0.0.1:37371}, state=RUNNABLE, group=TGRP-ShardSplitTest]
at sun.nio.ch.ServerSocketChannelImpl.accept0(Native Method)
at sun.nio.ch.ServerSocketChannelImpl.accept(ServerSocketChannelImpl.java:422)
at sun.nio.ch.ServerSocketChannelImpl.accept(ServerSocketChannelImpl.java:250)
at org.eclipse.jetty.server.ServerConnector.accept(ServerConnector.java:385)
at org.eclipse.jetty.server.AbstractConnector$Acceptor.run(AbstractConnector.java:648)
at org.eclipse.jetty.util.thread.QueuedThreadPool.runJob(QueuedThreadPool.java:765)
at org.eclipse.jetty.util.thread.QueuedThreadPool$2.run(QueuedThreadPool.java:683)
at java.lang.Thread.run(Thread.java:748)
3) Thread[id=39733, name=qtp1570897077-39733, state=RUNNABLE, group=TGRP-ShardSplitTest]
at sun.nio.ch.EPollArrayWrapper.epollWait(Native Method)
at sun.nio.ch.EPollArrayWrapper.poll(EPollArrayWrapper.java:269)
at sun.nio.ch.EPollSelectorImpl.doSelect(EPollSelectorImpl.java:93)
at sun.nio.ch.SelectorImpl.lockAndDoSelect(SelectorImpl.java:86)
at sun.nio.ch.SelectorImpl.select(SelectorImpl.java:97)
at sun.nio.ch.SelectorImpl.select(SelectorImpl.java:101)
at org.eclipse.jetty.io.ManagedSelector$SelectorProducer.select(ManagedSelector.java:423)
at org.eclipse.jetty.io.ManagedSelector$SelectorProducer.produce(ManagedSelector.java:360)
at org.eclipse.jetty.util.thread.strategy.EatWhatYouKill.produceTask(EatWhatYouKill.java:357)
at org.eclipse.jetty.util.thread.strategy.EatWhatYouKill.doProduce(EatWhatYouKill.java:181)
at org.eclipse.jetty.util.thread.strategy.EatWhatYouKill.tryProduce(EatWhatYouKill.java:168)
at org.eclipse.jetty.util.thread.strategy.EatWhatYouKill.produce(EatWhatYouKill.java:132)
at org.eclipse.jetty.io.ManagedSelector$$Lambda$64/385660182.run(Unknown Source)
at org.eclipse.jetty.util.thread.QueuedThreadPool.runJob(QueuedThreadPool.java:765)
at org.eclipse.jetty.util.thread.QueuedThreadPool$2.run(QueuedThreadPool.java:683)
at java.lang.Thread.run(Thread.java:748)
4) Thread[id=39736, name=qtp1570897077-39736, state=TIMED_WAITING, group=TGRP-ShardSplitTest]
at sun.misc.Unsafe.park(Native Method)
at java.util.concurrent.locks.LockSupport.parkNanos(LockSupport.java:215)
at java.util.concurrent.locks.AbstractQueuedSynchronizer$ConditionObject.awaitNanos(AbstractQueuedSynchronizer.java:2078)
at org.eclipse.jetty.util.BlockingArrayQueue.poll(BlockingArrayQueue.java:392)
at org.eclipse.jetty.util.thread.QueuedThreadPool.idleJobPoll(QueuedThreadPool.java:656)
at org.eclipse.jetty.util.thread.QueuedThreadPool.access$800(QueuedThreadPool.java:46)
at org.eclipse.jetty.util.thread.QueuedThreadPool$2.run(QueuedThreadPool.java:720)
at java.lang.Thread.run(Thread.java:748)
5) Thread[id=39740, name=Scheduler-318829532, state=TIMED_WAITING, group=TGRP-ShardSplitTest]
at sun.misc.Unsafe.park(Native Method)
at java.util.concurrent.locks.LockSupport.parkNanos(LockSupport.java:215)
at java.util.concurrent.locks.AbstractQueuedSynchronizer$ConditionObject.awaitNanos(AbstractQueuedSynchronizer.java:2078)
at java.util.concurrent.ScheduledThreadPoolExecutor$DelayedWorkQueue.take(ScheduledThreadPoolExecutor.java:1093)
at java.util.concurrent.ScheduledThreadPoolExecutor$DelayedWorkQueue.take(ScheduledThreadPoolExecutor.java:809)
at java.util.concurrent.ThreadPoolExecutor.getTask(ThreadPoolExecutor.java:1074)
at java.util.concurrent.ThreadPoolExecutor.runWorker(ThreadPoolExecutor.java:1134)
at java.util.concurrent.ThreadPoolExecutor$Worker.run(ThreadPoolExecutor.java:624)
at java.lang.Thread.run(Thread.java:748)
6) Thread[id=39739, name=qtp1570897077-39739, state=TIMED_WAITING, group=TGRP-ShardSplitTest]
at sun.misc.Unsafe.park(Native Method)
at java.util.concurrent.locks.LockSupport.parkNanos(LockSupport.java:215)
at java.util.concurrent.locks.AbstractQueuedSynchronizer$ConditionObject.awaitNanos(AbstractQueuedSynchronizer.java:2078)
at org.eclipse.jetty.util.BlockingArrayQueue.poll(BlockingArrayQueue.java:392)
at org.eclipse.jetty.util.thread.QueuedThreadPool.idleJobPoll(QueuedThreadPool.java:656)
at org.eclipse.jetty.util.thread.QueuedThreadPool.access$800(QueuedThreadPool.java:46)
at org.eclipse.jetty.util.thread.QueuedThreadPool$2.run(QueuedThreadPool.java:720)
at java.lang.Thread.run(Thread.java:748)
7) Thread[id=39732, name=qtp1570897077-39732, state=RUNNABLE, group=TGRP-ShardSplitTest]
at sun.nio.ch.EPollArrayWrapper.epollWait(Native Method)
at sun.nio.ch.EPollArrayWrapper.poll(EPollArrayWrapper.java:269)
at sun.nio.ch.EPollSelectorImpl.doSelect(EPollSelectorImpl.java:93)
at sun.nio.ch.SelectorImpl.lockAndDoSelect(SelectorImpl.java:86)
at sun.nio.ch.SelectorImpl.select(SelectorImpl.java:97)
at sun.nio.ch.SelectorImpl.select(SelectorImpl.java:101)
at org.eclipse.jetty.io.ManagedSelector$SelectorProducer.select(ManagedSelector.java:423)
at org.eclipse.jetty.io.ManagedSelector$SelectorProducer.produce(ManagedSelector.java:360)
at org.eclipse.jetty.util.thread.strategy.EatWhatYouKill.produceTask(EatWhatYouKill.java:357)
at org.eclipse.jetty.util.thread.strategy.EatWhatYouKill.doProduce(EatWhatYouKill.java:181)
at org.eclipse.jetty.util.thread.strategy.EatWhatYouKill.tryProduce(EatWhatYouKill.java:168)
at org.eclipse.jetty.util.thread.strategy.EatWhatYouKill.produce(EatWhatYouKill.java:132)
at org.eclipse.jetty.io.ManagedSelector$$Lambda$64/385660182.run(Unknown Source)
at org.eclipse.jetty.util.thread.QueuedThreadPool.runJob(QueuedThreadPool.java:765)
at org.eclipse.jetty.util.thread.QueuedThreadPool$2.run(QueuedThreadPool.java:683)
at java.lang.Thread.run(Thread.java:748)
8) Thread[id=39738, name=qtp1570897077-39738, state=TIMED_WAITING, group=TGRP-ShardSplitTest]
at sun.misc.Unsafe.park(Native Method)
at java.util.concurrent.locks.LockSupport.parkNanos(LockSupport.java:215)
at java.util.concurrent.locks.AbstractQueuedSynchronizer$ConditionObject.awaitNanos(AbstractQueuedSynchronizer.java:2078)
at org.eclipse.jetty.util.BlockingArrayQueue.poll(BlockingArrayQueue.java:392)
at org.eclipse.jetty.util.thread.QueuedThreadPool.idleJobPoll(QueuedThreadPool.java:656)
at org.eclipse.jetty.util.thread.QueuedThreadPool.access$800(QueuedThreadPool.java:46)
at org.eclipse.jetty.util.thread.QueuedThreadPool$2.run(QueuedThreadPool.java:720)
at java.lang.Thread.run(Thread.java:748)
9) Thread[id=39737, name=qtp1570897077-39737, state=TIMED_WAITING, group=TGRP-ShardSplitTest]
at sun.misc.Unsafe.park(Native Method)
at java.util.concurrent.locks.LockSupport.parkNanos(LockSupport.java:215)
at java.util.concurrent.locks.AbstractQueuedSynchronizer$ConditionObject.awaitNanos(AbstractQueuedSynchronizer.java:2078)
at org.eclipse.jetty.util.BlockingArrayQueue.poll(BlockingArrayQueue.java:392)
at org.eclipse.jetty.util.thread.QueuedThreadPool.idleJobPoll(QueuedThreadPool.java:656)
at org.eclipse.jetty.util.thread.QueuedThreadPool.access$800(QueuedThreadPool.java:46)
at org.eclipse.jetty.util.thread.QueuedThreadPool$2.run(QueuedThreadPool.java:720)
at java.lang.Thread.run(Thread.java:748)
10) Thread[id=39861, name=Scheduler-1503552473, state=TIMED_WAITING, group=TGRP-ShardSplitTest]
at sun.misc.Unsafe.park(Native Method)
at java.util.concurrent.locks.LockSupport.parkNanos(LockSupport.java:215)
at java.util.concurrent.locks.AbstractQueuedSynchronizer$ConditionObject.awaitNanos(AbstractQueuedSynchronizer.java:2078)
at java.util.concurrent.ScheduledThreadPoolExecutor$DelayedWorkQueue.take(ScheduledThreadPoolExecutor.java:1093)
at java.util.concurrent.ScheduledThreadPoolExecutor$DelayedWorkQueue.take(ScheduledThreadPoolExecutor.java:809)
at java.util.concurrent.ThreadPoolExecutor.getTask(ThreadPoolExecutor.java:1074)
at java.util.concurrent.ThreadPoolExecutor.runWorker(ThreadPoolExecutor.java:1134)
at java.util.concurrent.ThreadPoolExecutor$Worker.run(ThreadPoolExecutor.java:624)
at java.lang.Thread.run(Thread.java:748)
at __randomizedtesting.SeedInfo.seed([76BA9AD6097A2124]:0)
FAILED: junit.framework.TestSuite.org.apache.solr.cloud.api.collections.ShardSplitTest
Error Message:
There are still zombie threads that couldn't be terminated: 1) Thread[id=39732, name=qtp1570897077-39732, state=RUNNABLE, group=TGRP-ShardSplitTest] at sun.nio.ch.EPollArrayWrapper.epollWait(Native Method) at sun.nio.ch.EPollArrayWrapper.poll(EPollArrayWrapper.java:269) at sun.nio.ch.EPollSelectorImpl.doSelect(EPollSelectorImpl.java:93) at sun.nio.ch.SelectorImpl.lockAndDoSelect(SelectorImpl.java:86) at sun.nio.ch.SelectorImpl.select(SelectorImpl.java:97) at sun.nio.ch.SelectorImpl.select(SelectorImpl.java:101) at org.eclipse.jetty.io.ManagedSelector$SelectorProducer.select(ManagedSelector.java:423) at org.eclipse.jetty.io.ManagedSelector$SelectorProducer.produce(ManagedSelector.java:360) at org.eclipse.jetty.util.thread.strategy.EatWhatYouKill.produceTask(EatWhatYouKill.java:357) at org.eclipse.jetty.util.thread.strategy.EatWhatYouKill.doProduce(EatWhatYouKill.java:181) at org.eclipse.jetty.util.thread.strategy.EatWhatYouKill.tryProduce(EatWhatYouKill.java:168) at org.eclipse.jetty.util.thread.strategy.EatWhatYouKill.produce(EatWhatYouKill.java:132) at org.eclipse.jetty.io.ManagedSelector$$Lambda$64/385660182.run(Unknown Source) at org.eclipse.jetty.util.thread.QueuedThreadPool.runJob(QueuedThreadPool.java:765) at org.eclipse.jetty.util.thread.QueuedThreadPool$2.run(QueuedThreadPool.java:683) at java.lang.Thread.run(Thread.java:748) 2) Thread[id=39733, name=qtp1570897077-39733, state=RUNNABLE, group=TGRP-ShardSplitTest] at sun.nio.ch.EPollArrayWrapper.epollWait(Native Method) at sun.nio.ch.EPollArrayWrapper.poll(EPollArrayWrapper.java:269) at sun.nio.ch.EPollSelectorImpl.doSelect(EPollSelectorImpl.java:93) at sun.nio.ch.SelectorImpl.lockAndDoSelect(SelectorImpl.java:86) at sun.nio.ch.SelectorImpl.select(SelectorImpl.java:97) at sun.nio.ch.SelectorImpl.select(SelectorImpl.java:101) at org.eclipse.jetty.io.ManagedSelector$SelectorProducer.select(ManagedSelector.java:423) at org.eclipse.jetty.io.ManagedSelector$SelectorProducer.produce(ManagedSelector.java:360) at org.eclipse.jetty.util.thread.strategy.EatWhatYouKill.produceTask(EatWhatYouKill.java:357) at org.eclipse.jetty.util.thread.strategy.EatWhatYouKill.doProduce(EatWhatYouKill.java:181) at org.eclipse.jetty.util.thread.strategy.EatWhatYouKill.tryProduce(EatWhatYouKill.java:168) at org.eclipse.jetty.util.thread.strategy.EatWhatYouKill.produce(EatWhatYouKill.java:132) at org.eclipse.jetty.io.ManagedSelector$$Lambda$64/385660182.run(Unknown Source) at org.eclipse.jetty.util.thread.QueuedThreadPool.runJob(QueuedThreadPool.java:765) at org.eclipse.jetty.util.thread.QueuedThreadPool$2.run(QueuedThreadPool.java:683) at java.lang.Thread.run(Thread.java:748) 3) Thread[id=39740, name=Scheduler-318829532, state=TIMED_WAITING, group=TGRP-ShardSplitTest] at sun.misc.Unsafe.park(Native Method) at java.util.concurrent.locks.LockSupport.parkNanos(LockSupport.java:215) at java.util.concurrent.locks.AbstractQueuedSynchronizer$ConditionObject.awaitNanos(AbstractQueuedSynchronizer.java:2078) at java.util.concurrent.ScheduledThreadPoolExecutor$DelayedWorkQueue.take(ScheduledThreadPoolExecutor.java:1093) at java.util.concurrent.ScheduledThreadPoolExecutor$DelayedWorkQueue.take(ScheduledThreadPoolExecutor.java:809) at java.util.concurrent.ThreadPoolExecutor.getTask(ThreadPoolExecutor.java:1074) at java.util.concurrent.ThreadPoolExecutor.runWorker(ThreadPoolExecutor.java:1134) at java.util.concurrent.ThreadPoolExecutor$Worker.run(ThreadPoolExecutor.java:624) at java.lang.Thread.run(Thread.java:748) 4) Thread[id=39861, name=Scheduler-1503552473, state=WAITING, group=TGRP-ShardSplitTest] at sun.misc.Unsafe.park(Native Method) at java.util.concurrent.locks.LockSupport.park(LockSupport.java:175) at java.util.concurrent.locks.AbstractQueuedSynchronizer$ConditionObject.await(AbstractQueuedSynchronizer.java:2039) at java.util.concurrent.ScheduledThreadPoolExecutor$DelayedWorkQueue.take(ScheduledThreadPoolExecutor.java:1081) at java.util.concurrent.ScheduledThreadPoolExecutor$DelayedWorkQueue.take(ScheduledThreadPoolExecutor.java:809) at java.util.concurrent.ThreadPoolExecutor.getTask(ThreadPoolExecutor.java:1074) at java.util.concurrent.ThreadPoolExecutor.runWorker(ThreadPoolExecutor.java:1134) at java.util.concurrent.ThreadPoolExecutor$Worker.run(ThreadPoolExecutor.java:624) at java.lang.Thread.run(Thread.java:748)
Stack Trace:
com.carrotsearch.randomizedtesting.ThreadLeakError: There are still zombie threads that couldn't be terminated:
1) Thread[id=39732, name=qtp1570897077-39732, state=RUNNABLE, group=TGRP-ShardSplitTest]
at sun.nio.ch.EPollArrayWrapper.epollWait(Native Method)
at sun.nio.ch.EPollArrayWrapper.poll(EPollArrayWrapper.java:269)
at sun.nio.ch.EPollSelectorImpl.doSelect(EPollSelectorImpl.java:93)
at sun.nio.ch.SelectorImpl.lockAndDoSelect(SelectorImpl.java:86)
at sun.nio.ch.SelectorImpl.select(SelectorImpl.java:97)
at sun.nio.ch.SelectorImpl.select(SelectorImpl.java:101)
at org.eclipse.jetty.io.ManagedSelector$SelectorProducer.select(ManagedSelector.java:423)
at org.eclipse.jetty.io.ManagedSelector$SelectorProducer.produce(ManagedSelector.java:360)
at org.eclipse.jetty.util.thread.strategy.EatWhatYouKill.produceTask(EatWhatYouKill.java:357)
at org.eclipse.jetty.util.thread.strategy.EatWhatYouKill.doProduce(EatWhatYouKill.java:181)
at org.eclipse.jetty.util.thread.strategy.EatWhatYouKill.tryProduce(EatWhatYouKill.java:168)
at org.eclipse.jetty.util.thread.strategy.EatWhatYouKill.produce(EatWhatYouKill.java:132)
at org.eclipse.jetty.io.ManagedSelector$$Lambda$64/385660182.run(Unknown Source)
at org.eclipse.jetty.util.thread.QueuedThreadPool.runJob(QueuedThreadPool.java:765)
at org.eclipse.jetty.util.thread.QueuedThreadPool$2.run(QueuedThreadPool.java:683)
at java.lang.Thread.run(Thread.java:748)
2) Thread[id=39733, name=qtp1570897077-39733, state=RUNNABLE, group=TGRP-ShardSplitTest]
at sun.nio.ch.EPollArrayWrapper.epollWait(Native Method)
at sun.nio.ch.EPollArrayWrapper.poll(EPollArrayWrapper.java:269)
at sun.nio.ch.EPollSelectorImpl.doSelect(EPollSelectorImpl.java:93)
at sun.nio.ch.SelectorImpl.lockAndDoSelect(SelectorImpl.java:86)
at sun.nio.ch.SelectorImpl.select(SelectorImpl.java:97)
at sun.nio.ch.SelectorImpl.select(SelectorImpl.java:101)
at org.eclipse.jetty.io.ManagedSelector$SelectorProducer.select(ManagedSelector.java:423)
at org.eclipse.jetty.io.ManagedSelector$SelectorProducer.produce(ManagedSelector.java:360)
at org.eclipse.jetty.util.thread.strategy.EatWhatYouKill.produceTask(EatWhatYouKill.java:357)
at org.eclipse.jetty.util.thread.strategy.EatWhatYouKill.doProduce(EatWhatYouKill.java:181)
at org.eclipse.jetty.util.thread.strategy.EatWhatYouKill.tryProduce(EatWhatYouKill.java:168)
at org.eclipse.jetty.util.thread.strategy.EatWhatYouKill.produce(EatWhatYouKill.java:132)
at org.eclipse.jetty.io.ManagedSelector$$Lambda$64/385660182.run(Unknown Source)
at org.eclipse.jetty.util.thread.QueuedThreadPool.runJob(QueuedThreadPool.java:765)
at org.eclipse.jetty.util.thread.QueuedThreadPool$2.run(QueuedThreadPool.java:683)
at java.lang.Thread.run(Thread.java:748)
3) Thread[id=39740, name=Scheduler-318829532, state=TIMED_WAITING, group=TGRP-ShardSplitTest]
at sun.misc.Unsafe.park(Native Method)
at java.util.concurrent.locks.LockSupport.parkNanos(LockSupport.java:215)
at java.util.concurrent.locks.AbstractQueuedSynchronizer$ConditionObject.awaitNanos(AbstractQueuedSynchronizer.java:2078)
at java.util.concurrent.ScheduledThreadPoolExecutor$DelayedWorkQueue.take(ScheduledThreadPoolExecutor.java:1093)
at java.util.concurrent.ScheduledThreadPoolExecutor$DelayedWorkQueue.take(ScheduledThreadPoolExecutor.java:809)
at java.util.concurrent.ThreadPoolExecutor.getTask(ThreadPoolExecutor.java:1074)
at java.util.concurrent.ThreadPoolExecutor.runWorker(ThreadPoolExecutor.java:1134)
at java.util.concurrent.ThreadPoolExecutor$Worker.run(ThreadPoolExecutor.java:624)
at java.lang.Thread.run(Thread.java:748)
4) Thread[id=39861, name=Scheduler-1503552473, state=WAITING, group=TGRP-ShardSplitTest]
at sun.misc.Unsafe.park(Native Method)
at java.util.concurrent.locks.LockSupport.park(LockSupport.java:175)
at java.util.concurrent.locks.AbstractQueuedSynchronizer$ConditionObject.await(AbstractQueuedSynchronizer.java:2039)
at java.util.concurrent.ScheduledThreadPoolExecutor$DelayedWorkQueue.take(ScheduledThreadPoolExecutor.java:1081)
at java.util.concurrent.ScheduledThreadPoolExecutor$DelayedWorkQueue.take(ScheduledThreadPoolExecutor.java:809)
at java.util.concurrent.ThreadPoolExecutor.getTask(ThreadPoolExecutor.java:1074)
at java.util.concurrent.ThreadPoolExecutor.runWorker(ThreadPoolExecutor.java:1134)
at java.util.concurrent.ThreadPoolExecutor$Worker.run(ThreadPoolExecutor.java:624)
at java.lang.Thread.run(Thread.java:748)
at __randomizedtesting.SeedInfo.seed([76BA9AD6097A2124]:0)
Build Log:
[...truncated 14362 lines...]
[junit4] Suite: org.apache.solr.cloud.api.collections.ShardSplitTest
[junit4] 2> 1677712 INFO (SUITE-ShardSplitTest-seed#[76BA9AD6097A2124]-worker) [ ] o.a.s.SolrTestCaseJ4 SecureRandom sanity checks: test.solr.allowed.securerandom=null & java.security.egd=file:/dev/./urandom
[junit4] 2> Creating dataDir: /x1/jenkins/jenkins-slave/workspace/Lucene-Solr-NightlyTests-master/checkout/solr/build/solr-core/test/J0/temp/solr.cloud.api.collections.ShardSplitTest_76BA9AD6097A2124-001/init-core-data-001
[junit4] 2> 1677714 WARN (SUITE-ShardSplitTest-seed#[76BA9AD6097A2124]-worker) [ ] o.a.s.SolrTestCaseJ4 startTrackingSearchers: numOpens=10 numCloses=10
[junit4] 2> 1677714 INFO (SUITE-ShardSplitTest-seed#[76BA9AD6097A2124]-worker) [ ] o.a.s.SolrTestCaseJ4 Using PointFields (NUMERIC_POINTS_SYSPROP=true) w/NUMERIC_DOCVALUES_SYSPROP=false
[junit4] 2> 1677716 INFO (SUITE-ShardSplitTest-seed#[76BA9AD6097A2124]-worker) [ ] o.a.s.SolrTestCaseJ4 Randomized ssl (false) and clientAuth (false) via: @org.apache.solr.SolrTestCaseJ4$SuppressSSL(bugUrl=https://issues.apache.org/jira/browse/SOLR-5776)
[junit4] 2> 1677716 INFO (SUITE-ShardSplitTest-seed#[76BA9AD6097A2124]-worker) [ ] o.a.s.BaseDistributedSearchTestCase Setting hostContext system property: /p/
[junit4] 2> 1677733 INFO (TEST-ShardSplitTest.testSplitStaticIndexReplication-seed#[76BA9AD6097A2124]) [ ] o.a.s.c.ZkTestServer STARTING ZK TEST SERVER
[junit4] 2> 1677743 INFO (ZkTestServer Run Thread) [ ] o.a.s.c.ZkTestServer client port:0.0.0.0/0.0.0.0:0
[junit4] 2> 1677743 INFO (ZkTestServer Run Thread) [ ] o.a.s.c.ZkTestServer Starting server
[junit4] 2> 1677839 INFO (TEST-ShardSplitTest.testSplitStaticIndexReplication-seed#[76BA9AD6097A2124]) [ ] o.a.s.c.ZkTestServer start zk server on port:37560
[junit4] 2> 1677840 INFO (TEST-ShardSplitTest.testSplitStaticIndexReplication-seed#[76BA9AD6097A2124]) [ ] o.a.s.c.ZkTestServer parse host and port list: 127.0.0.1:37560
[junit4] 2> 1677840 INFO (TEST-ShardSplitTest.testSplitStaticIndexReplication-seed#[76BA9AD6097A2124]) [ ] o.a.s.c.ZkTestServer connecting to 127.0.0.1 37560
[junit4] 2> 1677879 INFO (zkConnectionManagerCallback-12668-thread-1) [ ] o.a.s.c.c.ConnectionManager zkClient has connected
[junit4] 2> 1677899 INFO (zkConnectionManagerCallback-12670-thread-1) [ ] o.a.s.c.c.ConnectionManager zkClient has connected
[junit4] 2> 1677900 INFO (TEST-ShardSplitTest.testSplitStaticIndexReplication-seed#[76BA9AD6097A2124]) [ ] o.a.s.c.ZkTestServer put /x1/jenkins/jenkins-slave/workspace/Lucene-Solr-NightlyTests-master/checkout/solr/core/src/test-files/solr/collection1/conf/solrconfig-tlog.xml to /configs/conf1/solrconfig.xml
[junit4] 2> 1677901 INFO (TEST-ShardSplitTest.testSplitStaticIndexReplication-seed#[76BA9AD6097A2124]) [ ] o.a.s.c.ZkTestServer put /x1/jenkins/jenkins-slave/workspace/Lucene-Solr-NightlyTests-master/checkout/solr/core/src/test-files/solr/collection1/conf/schema15.xml to /configs/conf1/schema.xml
[junit4] 2> 1677902 INFO (TEST-ShardSplitTest.testSplitStaticIndexReplication-seed#[76BA9AD6097A2124]) [ ] o.a.s.c.ZkTestServer put /x1/jenkins/jenkins-slave/workspace/Lucene-Solr-NightlyTests-master/checkout/solr/core/src/test-files/solr/collection1/conf/solrconfig.snippet.randomindexconfig.xml to /configs/conf1/solrconfig.snippet.randomindexconfig.xml
[junit4] 2> 1677904 INFO (TEST-ShardSplitTest.testSplitStaticIndexReplication-seed#[76BA9AD6097A2124]) [ ] o.a.s.c.ZkTestServer put /x1/jenkins/jenkins-slave/workspace/Lucene-Solr-NightlyTests-master/checkout/solr/core/src/test-files/solr/collection1/conf/stopwords.txt to /configs/conf1/stopwords.txt
[junit4] 2> 1677905 INFO (TEST-ShardSplitTest.testSplitStaticIndexReplication-seed#[76BA9AD6097A2124]) [ ] o.a.s.c.ZkTestServer put /x1/jenkins/jenkins-slave/workspace/Lucene-Solr-NightlyTests-master/checkout/solr/core/src/test-files/solr/collection1/conf/protwords.txt to /configs/conf1/protwords.txt
[junit4] 2> 1677906 INFO (TEST-ShardSplitTest.testSplitStaticIndexReplication-seed#[76BA9AD6097A2124]) [ ] o.a.s.c.ZkTestServer put /x1/jenkins/jenkins-slave/workspace/Lucene-Solr-NightlyTests-master/checkout/solr/core/src/test-files/solr/collection1/conf/currency.xml to /configs/conf1/currency.xml
[junit4] 2> 1677907 INFO (TEST-ShardSplitTest.testSplitStaticIndexReplication-seed#[76BA9AD6097A2124]) [ ] o.a.s.c.ZkTestServer put /x1/jenkins/jenkins-slave/workspace/Lucene-Solr-NightlyTests-master/checkout/solr/core/src/test-files/solr/collection1/conf/enumsConfig.xml to /configs/conf1/enumsConfig.xml
[junit4] 2> 1677908 INFO (TEST-ShardSplitTest.testSplitStaticIndexReplication-seed#[76BA9AD6097A2124]) [ ] o.a.s.c.ZkTestServer put /x1/jenkins/jenkins-slave/workspace/Lucene-Solr-NightlyTests-master/checkout/solr/core/src/test-files/solr/collection1/conf/open-exchange-rates.json to /configs/conf1/open-exchange-rates.json
[junit4] 2> 1677909 INFO (TEST-ShardSplitTest.testSplitStaticIndexReplication-seed#[76BA9AD6097A2124]) [ ] o.a.s.c.ZkTestServer put /x1/jenkins/jenkins-slave/workspace/Lucene-Solr-NightlyTests-master/checkout/solr/core/src/test-files/solr/collection1/conf/mapping-ISOLatin1Accent.txt to /configs/conf1/mapping-ISOLatin1Accent.txt
[junit4] 2> 1677910 INFO (TEST-ShardSplitTest.testSplitStaticIndexReplication-seed#[76BA9AD6097A2124]) [ ] o.a.s.c.ZkTestServer put /x1/jenkins/jenkins-slave/workspace/Lucene-Solr-NightlyTests-master/checkout/solr/core/src/test-files/solr/collection1/conf/old_synonyms.txt to /configs/conf1/old_synonyms.txt
[junit4] 2> 1677911 INFO (TEST-ShardSplitTest.testSplitStaticIndexReplication-seed#[76BA9AD6097A2124]) [ ] o.a.s.c.ZkTestServer put /x1/jenkins/jenkins-slave/workspace/Lucene-Solr-NightlyTests-master/checkout/solr/core/src/test-files/solr/collection1/conf/synonyms.txt to /configs/conf1/synonyms.txt
[junit4] 2> 1677912 INFO (TEST-ShardSplitTest.testSplitStaticIndexReplication-seed#[76BA9AD6097A2124]) [ ] o.a.s.c.AbstractFullDistribZkTestBase Will use NRT replicas unless explicitly asked otherwise
[junit4] 2> 1678107 WARN (TEST-ShardSplitTest.testSplitStaticIndexReplication-seed#[76BA9AD6097A2124]) [ ] o.e.j.s.AbstractConnector Ignoring deprecated socket close linger time
[junit4] 2> 1678107 INFO (TEST-ShardSplitTest.testSplitStaticIndexReplication-seed#[76BA9AD6097A2124]) [ ] o.a.s.c.s.e.JettySolrRunner Start Jetty (original configured port=0)
[junit4] 2> 1678107 INFO (TEST-ShardSplitTest.testSplitStaticIndexReplication-seed#[76BA9AD6097A2124]) [ ] o.a.s.c.s.e.JettySolrRunner Trying to start Jetty on port 0 try number 1 ...
[junit4] 2> 1678107 INFO (TEST-ShardSplitTest.testSplitStaticIndexReplication-seed#[76BA9AD6097A2124]) [ ] o.e.j.s.Server jetty-9.4.14.v20181114; built: 2018-11-14T21:20:31.478Z; git: c4550056e785fb5665914545889f21dc136ad9e6; jvm 1.8.0_191-b12
[junit4] 2> 1678108 INFO (TEST-ShardSplitTest.testSplitStaticIndexReplication-seed#[76BA9AD6097A2124]) [ ] o.e.j.s.session DefaultSessionIdManager workerName=node0
[junit4] 2> 1678108 INFO (TEST-ShardSplitTest.testSplitStaticIndexReplication-seed#[76BA9AD6097A2124]) [ ] o.e.j.s.session No SessionScavenger set, using defaults
[junit4] 2> 1678109 INFO (TEST-ShardSplitTest.testSplitStaticIndexReplication-seed#[76BA9AD6097A2124]) [ ] o.e.j.s.session node0 Scavenging every 660000ms
[junit4] 2> 1678111 INFO (TEST-ShardSplitTest.testSplitStaticIndexReplication-seed#[76BA9AD6097A2124]) [ ] o.e.j.s.h.ContextHandler Started o.e.j.s.ServletContextHandler@7ffc6974{/p,null,AVAILABLE}
[junit4] 2> 1678112 INFO (TEST-ShardSplitTest.testSplitStaticIndexReplication-seed#[76BA9AD6097A2124]) [ ] o.e.j.s.AbstractConnector Started ServerConnector@3946e2a9{HTTP/1.1,[http/1.1, h2c]}{127.0.0.1:35175}
[junit4] 2> 1678112 INFO (TEST-ShardSplitTest.testSplitStaticIndexReplication-seed#[76BA9AD6097A2124]) [ ] o.e.j.s.Server Started @1678168ms
[junit4] 2> 1678112 INFO (TEST-ShardSplitTest.testSplitStaticIndexReplication-seed#[76BA9AD6097A2124]) [ ] o.a.s.c.s.e.JettySolrRunner Jetty properties: {solr.data.dir=/x1/jenkins/jenkins-slave/workspace/Lucene-Solr-NightlyTests-master/checkout/solr/build/solr-core/test/J0/temp/solr.cloud.api.collections.ShardSplitTest_76BA9AD6097A2124-001/tempDir-001/control/data, hostContext=/p, hostPort=35175, coreRootDirectory=/x1/jenkins/jenkins-slave/workspace/Lucene-Solr-NightlyTests-master/checkout/solr/build/solr-core/test/J0/../../../../../../../../../../../x1/jenkins/jenkins-slave/workspace/Lucene-Solr-NightlyTests-master/checkout/solr/build/solr-core/test/J0/temp/solr.cloud.api.collections.ShardSplitTest_76BA9AD6097A2124-001/control-001/cores}
[junit4] 2> 1678113 ERROR (TEST-ShardSplitTest.testSplitStaticIndexReplication-seed#[76BA9AD6097A2124]) [ ] o.a.s.u.StartupLoggingUtils Missing Java Option solr.log.dir. Logging may be missing or incomplete.
[junit4] 2> 1678113 INFO (TEST-ShardSplitTest.testSplitStaticIndexReplication-seed#[76BA9AD6097A2124]) [ ] o.a.s.s.SolrDispatchFilter Using logger factory org.apache.logging.slf4j.Log4jLoggerFactory
[junit4] 2> 1678113 INFO (TEST-ShardSplitTest.testSplitStaticIndexReplication-seed#[76BA9AD6097A2124]) [ ] o.a.s.s.SolrDispatchFilter ___ _ Welcome to Apache Solr? version 9.0.0
[junit4] 2> 1678113 INFO (TEST-ShardSplitTest.testSplitStaticIndexReplication-seed#[76BA9AD6097A2124]) [ ] o.a.s.s.SolrDispatchFilter / __| ___| |_ _ Starting in cloud mode on port null
[junit4] 2> 1678113 INFO (TEST-ShardSplitTest.testSplitStaticIndexReplication-seed#[76BA9AD6097A2124]) [ ] o.a.s.s.SolrDispatchFilter \__ \/ _ \ | '_| Install dir: null
[junit4] 2> 1678113 INFO (TEST-ShardSplitTest.testSplitStaticIndexReplication-seed#[76BA9AD6097A2124]) [ ] o.a.s.s.SolrDispatchFilter |___/\___/_|_| Start time: 2019-03-16T13:18:34.784Z
[junit4] 2> 1678115 INFO (zkConnectionManagerCallback-12672-thread-1) [ ] o.a.s.c.c.ConnectionManager zkClient has connected
[junit4] 2> 1678117 INFO (TEST-ShardSplitTest.testSplitStaticIndexReplication-seed#[76BA9AD6097A2124]) [ ] o.a.s.s.SolrDispatchFilter Loading solr.xml from SolrHome (not found in ZooKeeper)
[junit4] 2> 1678117 INFO (TEST-ShardSplitTest.testSplitStaticIndexReplication-seed#[76BA9AD6097A2124]) [ ] o.a.s.c.SolrXmlConfig Loading container configuration from /x1/jenkins/jenkins-slave/workspace/Lucene-Solr-NightlyTests-master/checkout/solr/build/solr-core/test/J0/temp/solr.cloud.api.collections.ShardSplitTest_76BA9AD6097A2124-001/control-001/solr.xml
[junit4] 2> 1678122 INFO (TEST-ShardSplitTest.testSplitStaticIndexReplication-seed#[76BA9AD6097A2124]) [ ] o.a.s.c.SolrXmlConfig Configuration parameter autoReplicaFailoverWorkLoopDelay is ignored
[junit4] 2> 1678122 INFO (TEST-ShardSplitTest.testSplitStaticIndexReplication-seed#[76BA9AD6097A2124]) [ ] o.a.s.c.SolrXmlConfig Configuration parameter autoReplicaFailoverBadNodeExpiration is ignored
[junit4] 2> 1678124 INFO (TEST-ShardSplitTest.testSplitStaticIndexReplication-seed#[76BA9AD6097A2124]) [ ] o.a.s.c.SolrXmlConfig MBean server found: com.sun.jmx.mbeanserver.JmxMBeanServer@5371d555, but no JMX reporters were configured - adding default JMX reporter.
[junit4] 2> 1678207 INFO (TEST-ShardSplitTest.testSplitStaticIndexReplication-seed#[76BA9AD6097A2124]) [ ] o.a.s.h.c.HttpShardHandlerFactory Host whitelist initialized: WhitelistHostChecker [whitelistHosts=null, whitelistHostCheckingEnabled=false]
[junit4] 2> 1678209 WARN (TEST-ShardSplitTest.testSplitStaticIndexReplication-seed#[76BA9AD6097A2124]) [ ] o.e.j.u.s.S.config No Client EndPointIdentificationAlgorithm configured for SslContextFactory@29927b62[provider=null,keyStore=null,trustStore=null]
[junit4] 2> 1678217 WARN (TEST-ShardSplitTest.testSplitStaticIndexReplication-seed#[76BA9AD6097A2124]) [ ] o.e.j.u.s.S.config No Client EndPointIdentificationAlgorithm configured for SslContextFactory@403b9bb9[provider=null,keyStore=null,trustStore=null]
[junit4] 2> 1678218 INFO (TEST-ShardSplitTest.testSplitStaticIndexReplication-seed#[76BA9AD6097A2124]) [ ] o.a.s.c.ZkContainer Zookeeper client=127.0.0.1:37560/solr
[junit4] 2> 1678220 INFO (zkConnectionManagerCallback-12679-thread-1) [ ] o.a.s.c.c.ConnectionManager zkClient has connected
[junit4] 2> 1678222 INFO (zkConnectionManagerCallback-12681-thread-1) [ ] o.a.s.c.c.ConnectionManager zkClient has connected
[junit4] 2> 1678323 INFO (TEST-ShardSplitTest.testSplitStaticIndexReplication-seed#[76BA9AD6097A2124]) [n:127.0.0.1:35175_p ] o.a.s.c.OverseerElectionContext I am going to be the leader 127.0.0.1:35175_p
[junit4] 2> 1678323 INFO (TEST-ShardSplitTest.testSplitStaticIndexReplication-seed#[76BA9AD6097A2124]) [n:127.0.0.1:35175_p ] o.a.s.c.Overseer Overseer (id=72967041724186628-127.0.0.1:35175_p-n_0000000000) starting
[junit4] 2> 1678335 INFO (zkConnectionManagerCallback-12688-thread-1) [ ] o.a.s.c.c.ConnectionManager zkClient has connected
[junit4] 2> 1678341 INFO (TEST-ShardSplitTest.testSplitStaticIndexReplication-seed#[76BA9AD6097A2124]) [n:127.0.0.1:35175_p ] o.a.s.c.s.i.ZkClientClusterStateProvider Cluster at 127.0.0.1:37560/solr ready
[junit4] 2> 1678342 INFO (OverseerStateUpdate-72967041724186628-127.0.0.1:35175_p-n_0000000000) [n:127.0.0.1:35175_p ] o.a.s.c.Overseer Starting to work on the main queue : 127.0.0.1:35175_p
[junit4] 2> 1678342 DEBUG (OverseerCollectionConfigSetProcessor-72967041724186628-127.0.0.1:35175_p-n_0000000000) [n:127.0.0.1:35175_p ] o.a.s.c.OverseerTaskProcessor Process current queue of overseer operations
[junit4] 2> 1678343 INFO (TEST-ShardSplitTest.testSplitStaticIndexReplication-seed#[76BA9AD6097A2124]) [n:127.0.0.1:35175_p ] o.a.s.c.ZkController Register node as live in ZooKeeper:/live_nodes/127.0.0.1:35175_p
[junit4] 2> 1678344 DEBUG (OverseerCollectionConfigSetProcessor-72967041724186628-127.0.0.1:35175_p-n_0000000000) [n:127.0.0.1:35175_p ] o.a.s.c.OverseerTaskProcessor Cleaning up work-queue. #Running tasks: 0 #Completed tasks: 0
[junit4] 2> 1678344 DEBUG (OverseerCollectionConfigSetProcessor-72967041724186628-127.0.0.1:35175_p-n_0000000000) [n:127.0.0.1:35175_p ] o.a.s.c.OverseerTaskProcessor RunningTasks: []
[junit4] 2> 1678344 DEBUG (OverseerCollectionConfigSetProcessor-72967041724186628-127.0.0.1:35175_p-n_0000000000) [n:127.0.0.1:35175_p ] o.a.s.c.OverseerTaskProcessor BlockedTasks: []
[junit4] 2> 1678344 DEBUG (OverseerCollectionConfigSetProcessor-72967041724186628-127.0.0.1:35175_p-n_0000000000) [n:127.0.0.1:35175_p ] o.a.s.c.OverseerTaskProcessor CompletedTasks: []
[junit4] 2> 1678344 INFO (OverseerCollectionConfigSetProcessor-72967041724186628-127.0.0.1:35175_p-n_0000000000) [n:127.0.0.1:35175_p ] o.a.s.c.OverseerTaskProcessor RunningZKTasks: []
[junit4] 2> 1678345 INFO (zkCallback-12687-thread-1) [ ] o.a.s.c.c.ZkStateReader Updated live nodes from ZooKeeper... (0) -> (1)
[junit4] 2> 1678367 INFO (zkCallback-12680-thread-1) [ ] o.a.s.c.c.ZkStateReader Updated live nodes from ZooKeeper... (0) -> (1)
[junit4] 2> 1678383 INFO (TEST-ShardSplitTest.testSplitStaticIndexReplication-seed#[76BA9AD6097A2124]) [n:127.0.0.1:35175_p ] o.a.s.h.a.MetricsHistoryHandler No .system collection, keeping metrics history in memory.
[junit4] 2> 1678412 INFO (TEST-ShardSplitTest.testSplitStaticIndexReplication-seed#[76BA9AD6097A2124]) [n:127.0.0.1:35175_p ] o.a.s.m.r.SolrJmxReporter JMX monitoring for 'solr.node' (registry 'solr.node') enabled at server: com.sun.jmx.mbeanserver.JmxMBeanServer@5371d555
[junit4] 2> 1678427 INFO (TEST-ShardSplitTest.testSplitStaticIndexReplication-seed#[76BA9AD6097A2124]) [n:127.0.0.1:35175_p ] o.a.s.m.r.SolrJmxReporter JMX monitoring for 'solr.jvm' (registry 'solr.jvm') enabled at server: com.sun.jmx.mbeanserver.JmxMBeanServer@5371d555
[junit4] 2> 1678427 INFO (TEST-ShardSplitTest.testSplitStaticIndexReplication-seed#[76BA9AD6097A2124]) [n:127.0.0.1:35175_p ] o.a.s.m.r.SolrJmxReporter JMX monitoring for 'solr.jetty' (registry 'solr.jetty') enabled at server: com.sun.jmx.mbeanserver.JmxMBeanServer@5371d555
[junit4] 2> 1678429 INFO (TEST-ShardSplitTest.testSplitStaticIndexReplication-seed#[76BA9AD6097A2124]) [n:127.0.0.1:35175_p ] o.a.s.c.CorePropertiesLocator Found 0 core definitions underneath /x1/jenkins/jenkins-slave/workspace/Lucene-Solr-NightlyTests-master/checkout/solr/build/solr-core/test/J0/../../../../../../../../../../../x1/jenkins/jenkins-slave/workspace/Lucene-Solr-NightlyTests-master/checkout/solr/build/solr-core/test/J0/temp/solr.cloud.api.collections.ShardSplitTest_76BA9AD6097A2124-001/control-001/cores
[junit4] 2> 1678503 INFO (zkConnectionManagerCallback-12694-thread-1) [ ] o.a.s.c.c.ConnectionManager zkClient has connected
[junit4] 2> 1678505 INFO (TEST-ShardSplitTest.testSplitStaticIndexReplication-seed#[76BA9AD6097A2124]) [ ] o.a.s.c.c.ZkStateReader Updated live nodes from ZooKeeper... (0) -> (1)
[junit4] 2> 1678506 INFO (TEST-ShardSplitTest.testSplitStaticIndexReplication-seed#[76BA9AD6097A2124]) [ ] o.a.s.c.s.i.ZkClientClusterStateProvider Cluster at 127.0.0.1:37560/solr ready
[junit4] 2> 1678520 INFO (qtp1067319480-36008) [n:127.0.0.1:35175_p ] o.a.s.h.a.CollectionsHandler Invoked Collection Action :create with params collection.configName=conf1&name=control_collection&nrtReplicas=1&action=CREATE&numShards=1&createNodeSet=127.0.0.1:35175_p&wt=javabin&version=2 and sendToOCPQueue=true
[junit4] 2> 1678523 DEBUG (OverseerCollectionConfigSetProcessor-72967041724186628-127.0.0.1:35175_p-n_0000000000) [n:127.0.0.1:35175_p ] o.a.s.c.OverseerTaskProcessor Got 1 tasks from work-queue : [[org.apache.solr.cloud.OverseerTaskQueue$QueueEvent@2e684ecf]]
[junit4] 2> 1678523 DEBUG (OverseerCollectionConfigSetProcessor-72967041724186628-127.0.0.1:35175_p-n_0000000000) [n:127.0.0.1:35175_p ] o.a.s.c.OverseerTaskProcessor Marked task [/overseer/collection-queue-work/qn-0000000000] as running
[junit4] 2> 1678523 DEBUG (OverseerCollectionConfigSetProcessor-72967041724186628-127.0.0.1:35175_p-n_0000000000) [n:127.0.0.1:35175_p ] o.a.s.c.OverseerTaskProcessor Overseer Collection Message Handler: Get the message id:/overseer/collection-queue-work/qn-0000000000 message:{
[junit4] 2> "name":"control_collection",
[junit4] 2> "fromApi":"true",
[junit4] 2> "collection.configName":"conf1",
[junit4] 2> "numShards":"1",
[junit4] 2> "createNodeSet":"127.0.0.1:35175_p",
[junit4] 2> "nrtReplicas":"1",
[junit4] 2> "stateFormat":"2",
[junit4] 2> "replicationFactor":"1",
[junit4] 2> "operation":"create"}
[junit4] 2> 1678535 DEBUG (OverseerCollectionConfigSetProcessor-72967041724186628-127.0.0.1:35175_p-n_0000000000) [n:127.0.0.1:35175_p ] o.a.s.c.OverseerTaskProcessor Cleaning up work-queue. #Running tasks: 1 #Completed tasks: 0
[junit4] 2> 1678536 DEBUG (OverseerCollectionConfigSetProcessor-72967041724186628-127.0.0.1:35175_p-n_0000000000) [n:127.0.0.1:35175_p ] o.a.s.c.OverseerTaskProcessor RunningTasks: [/overseer/collection-queue-work/qn-0000000000]
[junit4] 2> 1678536 DEBUG (OverseerCollectionConfigSetProcessor-72967041724186628-127.0.0.1:35175_p-n_0000000000) [n:127.0.0.1:35175_p ] o.a.s.c.OverseerTaskProcessor BlockedTasks: []
[junit4] 2> 1678536 DEBUG (OverseerCollectionConfigSetProcessor-72967041724186628-127.0.0.1:35175_p-n_0000000000) [n:127.0.0.1:35175_p ] o.a.s.c.OverseerTaskProcessor CompletedTasks: []
[junit4] 2> 1678536 INFO (OverseerCollectionConfigSetProcessor-72967041724186628-127.0.0.1:35175_p-n_0000000000) [n:127.0.0.1:35175_p ] o.a.s.c.OverseerTaskProcessor RunningZKTasks: [/overseer/collection-queue-work/qn-0000000000]
[junit4] 2> 1678536 DEBUG (OverseerThreadFactory-6069-thread-1-processing-n:127.0.0.1:35175_p) [n:127.0.0.1:35175_p ] o.a.s.c.OverseerTaskProcessor Runner processing /overseer/collection-queue-work/qn-0000000000
[junit4] 2> 1678536 DEBUG (OverseerThreadFactory-6069-thread-1-processing-n:127.0.0.1:35175_p) [n:127.0.0.1:35175_p ] o.a.s.c.a.c.OverseerCollectionMessageHandler OverseerCollectionMessageHandler.processMessage : create , {
[junit4] 2> "name":"control_collection",
[junit4] 2> "fromApi":"true",
[junit4] 2> "collection.configName":"conf1",
[junit4] 2> "numShards":"1",
[junit4] 2> "createNodeSet":"127.0.0.1:35175_p",
[junit4] 2> "nrtReplicas":"1",
[junit4] 2> "stateFormat":"2",
[junit4] 2> "replicationFactor":"1",
[junit4] 2> "operation":"create"}
[junit4] 2> 1678536 INFO (OverseerThreadFactory-6069-thread-1-processing-n:127.0.0.1:35175_p) [n:127.0.0.1:35175_p ] o.a.s.c.a.c.CreateCollectionCmd Create collection control_collection
[junit4] 2> 1678537 DEBUG (OverseerThreadFactory-6069-thread-1-processing-n:127.0.0.1:35175_p) [n:127.0.0.1:35175_p ] o.a.s.c.a.c.OverseerCollectionMessageHandler creating collections conf node /collections/control_collection
[junit4] 2> 1678538 DEBUG (OverseerThreadFactory-6069-thread-1-processing-n:127.0.0.1:35175_p) [n:127.0.0.1:35175_p ] o.a.s.c.a.c.CreateCollectionCmd Check for collection zkNode:control_collection
[junit4] 2> 1678538 DEBUG (OverseerThreadFactory-6069-thread-1-processing-n:127.0.0.1:35175_p) [n:127.0.0.1:35175_p ] o.a.s.c.a.c.CreateCollectionCmd Collection zkNode exists
[junit4] 2> 1678546 DEBUG (OverseerStateUpdate-72967041724186628-127.0.0.1:35175_p-n_0000000000) [n:127.0.0.1:35175_p ] o.a.s.c.Overseer processMessage: queueSize: 1, message = {
[junit4] 2> "name":"control_collection",
[junit4] 2> "fromApi":"true",
[junit4] 2> "collection.configName":"conf1",
[junit4] 2> "numShards":"1",
[junit4] 2> "createNodeSet":"127.0.0.1:35175_p",
[junit4] 2> "nrtReplicas":"1",
[junit4] 2> "stateFormat":"2",
[junit4] 2> "replicationFactor":"1",
[junit4] 2> "operation":"create"} current state version: 0
[junit4] 2> 1678546 DEBUG (OverseerStateUpdate-72967041724186628-127.0.0.1:35175_p-n_0000000000) [n:127.0.0.1:35175_p ] o.a.s.c.o.ClusterStateMutator building a new cName: control_collection
[junit4] 2> 1678547 DEBUG (OverseerStateUpdate-72967041724186628-127.0.0.1:35175_p-n_0000000000) [n:127.0.0.1:35175_p ] o.a.s.c.o.ZkStateWriter going to create_collection /collections/control_collection/state.json
[junit4] 2> 1678647 DEBUG (OverseerThreadFactory-6069-thread-1-processing-n:127.0.0.1:35175_p) [n:127.0.0.1:35175_p ] o.a.s.c.a.c.CreateCollectionCmd Creating SolrCores for new collection control_collection, shardNames [shard1] , message : {
[junit4] 2> "name":"control_collection",
[junit4] 2> "fromApi":"true",
[junit4] 2> "collection.configName":"conf1",
[junit4] 2> "numShards":"1",
[junit4] 2> "createNodeSet":"127.0.0.1:35175_p",
[junit4] 2> "nrtReplicas":"1",
[junit4] 2> "stateFormat":"2",
[junit4] 2> "replicationFactor":"1",
[junit4] 2> "operation":"create"}
[junit4] 2> 1678648 DEBUG (OverseerThreadFactory-6069-thread-1-processing-n:127.0.0.1:35175_p) [n:127.0.0.1:35175_p ] o.a.s.c.a.c.CreateCollectionCmd Creating core control_collection_shard1_replica_n1 as part of shard shard1 of collection control_collection on 127.0.0.1:35175_p
[junit4] 2> 1678661 INFO (qtp1067319480-36010) [n:127.0.0.1:35175_p x:control_collection_shard1_replica_n1] o.a.s.h.a.CoreAdminOperation core create command qt=/admin/cores&collection.configName=conf1&newCollection=true&name=control_collection_shard1_replica_n1&action=CREATE&numShards=1&collection=control_collection&shard=shard1&wt=javabin&version=2&replicaType=NRT
[junit4] 2> 1678661 INFO (qtp1067319480-36010) [n:127.0.0.1:35175_p x:control_collection_shard1_replica_n1] o.a.s.c.TransientSolrCoreCacheDefault Allocating transient cache for 4 transient cores
[junit4] 2> 1678664 DEBUG (OverseerStateUpdate-72967041724186628-127.0.0.1:35175_p-n_0000000000) [n:127.0.0.1:35175_p ] o.a.s.c.Overseer processMessage: queueSize: 1, message = {
[junit4] 2> "core":"control_collection_shard1_replica_n1",
[junit4] 2> "roles":null,
[junit4] 2> "base_url":"http://127.0.0.1:35175/p",
[junit4] 2> "node_name":"127.0.0.1:35175_p",
[junit4] 2> "numShards":"1",
[junit4] 2> "state":"down",
[junit4] 2> "shard":"shard1",
[junit4] 2> "collection":"control_collection",
[junit4] 2> "type":"NRT",
[junit4] 2> "operation":"state"} current state version: 0
[junit4] 2> 1678664 DEBUG (OverseerStateUpdate-72967041724186628-127.0.0.1:35175_p-n_0000000000) [n:127.0.0.1:35175_p ] o.a.s.c.o.ReplicaMutator Update state numShards=1 message={
[junit4] 2> "core":"control_collection_shard1_replica_n1",
[junit4] 2> "roles":null,
[junit4] 2> "base_url":"http://127.0.0.1:35175/p",
[junit4] 2> "node_name":"127.0.0.1:35175_p",
[junit4] 2> "numShards":"1",
[junit4] 2> "state":"down",
[junit4] 2> "shard":"shard1",
[junit4] 2> "collection":"control_collection",
[junit4] 2> "type":"NRT",
[junit4] 2> "operation":"state"}
[junit4] 2> 1678665 DEBUG (OverseerStateUpdate-72967041724186628-127.0.0.1:35175_p-n_0000000000) [n:127.0.0.1:35175_p ] o.a.s.c.o.ReplicaMutator Will update state for replica: core_node2:{"core":"control_collection_shard1_replica_n1","base_url":"http://127.0.0.1:35175/p","node_name":"127.0.0.1:35175_p","state":"down","type":"NRT"}
[junit4] 2> 1678665 DEBUG (OverseerStateUpdate-72967041724186628-127.0.0.1:35175_p-n_0000000000) [n:127.0.0.1:35175_p ] o.a.s.c.o.ReplicaMutator Collection is now: DocCollection(control_collection//collections/control_collection/state.json/0)={
[junit4] 2> "pullReplicas":"0",
[junit4] 2> "replicationFactor":"1",
[junit4] 2> "router":{"name":"compositeId"},
[junit4] 2> "maxShardsPerNode":"1",
[junit4] 2> "autoAddReplicas":"false",
[junit4] 2> "nrtReplicas":"1",
[junit4] 2> "tlogReplicas":"0",
[junit4] 2> "shards":{"shard1":{
[junit4] 2> "range":"80000000-7fffffff",
[junit4] 2> "state":"active",
[junit4] 2> "replicas":{"core_node2":{
[junit4] 2> "core":"control_collection_shard1_replica_n1",
[junit4] 2> "base_url":"http://127.0.0.1:35175/p",
[junit4] 2> "node_name":"127.0.0.1:35175_p",
[junit4] 2> "state":"down",
[junit4] 2> "type":"NRT"}}}}}
[junit4] 2> 1678765 DEBUG (OverseerStateUpdate-72967041724186628-127.0.0.1:35175_p-n_0000000000) [n:127.0.0.1:35175_p ] o.a.s.c.o.ZkStateWriter going to update_collection /collections/control_collection/state.json version: 0
[junit4] 2> 1679687 INFO (qtp1067319480-36010) [n:127.0.0.1:35175_p c:control_collection s:shard1 x:control_collection_shard1_replica_n1] o.a.s.c.SolrConfig Using Lucene MatchVersion: 9.0.0
[junit4] 2> 1679702 INFO (qtp1067319480-36010) [n:127.0.0.1:35175_p c:control_collection s:shard1 x:control_collection_shard1_replica_n1] o.a.s.s.IndexSchema [control_collection_shard1_replica_n1] Schema name=test
[junit4] 2> 1679799 INFO (qtp1067319480-36010) [n:127.0.0.1:35175_p c:control_collection s:shard1 x:control_collection_shard1_replica_n1] o.a.s.s.IndexSchema Loaded schema test/1.6 with uniqueid field id
[junit4] 2> 1679820 INFO (qtp1067319480-36010) [n:127.0.0.1:35175_p c:control_collection s:shard1 x:control_collection_shard1_replica_n1] o.a.s.c.CoreContainer Creating SolrCore 'control_collection_shard1_replica_n1' using configuration from collection control_collection, trusted=true
[junit4] 2> 1679821 INFO (qtp1067319480-36010) [n:127.0.0.1:35175_p c:control_collection s:shard1 x:control_collection_shard1_replica_n1] o.a.s.m.r.SolrJmxReporter JMX monitoring for 'solr.core.control_collection.shard1.replica_n1' (registry 'solr.core.control_collection.shard1.replica_n1') enabled at server: com.sun.jmx.mbeanserver.JmxMBeanServer@5371d555
[junit4] 2> 1679821 INFO (qtp1067319480-36010) [n:127.0.0.1:35175_p c:control_collection s:shard1 x:control_collection_shard1_replica_n1] o.a.s.c.SolrCore [[control_collection_shard1_replica_n1] ] Opening new SolrCore at [/x1/jenkins/jenkins-slave/workspace/Lucene-Solr-NightlyTests-master/checkout/solr/build/solr-core/test/J0/temp/solr.cloud.api.collections.ShardSplitTest_76BA9AD6097A2124-001/control-001/cores/control_collection_shard1_replica_n1], dataDir=[/x1/jenkins/jenkins-slave/workspace/Lucene-Solr-NightlyTests-master/checkout/solr/build/solr-core/test/J0/../../../../../../../../../../../x1/jenkins/jenkins-slave/workspace/Lucene-Solr-NightlyTests-master/checkout/solr/build/solr-core/test/J0/temp/solr.cloud.api.collections.ShardSplitTest_76BA9AD6097A2124-001/control-001/cores/control_collection_shard1_replica_n1/data/]
[junit4] 2> 1679825 INFO (qtp1067319480-36010) [n:127.0.0.1:35175_p c:control_collection s:shard1 x:control_collection_shard1_replica_n1] o.a.s.u.RandomMergePolicy RandomMergePolicy wrapping class org.apache.lucene.index.TieredMergePolicy: [TieredMergePolicy: maxMergeAtOnce=22, maxMergeAtOnceExplicit=38, maxMergedSegmentMB=1.822265625, floorSegmentMB=0.935546875, forceMergeDeletesPctAllowed=1.5726334568404021, segmentsPerTier=23.0, maxCFSSegmentSizeMB=8.796093022207999E12, noCFSRatio=0.0, deletesPctAllowed=35.4669628015785
[junit4] 2> 1679837 WARN (qtp1067319480-36010) [n:127.0.0.1:35175_p c:control_collection s:shard1 x:control_collection_shard1_replica_n1] o.a.s.c.RequestHandlers INVALID paramSet a in requestHandler {type = requestHandler,name = /dump,class = DumpRequestHandler,attributes = {initParams=a, name=/dump, class=DumpRequestHandler},args = {defaults={a=A,b=B}}}
[junit4] 2> 1679909 INFO (qtp1067319480-36010) [n:127.0.0.1:35175_p c:control_collection s:shard1 x:control_collection_shard1_replica_n1] o.a.s.u.UpdateHandler Using UpdateLog implementation: org.apache.solr.update.UpdateLog
[junit4] 2> 1679909 INFO (qtp1067319480-36010) [n:127.0.0.1:35175_p c:control_collection s:shard1 x:control_collection_shard1_replica_n1] o.a.s.u.UpdateLog Initializing UpdateLog: dataDir= defaultSyncLevel=FLUSH numRecordsToKeep=100 maxNumLogsToKeep=10 numVersionBuckets=65536
[junit4] 2> 1679911 INFO (qtp1067319480-36010) [n:127.0.0.1:35175_p c:control_collection s:shard1 x:control_collection_shard1_replica_n1] o.a.s.u.CommitTracker Hard AutoCommit: disabled
[junit4] 2> 1679911 INFO (qtp1067319480-36010) [n:127.0.0.1:35175_p c:control_collection s:shard1 x:control_collection_shard1_replica_n1] o.a.s.u.CommitTracker Soft AutoCommit: disabled
[junit4] 2> 1679913 INFO (qtp1067319480-36010) [n:127.0.0.1:35175_p c:control_collection s:shard1 x:control_collection_shard1_replica_n1] o.a.s.u.RandomMergePolicy RandomMergePolicy wrapping class org.apache.lucene.index.TieredMergePolicy: [TieredMergePolicy: maxMergeAtOnce=31, maxMergeAtOnceExplicit=46, maxMergedSegmentMB=61.7099609375, floorSegmentMB=0.943359375, forceMergeDeletesPctAllowed=3.97790272830823, segmentsPerTier=47.0, maxCFSSegmentSizeMB=8.796093022207999E12, noCFSRatio=0.8061812331774522, deletesPctAllowed=49.96009410457246
[junit4] 2> 1679914 INFO (qtp1067319480-36010) [n:127.0.0.1:35175_p c:control_collection s:shard1 x:control_collection_shard1_replica_n1] o.a.s.s.SolrIndexSearcher Opening [Searcher@65ecc66d[control_collection_shard1_replica_n1] main]
[junit4] 2> 1679915 INFO (qtp1067319480-36010) [n:127.0.0.1:35175_p c:control_collection s:shard1 x:control_collection_shard1_replica_n1] o.a.s.r.ManagedResourceStorage Configured ZooKeeperStorageIO with znodeBase: /configs/conf1
[junit4] 2> 1679915 INFO (qtp1067319480-36010) [n:127.0.0.1:35175_p c:control_collection s:shard1 x:control_collection_shard1_replica_n1] o.a.s.r.ManagedResourceStorage Loaded null at path _rest_managed.json using ZooKeeperStorageIO:path=/configs/conf1
[junit4] 2> 1679916 INFO (qtp1067319480-36010) [n:127.0.0.1:35175_p c:control_collection s:shard1 x:control_collection_shard1_replica_n1] o.a.s.h.ReplicationHandler Commits will be reserved for 10000ms.
[junit4] 2> 1679916 INFO (qtp1067319480-36010) [n:127.0.0.1:35175_p c:control_collection s:shard1 x:control_collection_shard1_replica_n1] o.a.s.u.UpdateLog Could not find max version in index or recent updates, using new clock 1628168327357530112
[junit4] 2> 1679920 INFO (searcherExecutor-6074-thread-1-processing-n:127.0.0.1:35175_p x:control_collection_shard1_replica_n1 c:control_collection s:shard1) [n:127.0.0.1:35175_p c:control_collection s:shard1 x:control_collection_shard1_replica_n1] o.a.s.c.SolrCore [control_collection_shard1_replica_n1] Registered new searcher Searcher@65ecc66d[control_collection_shard1_replica_n1] main{ExitableDirectoryReader(UninvertingDirectoryReader())}
[junit4] 2> 1679923 INFO (qtp1067319480-36010) [n:127.0.0.1:35175_p c:control_collection s:shard1 x:control_collection_shard1_replica_n1] o.a.s.c.ZkShardTerms Successful update of terms at /collections/control_collection/terms/shard1 to Terms{values={core_node2=0}, version=0}
[junit4] 2> 1679923 INFO (qtp1067319480-36010) [n:127.0.0.1:35175_p c:control_collection s:shard1 x:control_collection_shard1_replica_n1] o.a.s.c.ShardLeaderElectionContextBase make sure parent is created /collections/control_collection/leaders/shard1
[junit4] 2> 1679926 INFO (qtp1067319480-36010) [n:127.0.0.1:35175_p c:control_collection s:shard1 x:control_collection_shard1_replica_n1] o.a.s.c.ShardLeaderElectionContext Enough replicas found to continue.
[junit4] 2> 1679926 INFO (qtp1067319480-36010) [n:127.0.0.1:35175_p c:control_collection s:shard1 x:control_collection_shard1_replica_n1] o.a.s.c.ShardLeaderElectionContext I may be the new leader - try and sync
[junit4] 2> 1679926 INFO (qtp1067319480-36010) [n:127.0.0.1:35175_p c:control_collection s:shard1 x:control_collection_shard1_replica_n1] o.a.s.c.SyncStrategy Sync replicas to http://127.0.0.1:35175/p/control_collection_shard1_replica_n1/
[junit4] 2> 1679927 INFO (qtp1067319480-36010) [n:127.0.0.1:35175_p c:control_collection s:shard1 x:control_collection_shard1_replica_n1] o.a.s.c.SyncStrategy Sync Success - now sync replicas to me
[junit4] 2> 1679927 INFO (qtp1067319480-36010) [n:127.0.0.1:35175_p c:control_collection s:shard1 x:control_collection_shard1_replica_n1] o.a.s.c.SyncStrategy http://127.0.0.1:35175/p/control_collection_shard1_replica_n1/ has no replicas
[junit4] 2> 1679927 INFO (qtp1067319480-36010) [n:127.0.0.1:35175_p c:control_collection s:shard1 x:control_collection_shard1_replica_n1] o.a.s.c.ShardLeaderElectionContextBase Creating leader registration node /collections/control_collection/leaders/shard1/leader after winning as /collections/control_collection/leader_elect/shard1/election/72967041724186628-core_node2-n_0000000000
[junit4] 2> 1679929 INFO (qtp1067319480-36010) [n:127.0.0.1:35175_p c:control_collection s:shard1 x:control_collection_shard1_replica_n1] o.a.s.c.ShardLeaderElectionContext I am the new leader: http://127.0.0.1:35175/p/control_collection_shard1_replica_n1/ shard1
[junit4] 2> 1679930 DEBUG (OverseerStateUpdate-72967041724186628-127.0.0.1:35175_p-n_0000000000) [n:127.0.0.1:35175_p ] o.a.s.c.Overseer processMessage: queueSize: 1, message = {
[junit4] 2> "operation":"leader",
[junit4] 2> "shard":"shard1",
[junit4] 2> "collection":"control_collection",
[junit4] 2> "base_url":"http://127.0.0.1:35175/p",
[junit4] 2> "core":"control_collection_shard1_replica_n1",
[junit4] 2> "state":"active"} current state version: 0
[junit4] 2> 1680030 DEBUG (OverseerStateUpdate-72967041724186628-127.0.0.1:35175_p-n_0000000000) [n:127.0.0.1:35175_p ] o.a.s.c.o.ZkStateWriter going to update_collection /collections/control_collection/state.json version: 1
[junit4] 2> 1680031 INFO (zkCallback-12680-thread-1) [ ] o.a.s.c.c.ZkStateReader A cluster state change: [WatchedEvent state:SyncConnected type:NodeDataChanged path:/collections/control_collection/state.json] for collection [control_collection] has occurred - updating... (live nodes size: [1])
[junit4] 2> 1680031 INFO (zkCallback-12680-thread-2) [ ] o.a.s.c.c.ZkStateReader A cluster state change: [WatchedEvent state:SyncConnected type:NodeDataChanged path:/collections/control_collection/state.json] for collection [control_collection] has occurred - updating... (live nodes size: [1])
[junit4] 2> 1680032 INFO (qtp1067319480-36010) [n:127.0.0.1:35175_p c:control_collection s:shard1 x:control_collection_shard1_replica_n1] o.a.s.c.ZkController I am the leader, no recovery necessary
[junit4] 2> 1680033 DEBUG (OverseerStateUpdate-72967041724186628-127.0.0.1:35175_p-n_0000000000) [n:127.0.0.1:35175_p ] o.a.s.c.Overseer processMessage: queueSize: 1, message = {
[junit4] 2> "core":"control_collection_shard1_replica_n1",
[junit4] 2> "core_node_name":"core_node2",
[junit4] 2> "roles":null,
[junit4] 2> "base_url":"http://127.0.0.1:35175/p",
[junit4] 2> "node_name":"127.0.0.1:35175_p",
[junit4] 2> "numShards":"1",
[junit4] 2> "state":"active",
[junit4] 2> "shard":"shard1",
[junit4] 2> "collection":"control_collection",
[junit4] 2> "type":"NRT",
[junit4] 2> "operation":"state"} current state version: 0
[junit4] 2> 1680034 DEBUG (OverseerStateUpdate-72967041724186628-127.0.0.1:35175_p-n_0000000000) [n:127.0.0.1:35175_p ] o.a.s.c.o.ReplicaMutator Update state numShards=1 message={
[junit4] 2> "core":"control_collection_shard1_replica_n1",
[junit4] 2> "core_node_name":"core_node2",
[junit4] 2> "roles":null,
[junit4] 2> "base_url":"http://127.0.0.1:35175/p",
[junit4] 2> "node_name":"127.0.0.1:35175_p",
[junit4] 2> "numShards":"1",
[junit4] 2> "state":"active",
[junit4] 2> "shard":"shard1",
[junit4] 2> "collection":"control_collection",
[junit4] 2> "type":"NRT",
[junit4] 2> "operation":"state"}
[junit4] 2> 1680034 DEBUG (OverseerStateUpdate-72967041724186628-127.0.0.1:35175_p-n_0000000000) [n:127.0.0.1:35175_p ] o.a.s.c.o.ReplicaMutator Will update state for replica: core_node2:{"core":"control_collection_shard1_replica_n1","base_url":"http://127.0.0.1:35175/p","node_name":"127.0.0.1:35175_p","state":"active","type":"NRT","leader":"true"}
[junit4] 2> 1680034 DEBUG (OverseerStateUpdate-72967041724186628-127.0.0.1:35175_p-n_0000000000) [n:127.0.0.1:35175_p ] o.a.s.c.o.ReplicaMutator Collection is now: DocCollection(control_collection//collections/control_collection/state.json/2)={
[junit4] 2> "pullReplicas":"0",
[junit4] 2> "replicationFactor":"1",
[junit4] 2> "router":{"name":"compositeId"},
[junit4] 2> "maxShardsPerNode":"1",
[junit4] 2> "autoAddReplicas":"false",
[junit4] 2> "nrtReplicas":"1",
[junit4] 2> "tlogReplicas":"0",
[junit4] 2> "shards":{"shard1":{
[junit4] 2> "range":"80000000-7fffffff",
[junit4] 2> "state":"active",
[junit4] 2> "replicas":{"core_node2":{
[junit4] 2> "core":"control_collection_shard1_replica_n1",
[junit4] 2> "base_url":"http://127.0.0.1:35175/p",
[junit4] 2> "node_name":"127.0.0.1:35175_p",
[junit4] 2> "state":"active",
[junit4] 2> "type":"NRT",
[junit4] 2> "leader":"true"}}}}}
[junit4] 2> 1680035 INFO (qtp1067319480-36010) [n:127.0.0.1:35175_p c:control_collection s:shard1 x:control_collection_shard1_replica_n1] o.a.s.s.HttpSolrCall [admin] webapp=null path=/admin/cores params={qt=/admin/cores&collection.configName=conf1&newCollection=true&name=control_collection_shard1_replica_n1&action=CREATE&numShards=1&collection=control_collection&shard=shard1&wt=javabin&version=2&replicaType=NRT} status=0 QTime=1374
[junit4] 2> 1680035 DEBUG (OverseerThreadFactory-6069-thread-1-processing-n:127.0.0.1:35175_p) [n:127.0.0.1:35175_p ] o.a.s.c.a.c.CreateCollectionCmd Finished create command on all shards for collection: control_collection
[junit4] 2> 1680035 DEBUG (OverseerThreadFactory-6069-thread-1-processing-n:127.0.0.1:35175_p) [n:127.0.0.1:35175_p ] o.a.s.c.OverseerTaskProcessor Completed task:[/overseer/collection-queue-work/qn-0000000000]
[junit4] 2> 1680036 DEBUG (OverseerThreadFactory-6069-thread-1-processing-n:127.0.0.1:35175_p) [n:127.0.0.1:35175_p ] o.a.s.c.OverseerTaskProcessor Marked task [/overseer/collection-queue-work/qn-0000000000] as completed.
[junit4] 2> 1680036 DEBUG (OverseerThreadFactory-6069-thread-1-processing-n:127.0.0.1:35175_p) [n:127.0.0.1:35175_p ] o.a.s.c.OverseerTaskProcessor RunningTasks: []
[junit4] 2> 1680036 DEBUG (OverseerThreadFactory-6069-thread-1-processing-n:127.0.0.1:35175_p) [n:127.0.0.1:35175_p ] o.a.s.c.OverseerTaskProcessor BlockedTasks: []
[junit4] 2> 1680036 DEBUG (OverseerThreadFactory-6069-thread-1-processing-n:127.0.0.1:35175_p) [n:127.0.0.1:35175_p ] o.a.s.c.OverseerTaskProcessor CompletedTasks: [/overseer/collection-queue-work/qn-0000000000]
[junit4] 2> 1680036 INFO (OverseerThreadFactory-6069-thread-1-processing-n:127.0.0.1:35175_p) [n:127.0.0.1:35175_p ] o.a.s.c.OverseerTaskProcessor RunningZKTasks: [/overseer/collection-queue-work/qn-0000000000]
[junit4] 2> 1680036 DEBUG (OverseerThreadFactory-6069-thread-1-processing-n:127.0.0.1:35175_p) [n:127.0.0.1:35175_p ] o.a.s.c.OverseerTaskProcessor Overseer Collection Message Handler: Message id:/overseer/collection-queue-work/qn-0000000000 complete, response:{success={127.0.0.1:35175_p={responseHeader={status=0,QTime=1374},core=control_collection_shard1_replica_n1}}}
[junit4] 2> 1680046 INFO (qtp1067319480-36008) [n:127.0.0.1:35175_p ] o.a.s.h.a.CollectionsHandler Wait for new collection to be active for at most 45 seconds. Check all shard replicas
[junit4] 2> 1680134 DEBUG (OverseerStateUpdate-72967041724186628-127.0.0.1:35175_p-n_0000000000) [n:127.0.0.1:35175_p ] o.a.s.c.o.ZkStateWriter going to update_collection /collections/control_collection/state.json version: 2
[junit4] 2> 1680135 INFO (zkCallback-12680-thread-1) [ ] o.a.s.c.c.ZkStateReader A cluster state change: [WatchedEvent state:SyncConnected type:NodeDataChanged path:/collections/control_collection/state.json] for collection [control_collection] has occurred - updating... (live nodes size: [1])
[junit4] 2> 1680136 INFO (qtp1067319480-36008) [n:127.0.0.1:35175_p ] o.a.s.s.HttpSolrCall [admin] webapp=null path=/admin/collections params={collection.configName=conf1&name=control_collection&nrtReplicas=1&action=CREATE&numShards=1&createNodeSet=127.0.0.1:35175_p&wt=javabin&version=2} status=0 QTime=1615
[junit4] 2> 1680137 INFO (zkCallback-12680-thread-2) [ ] o.a.s.c.c.ZkStateReader A cluster state change: [WatchedEvent state:SyncConnected type:NodeDataChanged path:/collections/control_collection/state.json] for collection [control_collection] has occurred - updating... (live nodes size: [1])
[junit4] 2> 1680138 INFO (zkCallback-12680-thread-3) [ ] o.a.s.c.c.ZkStateReader A cluster state change: [WatchedEvent state:SyncConnected type:NodeDataChanged path:/collections/control_collection/state.json] for collection [control_collection] has occurred - updating... (live nodes size: [1])
[junit4] 2> 1680144 INFO (zkConnectionManagerCallback-12700-thread-1) [ ] o.a.s.c.c.ConnectionManager zkClient has connected
[junit4] 2> 1680145 INFO (TEST-ShardSplitTest.testSplitStaticIndexReplication-seed#[76BA9AD6097A2124]) [ ] o.a.s.c.c.ZkStateReader Updated live nodes from ZooKeeper... (0) -> (1)
[junit4] 2> 1680146 INFO (TEST-ShardSplitTest.testSplitStaticIndexReplication-seed#[76BA9AD6097A2124]) [ ] o.a.s.c.s.i.ZkClientClusterStateProvider Cluster at 127.0.0.1:37560/solr ready
[junit4] 2> 1680146 INFO (TEST-ShardSplitTest.testSplitStaticIndexReplication-seed#[76BA9AD6097A2124]) [ ] o.a.s.c.ChaosMonkey monkey: init - expire sessions:false cause connection loss:false
[junit4] 2> 1680148 INFO (qtp1067319480-36010) [n:127.0.0.1:35175_p ] o.a.s.h.a.CollectionsHandler Invoked Collection Action :create with params collection.configName=conf1&name=collection1&nrtReplicas=1&action=CREATE&numShards=2&createNodeSet=&stateFormat=2&wt=javabin&version=2 and sendToOCPQueue=true
[junit4] 2> 1680156 DEBUG (OverseerCollectionConfigSetProcessor-72967041724186628-127.0.0.1:35175_p-n_0000000000) [n:127.0.0.1:35175_p ] o.a.s.c.OverseerTaskProcessor Got 1 tasks from work-queue : [[org.apache.solr.cloud.OverseerTaskQueue$QueueEvent@2e684ed1]]
[junit4] 2> 1680156 DEBUG (OverseerCollectionConfigSetProcessor-72967041724186628-127.0.0.1:35175_p-n_0000000000) [n:127.0.0.1:35175_p ] o.a.s.c.OverseerTaskProcessor Marked task [/overseer/collection-queue-work/qn-0000000002] as running
[junit4] 2> 1680156 DEBUG (OverseerCollectionConfigSetProcessor-72967041724186628-127.0.0.1:35175_p-n_0000000000) [n:127.0.0.1:35175_p ] o.a.s.c.OverseerTaskProcessor Overseer Collection Message Handler: Get the message id:/overseer/collection-queue-work/qn-0000000002 message:{
[junit4] 2> "name":"collection1",
[junit4] 2> "fromApi":"true",
[junit4] 2> "collection.configName":"conf1",
[junit4] 2> "numShards":"2",
[junit4] 2> "createNodeSet":"",
[junit4] 2> "stateFormat":"2",
[junit4] 2> "nrtReplicas":"1",
[junit4] 2> "replicationFactor":"1",
[junit4] 2> "operation":"create"}
[junit4] 2> 1680157 DEBUG (OverseerThreadFactory-6069-thread-2-processing-n:127.0.0.1:35175_p) [n:127.0.0.1:35175_p ] o.a.s.c.OverseerTaskProcessor Runner processing /overseer/collection-queue-work/qn-0000000002
[junit4] 2> 1680157 DEBUG (OverseerThreadFactory-6069-thread-2-processing-n:127.0.0.1:35175_p) [n:127.0.0.1:35175_p ] o.a.s.c.a.c.OverseerCollectionMessageHandler OverseerCollectionMessageHandler.processMessage : create , {
[junit4] 2> "name":"collection1",
[junit4] 2> "fromApi":"true",
[junit4] 2> "collection.configName":"conf1",
[junit4] 2> "numShards":"2",
[junit4] 2> "createNodeSet":"",
[junit4] 2> "stateFormat":"2",
[junit4] 2> "nrtReplicas":"1",
[junit4] 2> "replicationFactor":"1",
[junit4] 2> "operation":"create"}
[junit4] 2> 1680157 INFO (OverseerThreadFactory-6069-thread-2-processing-n:127.0.0.1:35175_p) [n:127.0.0.1:35175_p ] o.a.s.c.a.c.CreateCollectionCmd Create collection collection1
[junit4] 2> 1680157 DEBUG (OverseerCollectionConfigSetProcessor-72967041724186628-127.0.0.1:35175_p-n_0000000000) [n:127.0.0.1:35175_p ] o.a.s.c.OverseerTaskProcessor Cleaning up work-queue. #Running tasks: 1 #Completed tasks: 1
[junit4] 2> 1680158 INFO (OverseerCollectionConfigSetProcessor-72967041724186628-127.0.0.1:35175_p-n_0000000000) [n:127.0.0.1:35175_p ] o.a.s.c.OverseerTaskQueue Response ZK path: /overseer/collection-queue-work/qnr-0000000000 doesn't exist. Requestor may have disconnected from ZooKeeper
[junit4] 2> 1680158 DEBUG (OverseerThreadFactory-6069-thread-2-processing-n:127.0.0.1:35175_p) [n:127.0.0.1:35175_p ] o.a.s.c.a.c.OverseerCollectionMessageHandler creating collections conf node /collections/collection1
[junit4] 2> 1680158 DEBUG (OverseerCollectionConfigSetProcessor-72967041724186628-127.0.0.1:35175_p-n_0000000000) [n:127.0.0.1:35175_p ] o.a.s.c.OverseerTaskProcessor RunningTasks: [/overseer/collection-queue-work/qn-0000000002]
[junit4] 2> 1680158 DEBUG (OverseerCollectionConfigSetProcessor-72967041724186628-127.0.0.1:35175_p-n_0000000000) [n:127.0.0.1:35175_p ] o.a.s.c.OverseerTaskProcessor BlockedTasks: []
[junit4] 2> 1680158 DEBUG (OverseerCollectionConfigSetProcessor-72967041724186628-127.0.0.1:35175_p-n_0000000000) [n:127.0.0.1:35175_p ] o.a.s.c.OverseerTaskProcessor CompletedTasks: []
[junit4] 2> 1680158 INFO (OverseerCollectionConfigSetProcessor-72967041724186628-127.0.0.1:35175_p-n_0000000000) [n:127.0.0.1:35175_p ] o.a.s.c.OverseerTaskProcessor RunningZKTasks: [/overseer/collection-queue-work/qn-0000000002]
[junit4] 2> 1680159 DEBUG (OverseerThreadFactory-6069-thread-2-processing-n:127.0.0.1:35175_p) [n:127.0.0.1:35175_p ] o.a.s.c.a.c.CreateCollectionCmd Check for collection zkNode:collection1
[junit4] 2> 1680160 DEBUG (OverseerThreadFactory-6069-thread-2-processing-n:127.0.0.1:35175_p) [n:127.0.0.1:35175_p ] o.a.s.c.a.c.CreateCollectionCmd Collection zkNode exists
[junit4] 2> 1680162 DEBUG (OverseerStateUpdate-72967041724186628-127.0.0.1:35175_p-n_0000000000) [n:127.0.0.1:35175_p ] o.a.s.c.Overseer processMessage: queueSize: 1, message = {
[junit4] 2> "name":"collection1",
[junit4] 2> "fromApi":"true",
[junit4] 2> "collection.configName":"conf1",
[junit4] 2> "numShards":"2",
[junit4] 2> "createNodeSet":"",
[junit4] 2> "stateFormat":"2",
[junit4] 2> "nrtReplicas":"1",
[junit4] 2> "replicationFactor":"1",
[junit4] 2> "operation":"create"} current state version: 0
[junit4] 2> 1680162 DEBUG (OverseerStateUpdate-72967041724186628-127.0.0.1:35175_p-n_0000000000) [n:127.0.0.1:35175_p ] o.a.s.c.o.ClusterStateMutator building a new cName: collection1
[junit4] 2> 1680270 DEBUG (OverseerStateUpdate-72967041724186628-127.0.0.1:35175_p-n_0000000000) [n:127.0.0.1:35175_p ] o.a.s.c.o.ZkStateWriter going to create_collection /collections/collection1/state.json
[junit4] 2> 1680364 WARN (OverseerThreadFactory-6069-thread-2-processing-n:127.0.0.1:35175_p) [n:127.0.0.1:35175_p ] o.a.s.c.a.c.CreateCollectionCmd It is unusual to create a collection (collection1) without cores.
[junit4] 2> 1680364 DEBUG (OverseerThreadFactory-6069-thread-2-processing-n:127.0.0.1:35175_p) [n:127.0.0.1:35175_p ] o.a.s.c.a.c.CreateCollectionCmd Finished create command for collection: collection1
[junit4] 2> 1680364 DEBUG (OverseerThreadFactory-6069-thread-2-processing-n:127.0.0.1:35175_p) [n:127.0.0.1:35175_p ] o.a.s.c.OverseerTaskProcessor Completed task:[/overseer/collection-queue-work/qn-0000000002]
[junit4] 2> 1680366 DEBUG (OverseerThreadFactory-6069-thread-2-processing-n:127.0.0.1:35175_p) [n:127.0.0.1:35175_p ] o.a.s.c.OverseerTaskProcessor Marked task [/overseer/collection-queue-work/qn-0000000002] as completed.
[junit4] 2> 1680366 DEBUG (OverseerThreadFactory-6069-thread-2-processing-n:127.0.0.1:35175_p) [n:127.0.0.1:35175_p ] o.a.s.c.OverseerTaskProcessor RunningTasks: []
[junit4] 2> 1680366 DEBUG (OverseerThreadFactory-6069-thread-2-processing-n:127.0.0.1:35175_p) [n:127.0.0.1:35175_p ] o.a.s.c.OverseerTaskProcessor BlockedTasks: []
[junit4] 2> 1680366 DEBUG (OverseerThreadFactory-6069-thread-2-processing-n:127.0.0.1:35175_p) [n:127.0.0.1:35175_p ] o.a.s.c.OverseerTaskProcessor CompletedTasks: [/overseer/collection-queue-work/qn-0000000002]
[junit4] 2> 1680366 INFO (OverseerThreadFactory-6069-thread-2-processing-n:127.0.0.1:35175_p) [n:127.0.0.1:35175_p ] o.a.s.c.OverseerTaskProcessor RunningZKTasks: [/overseer/collection-queue-work/qn-0000000002]
[junit4] 2> 1680366 DEBUG (OverseerThreadFactory-6069-thread-2-processing-n:127.0.0.1:35175_p) [n:127.0.0.1:35175_p ] o.a.s.c.OverseerTaskProcessor Overseer Collection Message Handler: Message id:/overseer/collection-queue-work/qn-0000000002 complete, response:{}
[junit4] 2> 1680366 INFO (qtp1067319480-36010) [n:127.0.0.1:35175_p ] o.a.s.h.a.CollectionsHandler Wait for new collection to be active for at most 45 seconds. Check all shard replicas
[junit4] 2> 1680367 INFO (qtp1067319480-36010) [n:127.0.0.1:35175_p ] o.a.s.s.HttpSolrCall [admin] webapp=null path=/admin/collections params={collection.configName=conf1&name=collection1&nrtReplicas=1&action=CREATE&numShards=2&createNodeSet=&stateFormat=2&wt=javabin&version=2} status=0 QTime=219
[junit4] 2> 1680368 INFO (TEST-ShardSplitTest.testSplitStaticIndexReplication-seed#[76BA9AD6097A2124]) [ ] o.a.s.c.AbstractFullDistribZkTestBase Creating jetty instances pullReplicaCount=0 numOtherReplicas=4
[junit4] 2> 1680556 INFO (TEST-ShardSplitTest.testSplitStaticIndexReplication-seed#[76BA9AD6097A2124]) [ ] o.a.s.c.AbstractFullDistribZkTestBase create jetty 1 in directory /x1/jenkins/jenkins-slave/workspace/Lucene-Solr-NightlyTests-master/checkout/solr/build/solr-core/test/J0/temp/solr.cloud.api.collections.ShardSplitTest_76BA9AD6097A2124-001/shard-1-001 of type NRT
[junit4] 2> 1680566 WARN (closeThreadPool-12701-thread-1) [ ] o.e.j.s.AbstractConnector Ignoring deprecated socket close linger time
[junit4] 2> 1680566 INFO (closeThreadPool-12701-thread-1) [ ] o.a.s.c.s.e.JettySolrRunner Start Jetty (original configured port=0)
[junit4] 2> 1680566 INFO (closeThreadPool-12701-thread-1) [ ] o.a.s.c.s.e.JettySolrRunner Trying to start Jetty on port 0 try number 1 ...
[junit4] 2> 1680566 INFO (closeThreadPool-12701-thread-1) [ ] o.e.j.s.Server jetty-9.4.14.v20181114; built: 2018-11-14T21:20:31.478Z; git: c4550056e785fb5665914545889f21dc136ad9e6; jvm 1.8.0_191-b12
[junit4] 2> 1680612 INFO (closeThreadPool-12701-thread-1) [ ] o.e.j.s.session DefaultSessionIdManager workerName=node0
[junit4] 2> 1680612 INFO (closeThreadPool-12701-thread-1) [ ] o.e.j.s.session No SessionScavenger set, using defaults
[junit4] 2> 1680612 INFO (closeThreadPool-12701-thread-1) [ ] o.e.j.s.session node0 Scavenging every 600000ms
[junit4] 2> 1680612 INFO (closeThreadPool-12701-thread-1) [ ] o.e.j.s.h.ContextHandler Started o.e.j.s.ServletContextHandler@126dcfab{/p,null,AVAILABLE}
[junit4] 2> 1680613 INFO (closeThreadPool-12701-thread-1) [ ] o.e.j.s.AbstractConnector Started ServerConnector@770249f1{HTTP/1.1,[http/1.1, h2c]}{127.0.0.1:42015}
[junit4] 2> 1680613 INFO (closeThreadPool-12701-thread-1) [ ] o.e.j.s.Server Started @1680668ms
[junit4] 2> 1680613 INFO (closeThreadPool-12701-thread-1) [ ] o.a.s.c.s.e.JettySolrRunner Jetty properties: {solr.data.dir=/x1/jenkins/jenkins-slave/workspace/Lucene-Solr-NightlyTests-master/checkout/solr/build/solr-core/test/J0/temp/solr.cloud.api.collections.ShardSplitTest_76BA9AD6097A2124-001/tempDir-001/jetty1, replicaType=NRT, solrconfig=solrconfig.xml, hostContext=/p, hostPort=42015, coreRootDirectory=/x1/jenkins/jenkins-slave/workspace/Lucene-Solr-NightlyTests-master/checkout/solr/build/solr-core/test/J0/temp/solr.cloud.api.collections.ShardSplitTest_76BA9AD6097A2124-001/shard-1-001/cores}
[junit4] 2> 1680613 ERROR (closeThreadPool-12701-thread-1) [ ] o.a.s.u.StartupLoggingUtils Miss
[...truncated too long message...]
set property disallowed.ivy.jars.list as its length is 0.
-ivy-fail-disallowed-ivy-version:
ivy-fail:
ivy-configure:
[ivy:configure] :: loading settings :: file = /x1/jenkins/jenkins-slave/workspace/Lucene-Solr-NightlyTests-master/checkout/lucene/top-level-ivy-settings.xml
resolve:
ivy-availability-check:
[loadresource] Do not set property disallowed.ivy.jars.list as its length is 0.
-ivy-fail-disallowed-ivy-version:
ivy-fail:
ivy-fail:
ivy-configure:
[ivy:configure] :: loading settings :: file = /x1/jenkins/jenkins-slave/workspace/Lucene-Solr-NightlyTests-master/checkout/lucene/top-level-ivy-settings.xml
resolve:
ivy-availability-check:
[loadresource] Do not set property disallowed.ivy.jars.list as its length is 0.
-ivy-fail-disallowed-ivy-version:
ivy-fail:
ivy-configure:
[ivy:configure] :: loading settings :: file = /x1/jenkins/jenkins-slave/workspace/Lucene-Solr-NightlyTests-master/checkout/lucene/top-level-ivy-settings.xml
resolve:
ivy-availability-check:
[loadresource] Do not set property disallowed.ivy.jars.list as its length is 0.
-ivy-fail-disallowed-ivy-version:
ivy-fail:
ivy-fail:
ivy-configure:
[ivy:configure] :: loading settings :: file = /x1/jenkins/jenkins-slave/workspace/Lucene-Solr-NightlyTests-master/checkout/lucene/top-level-ivy-settings.xml
resolve:
ivy-availability-check:
[loadresource] Do not set property disallowed.ivy.jars.list as its length is 0.
-ivy-fail-disallowed-ivy-version:
ivy-fail:
ivy-fail:
ivy-configure:
[ivy:configure] :: loading settings :: file = /x1/jenkins/jenkins-slave/workspace/Lucene-Solr-NightlyTests-master/checkout/lucene/top-level-ivy-settings.xml
resolve:
ivy-availability-check:
[loadresource] Do not set property disallowed.ivy.jars.list as its length is 0.
-ivy-fail-disallowed-ivy-version:
ivy-fail:
ivy-fail:
ivy-configure:
[ivy:configure] :: loading settings :: file = /x1/jenkins/jenkins-slave/workspace/Lucene-Solr-NightlyTests-master/checkout/lucene/top-level-ivy-settings.xml
resolve:
ivy-availability-check:
[loadresource] Do not set property disallowed.ivy.jars.list as its length is 0.
-ivy-fail-disallowed-ivy-version:
ivy-fail:
ivy-fail:
ivy-configure:
[ivy:configure] :: loading settings :: file = /x1/jenkins/jenkins-slave/workspace/Lucene-Solr-NightlyTests-master/checkout/lucene/top-level-ivy-settings.xml
resolve:
ivy-availability-check:
[loadresource] Do not set property disallowed.ivy.jars.list as its length is 0.
-ivy-fail-disallowed-ivy-version:
ivy-fail:
ivy-fail:
ivy-configure:
[ivy:configure] :: loading settings :: file = /x1/jenkins/jenkins-slave/workspace/Lucene-Solr-NightlyTests-master/checkout/lucene/top-level-ivy-settings.xml
resolve:
ivy-availability-check:
[loadresource] Do not set property disallowed.ivy.jars.list as its length is 0.
-ivy-fail-disallowed-ivy-version:
ivy-fail:
ivy-fail:
ivy-configure:
[ivy:configure] :: loading settings :: file = /x1/jenkins/jenkins-slave/workspace/Lucene-Solr-NightlyTests-master/checkout/lucene/top-level-ivy-settings.xml
resolve:
ivy-availability-check:
[loadresource] Do not set property disallowed.ivy.jars.list as its length is 0.
-ivy-fail-disallowed-ivy-version:
ivy-fail:
ivy-fail:
ivy-configure:
[ivy:configure] :: loading settings :: file = /x1/jenkins/jenkins-slave/workspace/Lucene-Solr-NightlyTests-master/checkout/lucene/top-level-ivy-settings.xml
resolve:
ivy-availability-check:
[loadresource] Do not set property disallowed.ivy.jars.list as its length is 0.
-ivy-fail-disallowed-ivy-version:
ivy-fail:
ivy-fail:
ivy-configure:
[ivy:configure] :: loading settings :: file = /x1/jenkins/jenkins-slave/workspace/Lucene-Solr-NightlyTests-master/checkout/lucene/top-level-ivy-settings.xml
resolve:
ivy-availability-check:
[loadresource] Do not set property disallowed.ivy.jars.list as its length is 0.
-ivy-fail-disallowed-ivy-version:
ivy-fail:
ivy-fail:
ivy-configure:
[ivy:configure] :: loading settings :: file = /x1/jenkins/jenkins-slave/workspace/Lucene-Solr-NightlyTests-master/checkout/lucene/top-level-ivy-settings.xml
resolve:
ivy-availability-check:
[loadresource] Do not set property disallowed.ivy.jars.list as its length is 0.
-ivy-fail-disallowed-ivy-version:
ivy-fail:
ivy-fail:
ivy-configure:
[ivy:configure] :: loading settings :: file = /x1/jenkins/jenkins-slave/workspace/Lucene-Solr-NightlyTests-master/checkout/lucene/top-level-ivy-settings.xml
resolve:
jar-checksums:
[mkdir] Created dir: /x1/jenkins/jenkins-slave/workspace/Lucene-Solr-NightlyTests-master/checkout/solr/null903481329
[copy] Copying 239 files to /x1/jenkins/jenkins-slave/workspace/Lucene-Solr-NightlyTests-master/checkout/solr/null903481329
[delete] Deleting directory /x1/jenkins/jenkins-slave/workspace/Lucene-Solr-NightlyTests-master/checkout/solr/null903481329
check-working-copy:
[ivy:cachepath] :: resolving dependencies :: org.eclipse.jgit#org.eclipse.jgit-caller;working
[ivy:cachepath] confs: [default]
[ivy:cachepath] found org.eclipse.jgit#org.eclipse.jgit;4.6.0.201612231935-r in public
[ivy:cachepath] found com.jcraft#jsch;0.1.53 in public
[ivy:cachepath] found com.googlecode.javaewah#JavaEWAH;1.1.6 in public
[ivy:cachepath] found org.apache.httpcomponents#httpclient;4.3.6 in public
[ivy:cachepath] found org.apache.httpcomponents#httpcore;4.3.3 in public
[ivy:cachepath] found commons-logging#commons-logging;1.1.3 in public
[ivy:cachepath] found commons-codec#commons-codec;1.6 in public
[ivy:cachepath] found org.slf4j#slf4j-api;1.7.2 in public
[ivy:cachepath] :: resolution report :: resolve 50ms :: artifacts dl 1ms
---------------------------------------------------------------------
| | modules || artifacts |
| conf | number| search|dwnlded|evicted|| number|dwnlded|
---------------------------------------------------------------------
| default | 8 | 0 | 0 | 0 || 8 | 0 |
---------------------------------------------------------------------
[wc-checker] Initializing working copy...
[wc-checker] SLF4J: Failed to load class "org.slf4j.impl.StaticLoggerBinder".
[wc-checker] SLF4J: Defaulting to no-operation (NOP) logger implementation
[wc-checker] SLF4J: See http://www.slf4j.org/codes.html#StaticLoggerBinder for further details.
[wc-checker] Checking working copy status...
-jenkins-base:
BUILD SUCCESSFUL
Total time: 276 minutes 41 seconds
Archiving artifacts
java.lang.InterruptedException: no matches found within 10000
at hudson.FilePath$ValidateAntFileMask.hasMatch(FilePath.java:2847)
at hudson.FilePath$ValidateAntFileMask.invoke(FilePath.java:2726)
at hudson.FilePath$ValidateAntFileMask.invoke(FilePath.java:2707)
at hudson.FilePath$FileCallableWrapper.call(FilePath.java:3086)
Also: hudson.remoting.Channel$CallSiteStackTrace: Remote call to lucene
at hudson.remoting.Channel.attachCallSiteStackTrace(Channel.java:1741)
at hudson.remoting.UserRequest$ExceptionResponse.retrieve(UserRequest.java:357)
at hudson.remoting.Channel.call(Channel.java:955)
at hudson.FilePath.act(FilePath.java:1072)
at hudson.FilePath.act(FilePath.java:1061)
at hudson.FilePath.validateAntFileMask(FilePath.java:2705)
at hudson.tasks.ArtifactArchiver.perform(ArtifactArchiver.java:243)
at hudson.tasks.BuildStepCompatibilityLayer.perform(BuildStepCompatibilityLayer.java:81)
at hudson.tasks.BuildStepMonitor$1.perform(BuildStepMonitor.java:20)
at hudson.model.AbstractBuild$AbstractBuildExecution.perform(AbstractBuild.java:744)
at hudson.model.AbstractBuild$AbstractBuildExecution.performAllBuildSteps(AbstractBuild.java:690)
at hudson.model.Build$BuildExecution.post2(Build.java:186)
at hudson.model.AbstractBuild$AbstractBuildExecution.post(AbstractBuild.java:635)
at hudson.model.Run.execute(Run.java:1835)
at hudson.model.FreeStyleBuild.run(FreeStyleBuild.java:43)
at hudson.model.ResourceController.execute(ResourceController.java:97)
at hudson.model.Executor.run(Executor.java:429)
Caused: hudson.FilePath$TunneledInterruptedException
at hudson.FilePath$FileCallableWrapper.call(FilePath.java:3088)
at hudson.remoting.UserRequest.perform(UserRequest.java:212)
at hudson.remoting.UserRequest.perform(UserRequest.java:54)
at hudson.remoting.Request$2.run(Request.java:369)
at hudson.remoting.InterceptingExecutorService$1.call(InterceptingExecutorService.java:72)
at java.util.concurrent.FutureTask.run(FutureTask.java:266)
at java.util.concurrent.ThreadPoolExecutor.runWorker(ThreadPoolExecutor.java:1142)
at java.util.concurrent.ThreadPoolExecutor$Worker.run(ThreadPoolExecutor.java:617)
at java.lang.Thread.run(Thread.java:748)
Caused: java.lang.InterruptedException: java.lang.InterruptedException: no matches found within 10000
at hudson.FilePath.act(FilePath.java:1074)
at hudson.FilePath.act(FilePath.java:1061)
at hudson.FilePath.validateAntFileMask(FilePath.java:2705)
at hudson.tasks.ArtifactArchiver.perform(ArtifactArchiver.java:243)
at hudson.tasks.BuildStepCompatibilityLayer.perform(BuildStepCompatibilityLayer.java:81)
at hudson.tasks.BuildStepMonitor$1.perform(BuildStepMonitor.java:20)
at hudson.model.AbstractBuild$AbstractBuildExecution.perform(AbstractBuild.java:744)
at hudson.model.AbstractBuild$AbstractBuildExecution.performAllBuildSteps(AbstractBuild.java:690)
at hudson.model.Build$BuildExecution.post2(Build.java:186)
at hudson.model.AbstractBuild$AbstractBuildExecution.post(AbstractBuild.java:635)
at hudson.model.Run.execute(Run.java:1835)
at hudson.model.FreeStyleBuild.run(FreeStyleBuild.java:43)
at hudson.model.ResourceController.execute(ResourceController.java:97)
at hudson.model.Executor.run(Executor.java:429)
No artifacts found that match the file pattern "**/*.events,heapdumps/**,**/hs_err_pid*". Configuration error?
Recording test results
Build step 'Publish JUnit test result report' changed build result to UNSTABLE
Email was triggered for: Unstable (Test Failures)
Sending email for trigger: Unstable (Test Failures)
[JENKINS] Lucene-Solr-NightlyTests-master - Build # 1794 - Still
Unstable
Posted by Apache Jenkins Server <je...@builds.apache.org>.
Build: https://builds.apache.org/job/Lucene-Solr-NightlyTests-master/1794/
1 tests failed.
FAILED: org.apache.solr.cloud.autoscaling.HdfsAutoAddReplicasIntegrationTest.testSimple
Error Message:
Waiting for collection testSimple2 Timeout waiting to see state for collection=testSimple2 :DocCollection(testSimple2//collections/testSimple2/state.json/23)={ "pullReplicas":"0", "replicationFactor":"2", "shards":{ "shard1":{ "range":"80000000-ffffffff", "state":"active", "replicas":{ "core_node3":{ "dataDir":"hdfs://localhost:40741/solr_hdfs_home/testSimple2/core_node3/data/", "base_url":"https://127.0.0.1:41738/solr", "node_name":"127.0.0.1:41738_solr", "type":"NRT", "force_set_state":"false", "ulogDir":"hdfs://localhost:40741/solr_hdfs_home/testSimple2/core_node3/data/tlog", "core":"testSimple2_shard1_replica_n1", "shared_storage":"true", "state":"active", "leader":"true"}, "core_node5":{ "dataDir":"hdfs://localhost:40741/solr_hdfs_home/testSimple2/core_node5/data/", "base_url":"https://127.0.0.1:42064/solr", "node_name":"127.0.0.1:42064_solr", "type":"NRT", "force_set_state":"false", "ulogDir":"hdfs://localhost:40741/solr_hdfs_home/testSimple2/core_node5/data/tlog", "core":"testSimple2_shard1_replica_n2", "shared_storage":"true", "state":"down"}}}, "shard2":{ "range":"0-7fffffff", "state":"active", "replicas":{ "core_node7":{ "dataDir":"hdfs://localhost:40741/solr_hdfs_home/testSimple2/core_node7/data/", "base_url":"https://127.0.0.1:41738/solr", "node_name":"127.0.0.1:41738_solr", "type":"NRT", "force_set_state":"false", "ulogDir":"hdfs://localhost:40741/solr_hdfs_home/testSimple2/core_node7/data/tlog", "core":"testSimple2_shard2_replica_n4", "shared_storage":"true", "state":"active", "leader":"true"}, "core_node8":{ "dataDir":"hdfs://localhost:40741/solr_hdfs_home/testSimple2/core_node8/data/", "base_url":"https://127.0.0.1:42064/solr", "node_name":"127.0.0.1:42064_solr", "type":"NRT", "force_set_state":"false", "ulogDir":"hdfs://localhost:40741/solr_hdfs_home/testSimple2/core_node8/data/tlog", "core":"testSimple2_shard2_replica_n6", "shared_storage":"true", "state":"down"}}}}, "router":{"name":"compositeId"}, "maxShardsPerNode":"2", "autoAddReplicas":"true", "nrtReplicas":"2", "tlogReplicas":"0"} Live Nodes: [127.0.0.1:41738_solr, 127.0.0.1:45615_solr] Last available state: DocCollection(testSimple2//collections/testSimple2/state.json/23)={ "pullReplicas":"0", "replicationFactor":"2", "shards":{ "shard1":{ "range":"80000000-ffffffff", "state":"active", "replicas":{ "core_node3":{ "dataDir":"hdfs://localhost:40741/solr_hdfs_home/testSimple2/core_node3/data/", "base_url":"https://127.0.0.1:41738/solr", "node_name":"127.0.0.1:41738_solr", "type":"NRT", "force_set_state":"false", "ulogDir":"hdfs://localhost:40741/solr_hdfs_home/testSimple2/core_node3/data/tlog", "core":"testSimple2_shard1_replica_n1", "shared_storage":"true", "state":"active", "leader":"true"}, "core_node5":{ "dataDir":"hdfs://localhost:40741/solr_hdfs_home/testSimple2/core_node5/data/", "base_url":"https://127.0.0.1:42064/solr", "node_name":"127.0.0.1:42064_solr", "type":"NRT", "force_set_state":"false", "ulogDir":"hdfs://localhost:40741/solr_hdfs_home/testSimple2/core_node5/data/tlog", "core":"testSimple2_shard1_replica_n2", "shared_storage":"true", "state":"down"}}}, "shard2":{ "range":"0-7fffffff", "state":"active", "replicas":{ "core_node7":{ "dataDir":"hdfs://localhost:40741/solr_hdfs_home/testSimple2/core_node7/data/", "base_url":"https://127.0.0.1:41738/solr", "node_name":"127.0.0.1:41738_solr", "type":"NRT", "force_set_state":"false", "ulogDir":"hdfs://localhost:40741/solr_hdfs_home/testSimple2/core_node7/data/tlog", "core":"testSimple2_shard2_replica_n4", "shared_storage":"true", "state":"active", "leader":"true"}, "core_node8":{ "dataDir":"hdfs://localhost:40741/solr_hdfs_home/testSimple2/core_node8/data/", "base_url":"https://127.0.0.1:42064/solr", "node_name":"127.0.0.1:42064_solr", "type":"NRT", "force_set_state":"false", "ulogDir":"hdfs://localhost:40741/solr_hdfs_home/testSimple2/core_node8/data/tlog", "core":"testSimple2_shard2_replica_n6", "shared_storage":"true", "state":"down"}}}}, "router":{"name":"compositeId"}, "maxShardsPerNode":"2", "autoAddReplicas":"true", "nrtReplicas":"2", "tlogReplicas":"0"}
Stack Trace:
java.lang.AssertionError: Waiting for collection testSimple2
Timeout waiting to see state for collection=testSimple2 :DocCollection(testSimple2//collections/testSimple2/state.json/23)={
"pullReplicas":"0",
"replicationFactor":"2",
"shards":{
"shard1":{
"range":"80000000-ffffffff",
"state":"active",
"replicas":{
"core_node3":{
"dataDir":"hdfs://localhost:40741/solr_hdfs_home/testSimple2/core_node3/data/",
"base_url":"https://127.0.0.1:41738/solr",
"node_name":"127.0.0.1:41738_solr",
"type":"NRT",
"force_set_state":"false",
"ulogDir":"hdfs://localhost:40741/solr_hdfs_home/testSimple2/core_node3/data/tlog",
"core":"testSimple2_shard1_replica_n1",
"shared_storage":"true",
"state":"active",
"leader":"true"},
"core_node5":{
"dataDir":"hdfs://localhost:40741/solr_hdfs_home/testSimple2/core_node5/data/",
"base_url":"https://127.0.0.1:42064/solr",
"node_name":"127.0.0.1:42064_solr",
"type":"NRT",
"force_set_state":"false",
"ulogDir":"hdfs://localhost:40741/solr_hdfs_home/testSimple2/core_node5/data/tlog",
"core":"testSimple2_shard1_replica_n2",
"shared_storage":"true",
"state":"down"}}},
"shard2":{
"range":"0-7fffffff",
"state":"active",
"replicas":{
"core_node7":{
"dataDir":"hdfs://localhost:40741/solr_hdfs_home/testSimple2/core_node7/data/",
"base_url":"https://127.0.0.1:41738/solr",
"node_name":"127.0.0.1:41738_solr",
"type":"NRT",
"force_set_state":"false",
"ulogDir":"hdfs://localhost:40741/solr_hdfs_home/testSimple2/core_node7/data/tlog",
"core":"testSimple2_shard2_replica_n4",
"shared_storage":"true",
"state":"active",
"leader":"true"},
"core_node8":{
"dataDir":"hdfs://localhost:40741/solr_hdfs_home/testSimple2/core_node8/data/",
"base_url":"https://127.0.0.1:42064/solr",
"node_name":"127.0.0.1:42064_solr",
"type":"NRT",
"force_set_state":"false",
"ulogDir":"hdfs://localhost:40741/solr_hdfs_home/testSimple2/core_node8/data/tlog",
"core":"testSimple2_shard2_replica_n6",
"shared_storage":"true",
"state":"down"}}}},
"router":{"name":"compositeId"},
"maxShardsPerNode":"2",
"autoAddReplicas":"true",
"nrtReplicas":"2",
"tlogReplicas":"0"}
Live Nodes: [127.0.0.1:41738_solr, 127.0.0.1:45615_solr]
Last available state: DocCollection(testSimple2//collections/testSimple2/state.json/23)={
"pullReplicas":"0",
"replicationFactor":"2",
"shards":{
"shard1":{
"range":"80000000-ffffffff",
"state":"active",
"replicas":{
"core_node3":{
"dataDir":"hdfs://localhost:40741/solr_hdfs_home/testSimple2/core_node3/data/",
"base_url":"https://127.0.0.1:41738/solr",
"node_name":"127.0.0.1:41738_solr",
"type":"NRT",
"force_set_state":"false",
"ulogDir":"hdfs://localhost:40741/solr_hdfs_home/testSimple2/core_node3/data/tlog",
"core":"testSimple2_shard1_replica_n1",
"shared_storage":"true",
"state":"active",
"leader":"true"},
"core_node5":{
"dataDir":"hdfs://localhost:40741/solr_hdfs_home/testSimple2/core_node5/data/",
"base_url":"https://127.0.0.1:42064/solr",
"node_name":"127.0.0.1:42064_solr",
"type":"NRT",
"force_set_state":"false",
"ulogDir":"hdfs://localhost:40741/solr_hdfs_home/testSimple2/core_node5/data/tlog",
"core":"testSimple2_shard1_replica_n2",
"shared_storage":"true",
"state":"down"}}},
"shard2":{
"range":"0-7fffffff",
"state":"active",
"replicas":{
"core_node7":{
"dataDir":"hdfs://localhost:40741/solr_hdfs_home/testSimple2/core_node7/data/",
"base_url":"https://127.0.0.1:41738/solr",
"node_name":"127.0.0.1:41738_solr",
"type":"NRT",
"force_set_state":"false",
"ulogDir":"hdfs://localhost:40741/solr_hdfs_home/testSimple2/core_node7/data/tlog",
"core":"testSimple2_shard2_replica_n4",
"shared_storage":"true",
"state":"active",
"leader":"true"},
"core_node8":{
"dataDir":"hdfs://localhost:40741/solr_hdfs_home/testSimple2/core_node8/data/",
"base_url":"https://127.0.0.1:42064/solr",
"node_name":"127.0.0.1:42064_solr",
"type":"NRT",
"force_set_state":"false",
"ulogDir":"hdfs://localhost:40741/solr_hdfs_home/testSimple2/core_node8/data/tlog",
"core":"testSimple2_shard2_replica_n6",
"shared_storage":"true",
"state":"down"}}}},
"router":{"name":"compositeId"},
"maxShardsPerNode":"2",
"autoAddReplicas":"true",
"nrtReplicas":"2",
"tlogReplicas":"0"}
at __randomizedtesting.SeedInfo.seed([CF3F1BCCCFED791E:F78C3F32E81EADCF]:0)
at org.junit.Assert.fail(Assert.java:88)
at org.apache.solr.cloud.SolrCloudTestCase.waitForState(SolrCloudTestCase.java:310)
at org.apache.solr.cloud.autoscaling.AutoAddReplicasIntegrationTest.testSimple(AutoAddReplicasIntegrationTest.java:169)
at sun.reflect.NativeMethodAccessorImpl.invoke0(Native Method)
at sun.reflect.NativeMethodAccessorImpl.invoke(NativeMethodAccessorImpl.java:62)
at sun.reflect.DelegatingMethodAccessorImpl.invoke(DelegatingMethodAccessorImpl.java:43)
at java.lang.reflect.Method.invoke(Method.java:498)
at com.carrotsearch.randomizedtesting.RandomizedRunner.invoke(RandomizedRunner.java:1750)
at com.carrotsearch.randomizedtesting.RandomizedRunner$8.evaluate(RandomizedRunner.java:938)
at com.carrotsearch.randomizedtesting.RandomizedRunner$9.evaluate(RandomizedRunner.java:974)
at com.carrotsearch.randomizedtesting.RandomizedRunner$10.evaluate(RandomizedRunner.java:988)
at com.carrotsearch.randomizedtesting.rules.SystemPropertiesRestoreRule$1.evaluate(SystemPropertiesRestoreRule.java:57)
at org.apache.lucene.util.TestRuleSetupTeardownChained$1.evaluate(TestRuleSetupTeardownChained.java:49)
at org.apache.lucene.util.AbstractBeforeAfterRule$1.evaluate(AbstractBeforeAfterRule.java:45)
at org.apache.lucene.util.TestRuleThreadAndTestName$1.evaluate(TestRuleThreadAndTestName.java:48)
at org.apache.lucene.util.TestRuleIgnoreAfterMaxFailures$1.evaluate(TestRuleIgnoreAfterMaxFailures.java:64)
at org.apache.lucene.util.TestRuleMarkFailure$1.evaluate(TestRuleMarkFailure.java:47)
at com.carrotsearch.randomizedtesting.rules.StatementAdapter.evaluate(StatementAdapter.java:36)
at com.carrotsearch.randomizedtesting.ThreadLeakControl$StatementRunner.run(ThreadLeakControl.java:368)
at com.carrotsearch.randomizedtesting.ThreadLeakControl.forkTimeoutingTask(ThreadLeakControl.java:817)
at com.carrotsearch.randomizedtesting.ThreadLeakControl$3.evaluate(ThreadLeakControl.java:468)
at com.carrotsearch.randomizedtesting.RandomizedRunner.runSingleTest(RandomizedRunner.java:947)
at com.carrotsearch.randomizedtesting.RandomizedRunner$5.evaluate(RandomizedRunner.java:832)
at com.carrotsearch.randomizedtesting.RandomizedRunner$6.evaluate(RandomizedRunner.java:883)
at com.carrotsearch.randomizedtesting.RandomizedRunner$7.evaluate(RandomizedRunner.java:894)
at com.carrotsearch.randomizedtesting.rules.StatementAdapter.evaluate(StatementAdapter.java:36)
at com.carrotsearch.randomizedtesting.rules.SystemPropertiesRestoreRule$1.evaluate(SystemPropertiesRestoreRule.java:57)
at org.apache.lucene.util.AbstractBeforeAfterRule$1.evaluate(AbstractBeforeAfterRule.java:45)
at com.carrotsearch.randomizedtesting.rules.StatementAdapter.evaluate(StatementAdapter.java:36)
at org.apache.lucene.util.TestRuleStoreClassName$1.evaluate(TestRuleStoreClassName.java:41)
at com.carrotsearch.randomizedtesting.rules.NoShadowingOrOverridesOnMethodsRule$1.evaluate(NoShadowingOrOverridesOnMethodsRule.java:40)
at com.carrotsearch.randomizedtesting.rules.NoShadowingOrOverridesOnMethodsRule$1.evaluate(NoShadowingOrOverridesOnMethodsRule.java:40)
at com.carrotsearch.randomizedtesting.rules.StatementAdapter.evaluate(StatementAdapter.java:36)
at com.carrotsearch.randomizedtesting.rules.StatementAdapter.evaluate(StatementAdapter.java:36)
at com.carrotsearch.randomizedtesting.rules.StatementAdapter.evaluate(StatementAdapter.java:36)
at org.apache.lucene.util.TestRuleAssertionsRequired$1.evaluate(TestRuleAssertionsRequired.java:53)
at org.apache.lucene.util.TestRuleMarkFailure$1.evaluate(TestRuleMarkFailure.java:47)
at org.apache.lucene.util.TestRuleIgnoreAfterMaxFailures$1.evaluate(TestRuleIgnoreAfterMaxFailures.java:64)
at org.apache.lucene.util.TestRuleIgnoreTestSuites$1.evaluate(TestRuleIgnoreTestSuites.java:54)
at com.carrotsearch.randomizedtesting.rules.StatementAdapter.evaluate(StatementAdapter.java:36)
at com.carrotsearch.randomizedtesting.ThreadLeakControl$StatementRunner.run(ThreadLeakControl.java:368)
at java.lang.Thread.run(Thread.java:748)
Build Log:
[...truncated 13769 lines...]
[junit4] Suite: org.apache.solr.cloud.autoscaling.HdfsAutoAddReplicasIntegrationTest
[junit4] 2> Creating dataDir: /x1/jenkins/jenkins-slave/workspace/Lucene-Solr-NightlyTests-master/checkout/solr/build/solr-core/test/J1/temp/solr.cloud.autoscaling.HdfsAutoAddReplicasIntegrationTest_CF3F1BCCCFED791E-001/init-core-data-001
[junit4] 2> 1480416 WARN (SUITE-HdfsAutoAddReplicasIntegrationTest-seed#[CF3F1BCCCFED791E]-worker) [ ] o.a.s.SolrTestCaseJ4 startTrackingSearchers: numOpens=1 numCloses=1
[junit4] 2> 1480416 INFO (SUITE-HdfsAutoAddReplicasIntegrationTest-seed#[CF3F1BCCCFED791E]-worker) [ ] o.a.s.SolrTestCaseJ4 Using TrieFields (NUMERIC_POINTS_SYSPROP=false) w/NUMERIC_DOCVALUES_SYSPROP=false
[junit4] 2> 1480419 INFO (SUITE-HdfsAutoAddReplicasIntegrationTest-seed#[CF3F1BCCCFED791E]-worker) [ ] o.a.s.SolrTestCaseJ4 Randomized ssl (true) and clientAuth (true) via: @org.apache.solr.util.RandomizeSSL(reason=, ssl=NaN, value=NaN, clientAuth=NaN)
[junit4] 2> 1480420 INFO (SUITE-HdfsAutoAddReplicasIntegrationTest-seed#[CF3F1BCCCFED791E]-worker) [ ] o.a.s.SolrTestCaseJ4 SecureRandom sanity checks: test.solr.allowed.securerandom=null & java.security.egd=file:/dev/./urandom
[junit4] 1> Formatting using clusterid: testClusterID
[junit4] 2> 1480469 WARN (SUITE-HdfsAutoAddReplicasIntegrationTest-seed#[CF3F1BCCCFED791E]-worker) [ ] o.a.h.m.i.MetricsConfig Cannot locate configuration: tried hadoop-metrics2-namenode.properties,hadoop-metrics2.properties
[junit4] 2> 1480485 WARN (SUITE-HdfsAutoAddReplicasIntegrationTest-seed#[CF3F1BCCCFED791E]-worker) [ ] o.a.h.h.HttpRequestLog Jetty request log can only be enabled using Log4j
[junit4] 2> 1480488 INFO (SUITE-HdfsAutoAddReplicasIntegrationTest-seed#[CF3F1BCCCFED791E]-worker) [ ] o.e.j.s.Server jetty-9.4.14.v20181114; built: 2018-11-14T21:20:31.478Z; git: c4550056e785fb5665914545889f21dc136ad9e6; jvm 1.8.0_191-b12
[junit4] 2> 1480489 INFO (SUITE-HdfsAutoAddReplicasIntegrationTest-seed#[CF3F1BCCCFED791E]-worker) [ ] o.e.j.s.session DefaultSessionIdManager workerName=node0
[junit4] 2> 1480489 INFO (SUITE-HdfsAutoAddReplicasIntegrationTest-seed#[CF3F1BCCCFED791E]-worker) [ ] o.e.j.s.session No SessionScavenger set, using defaults
[junit4] 2> 1480489 INFO (SUITE-HdfsAutoAddReplicasIntegrationTest-seed#[CF3F1BCCCFED791E]-worker) [ ] o.e.j.s.session node0 Scavenging every 660000ms
[junit4] 2> 1480489 INFO (SUITE-HdfsAutoAddReplicasIntegrationTest-seed#[CF3F1BCCCFED791E]-worker) [ ] o.e.j.s.h.ContextHandler Started o.e.j.s.ServletContextHandler@42aa5ed6{static,/static,jar:file:/x1/jenkins/.ivy2/cache/org.apache.hadoop/hadoop-hdfs/tests/hadoop-hdfs-3.2.0-tests.jar!/webapps/static,AVAILABLE}
[junit4] 2> 1480660 INFO (SUITE-HdfsAutoAddReplicasIntegrationTest-seed#[CF3F1BCCCFED791E]-worker) [ ] o.e.j.s.h.ContextHandler Started o.e.j.w.WebAppContext@36c1eab7{hdfs,/,file:///x1/jenkins/jenkins-slave/workspace/Lucene-Solr-NightlyTests-master/checkout/solr/build/solr-core/test/J1/temp/jetty-localhost-35745-hdfs-_-any-1866207326121168462.dir/webapp/,AVAILABLE}{/hdfs}
[junit4] 2> 1480661 INFO (SUITE-HdfsAutoAddReplicasIntegrationTest-seed#[CF3F1BCCCFED791E]-worker) [ ] o.e.j.s.AbstractConnector Started ServerConnector@652772de{HTTP/1.1,[http/1.1]}{localhost:35745}
[junit4] 2> 1480661 INFO (SUITE-HdfsAutoAddReplicasIntegrationTest-seed#[CF3F1BCCCFED791E]-worker) [ ] o.e.j.s.Server Started @1480726ms
[junit4] 2> 1480748 WARN (SUITE-HdfsAutoAddReplicasIntegrationTest-seed#[CF3F1BCCCFED791E]-worker) [ ] o.a.h.h.s.c.MetricsLoggerTask Metrics logging will not be async since the logger is not log4j
[junit4] 2> 1480775 WARN (SUITE-HdfsAutoAddReplicasIntegrationTest-seed#[CF3F1BCCCFED791E]-worker) [ ] o.a.h.h.HttpRequestLog Jetty request log can only be enabled using Log4j
[junit4] 2> 1480777 INFO (SUITE-HdfsAutoAddReplicasIntegrationTest-seed#[CF3F1BCCCFED791E]-worker) [ ] o.e.j.s.Server jetty-9.4.14.v20181114; built: 2018-11-14T21:20:31.478Z; git: c4550056e785fb5665914545889f21dc136ad9e6; jvm 1.8.0_191-b12
[junit4] 2> 1480806 INFO (SUITE-HdfsAutoAddReplicasIntegrationTest-seed#[CF3F1BCCCFED791E]-worker) [ ] o.e.j.s.session DefaultSessionIdManager workerName=node0
[junit4] 2> 1480806 INFO (SUITE-HdfsAutoAddReplicasIntegrationTest-seed#[CF3F1BCCCFED791E]-worker) [ ] o.e.j.s.session No SessionScavenger set, using defaults
[junit4] 2> 1480806 INFO (SUITE-HdfsAutoAddReplicasIntegrationTest-seed#[CF3F1BCCCFED791E]-worker) [ ] o.e.j.s.session node0 Scavenging every 600000ms
[junit4] 2> 1480807 INFO (SUITE-HdfsAutoAddReplicasIntegrationTest-seed#[CF3F1BCCCFED791E]-worker) [ ] o.e.j.s.h.ContextHandler Started o.e.j.s.ServletContextHandler@2961a434{static,/static,jar:file:/x1/jenkins/.ivy2/cache/org.apache.hadoop/hadoop-hdfs/tests/hadoop-hdfs-3.2.0-tests.jar!/webapps/static,AVAILABLE}
[junit4] 2> 1480967 INFO (SUITE-HdfsAutoAddReplicasIntegrationTest-seed#[CF3F1BCCCFED791E]-worker) [ ] o.e.j.s.h.ContextHandler Started o.e.j.w.WebAppContext@2f4336d5{datanode,/,file:///x1/jenkins/jenkins-slave/workspace/Lucene-Solr-NightlyTests-master/checkout/solr/build/solr-core/test/J1/temp/jetty-localhost-43097-datanode-_-any-6556261480771286549.dir/webapp/,AVAILABLE}{/datanode}
[junit4] 2> 1480967 INFO (SUITE-HdfsAutoAddReplicasIntegrationTest-seed#[CF3F1BCCCFED791E]-worker) [ ] o.e.j.s.AbstractConnector Started ServerConnector@38342fd8{HTTP/1.1,[http/1.1]}{localhost:43097}
[junit4] 2> 1480968 INFO (SUITE-HdfsAutoAddReplicasIntegrationTest-seed#[CF3F1BCCCFED791E]-worker) [ ] o.e.j.s.Server Started @1481032ms
[junit4] 2> 1480993 WARN (SUITE-HdfsAutoAddReplicasIntegrationTest-seed#[CF3F1BCCCFED791E]-worker) [ ] o.a.h.h.s.c.MetricsLoggerTask Metrics logging will not be async since the logger is not log4j
[junit4] 2> 1481176 INFO (Block report processor) [ ] BlockStateChange BLOCK* processReport 0xd0105b29d9ca3add: Processing first storage report for DS-9176bff1-60de-45bf-9997-71a373899d97 from datanode f65e4a1a-09e2-4539-92ac-6fbc63d6a7ca
[junit4] 2> 1481177 INFO (Block report processor) [ ] BlockStateChange BLOCK* processReport 0xd0105b29d9ca3add: from storage DS-9176bff1-60de-45bf-9997-71a373899d97 node DatanodeRegistration(127.0.0.1:35509, datanodeUuid=f65e4a1a-09e2-4539-92ac-6fbc63d6a7ca, infoPort=44532, infoSecurePort=0, ipcPort=33207, storageInfo=lv=-57;cid=testClusterID;nsid=623683330;c=1552835773688), blocks: 0, hasStaleStorage: true, processing time: 1 msecs, invalidatedBlocks: 0
[junit4] 2> 1481177 INFO (Block report processor) [ ] BlockStateChange BLOCK* processReport 0xd0105b29d9ca3add: Processing first storage report for DS-59050934-6981-49ee-bbc9-2d1c1e3b3cee from datanode f65e4a1a-09e2-4539-92ac-6fbc63d6a7ca
[junit4] 2> 1481177 INFO (Block report processor) [ ] BlockStateChange BLOCK* processReport 0xd0105b29d9ca3add: from storage DS-59050934-6981-49ee-bbc9-2d1c1e3b3cee node DatanodeRegistration(127.0.0.1:35509, datanodeUuid=f65e4a1a-09e2-4539-92ac-6fbc63d6a7ca, infoPort=44532, infoSecurePort=0, ipcPort=33207, storageInfo=lv=-57;cid=testClusterID;nsid=623683330;c=1552835773688), blocks: 0, hasStaleStorage: false, processing time: 0 msecs, invalidatedBlocks: 0
[junit4] 2> 1481287 INFO (TEST-HdfsAutoAddReplicasIntegrationTest.testSimple-seed#[CF3F1BCCCFED791E]) [ ] o.a.s.SolrTestCaseJ4 ###Starting testSimple
[junit4] 2> 1481288 INFO (TEST-HdfsAutoAddReplicasIntegrationTest.testSimple-seed#[CF3F1BCCCFED791E]) [ ] o.a.s.c.MiniSolrCloudCluster Starting cluster of 3 servers in /x1/jenkins/jenkins-slave/workspace/Lucene-Solr-NightlyTests-master/checkout/solr/build/solr-core/test/J1/temp/solr.cloud.autoscaling.HdfsAutoAddReplicasIntegrationTest_CF3F1BCCCFED791E-001/tempDir-002
[junit4] 2> 1481289 INFO (TEST-HdfsAutoAddReplicasIntegrationTest.testSimple-seed#[CF3F1BCCCFED791E]) [ ] o.a.s.c.ZkTestServer STARTING ZK TEST SERVER
[junit4] 2> 1481298 INFO (ZkTestServer Run Thread) [ ] o.a.s.c.ZkTestServer client port:0.0.0.0/0.0.0.0:0
[junit4] 2> 1481298 INFO (ZkTestServer Run Thread) [ ] o.a.s.c.ZkTestServer Starting server
[junit4] 2> 1481398 INFO (TEST-HdfsAutoAddReplicasIntegrationTest.testSimple-seed#[CF3F1BCCCFED791E]) [ ] o.a.s.c.ZkTestServer start zk server on port:33706
[junit4] 2> 1481398 INFO (TEST-HdfsAutoAddReplicasIntegrationTest.testSimple-seed#[CF3F1BCCCFED791E]) [ ] o.a.s.c.ZkTestServer parse host and port list: 127.0.0.1:33706
[junit4] 2> 1481398 INFO (TEST-HdfsAutoAddReplicasIntegrationTest.testSimple-seed#[CF3F1BCCCFED791E]) [ ] o.a.s.c.ZkTestServer connecting to 127.0.0.1 33706
[junit4] 2> 1481404 INFO (zkConnectionManagerCallback-6580-thread-1) [ ] o.a.s.c.c.ConnectionManager zkClient has connected
[junit4] 2> 1481425 INFO (zkConnectionManagerCallback-6582-thread-1) [ ] o.a.s.c.c.ConnectionManager zkClient has connected
[junit4] 2> 1481427 INFO (zkConnectionManagerCallback-6584-thread-1) [ ] o.a.s.c.c.ConnectionManager zkClient has connected
[junit4] 2> 1481431 WARN (jetty-launcher-6585-thread-2) [ ] o.e.j.s.AbstractConnector Ignoring deprecated socket close linger time
[junit4] 2> 1481431 WARN (jetty-launcher-6585-thread-1) [ ] o.e.j.s.AbstractConnector Ignoring deprecated socket close linger time
[junit4] 2> 1481431 INFO (jetty-launcher-6585-thread-2) [ ] o.a.s.c.s.e.JettySolrRunner Start Jetty (original configured port=0)
[junit4] 2> 1481431 INFO (jetty-launcher-6585-thread-1) [ ] o.a.s.c.s.e.JettySolrRunner Start Jetty (original configured port=0)
[junit4] 2> 1481431 INFO (jetty-launcher-6585-thread-2) [ ] o.a.s.c.s.e.JettySolrRunner Trying to start Jetty on port 0 try number 1 ...
[junit4] 2> 1481431 INFO (jetty-launcher-6585-thread-2) [ ] o.e.j.s.Server jetty-9.4.14.v20181114; built: 2018-11-14T21:20:31.478Z; git: c4550056e785fb5665914545889f21dc136ad9e6; jvm 1.8.0_191-b12
[junit4] 2> 1481433 WARN (jetty-launcher-6585-thread-3) [ ] o.e.j.s.AbstractConnector Ignoring deprecated socket close linger time
[junit4] 2> 1481433 INFO (jetty-launcher-6585-thread-3) [ ] o.a.s.c.s.e.JettySolrRunner Start Jetty (original configured port=0)
[junit4] 2> 1481433 INFO (jetty-launcher-6585-thread-3) [ ] o.a.s.c.s.e.JettySolrRunner Trying to start Jetty on port 0 try number 1 ...
[junit4] 2> 1481433 INFO (jetty-launcher-6585-thread-3) [ ] o.e.j.s.Server jetty-9.4.14.v20181114; built: 2018-11-14T21:20:31.478Z; git: c4550056e785fb5665914545889f21dc136ad9e6; jvm 1.8.0_191-b12
[junit4] 2> 1481434 INFO (jetty-launcher-6585-thread-2) [ ] o.e.j.s.session DefaultSessionIdManager workerName=node0
[junit4] 2> 1481434 INFO (jetty-launcher-6585-thread-2) [ ] o.e.j.s.session No SessionScavenger set, using defaults
[junit4] 2> 1481434 INFO (jetty-launcher-6585-thread-2) [ ] o.e.j.s.session node0 Scavenging every 600000ms
[junit4] 2> 1481434 INFO (jetty-launcher-6585-thread-2) [ ] o.e.j.s.h.ContextHandler Started o.e.j.s.ServletContextHandler@482e7010{/solr,null,AVAILABLE}
[junit4] 2> 1481435 WARN (jetty-launcher-6585-thread-2) [ ] o.e.j.u.s.S.config No Client EndPointIdentificationAlgorithm configured for SslContextFactory@72e394d1[provider=null,keyStore=null,trustStore=null]
[junit4] 2> 1481437 INFO (jetty-launcher-6585-thread-1) [ ] o.a.s.c.s.e.JettySolrRunner Trying to start Jetty on port 0 try number 1 ...
[junit4] 2> 1481437 INFO (jetty-launcher-6585-thread-1) [ ] o.e.j.s.Server jetty-9.4.14.v20181114; built: 2018-11-14T21:20:31.478Z; git: c4550056e785fb5665914545889f21dc136ad9e6; jvm 1.8.0_191-b12
[junit4] 2> 1481438 INFO (jetty-launcher-6585-thread-3) [ ] o.e.j.s.session DefaultSessionIdManager workerName=node0
[junit4] 2> 1481438 INFO (jetty-launcher-6585-thread-3) [ ] o.e.j.s.session No SessionScavenger set, using defaults
[junit4] 2> 1481438 INFO (jetty-launcher-6585-thread-3) [ ] o.e.j.s.session node0 Scavenging every 600000ms
[junit4] 2> 1481439 INFO (jetty-launcher-6585-thread-3) [ ] o.e.j.s.h.ContextHandler Started o.e.j.s.ServletContextHandler@2c571d8b{/solr,null,AVAILABLE}
[junit4] 2> 1481439 WARN (jetty-launcher-6585-thread-3) [ ] o.e.j.u.s.S.config No Client EndPointIdentificationAlgorithm configured for SslContextFactory@679a7048[provider=null,keyStore=null,trustStore=null]
[junit4] 2> 1481441 INFO (jetty-launcher-6585-thread-1) [ ] o.e.j.s.session DefaultSessionIdManager workerName=node0
[junit4] 2> 1481441 INFO (jetty-launcher-6585-thread-1) [ ] o.e.j.s.session No SessionScavenger set, using defaults
[junit4] 2> 1481441 INFO (jetty-launcher-6585-thread-1) [ ] o.e.j.s.session node0 Scavenging every 660000ms
[junit4] 2> 1481441 INFO (jetty-launcher-6585-thread-2) [ ] o.e.j.s.AbstractConnector Started ServerConnector@61408928{SSL,[ssl, http/1.1]}{127.0.0.1:42064}
[junit4] 2> 1481441 INFO (jetty-launcher-6585-thread-2) [ ] o.e.j.s.Server Started @1481505ms
[junit4] 2> 1481441 INFO (jetty-launcher-6585-thread-2) [ ] o.a.s.c.s.e.JettySolrRunner Jetty properties: {hostContext=/solr, hostPort=42064}
[junit4] 2> 1481441 INFO (jetty-launcher-6585-thread-1) [ ] o.e.j.s.h.ContextHandler Started o.e.j.s.ServletContextHandler@5aa49a3b{/solr,null,AVAILABLE}
[junit4] 2> 1481441 ERROR (jetty-launcher-6585-thread-2) [ ] o.a.s.u.StartupLoggingUtils Missing Java Option solr.log.dir. Logging may be missing or incomplete.
[junit4] 2> 1481441 INFO (jetty-launcher-6585-thread-2) [ ] o.a.s.s.SolrDispatchFilter Using logger factory org.apache.logging.slf4j.Log4jLoggerFactory
[junit4] 2> 1481441 INFO (jetty-launcher-6585-thread-2) [ ] o.a.s.s.SolrDispatchFilter ___ _ Welcome to Apache Solrâ„¢ version 9.0.0
[junit4] 2> 1481441 INFO (jetty-launcher-6585-thread-2) [ ] o.a.s.s.SolrDispatchFilter / __| ___| |_ _ Starting in cloud mode on port null
[junit4] 2> 1481441 INFO (jetty-launcher-6585-thread-2) [ ] o.a.s.s.SolrDispatchFilter \__ \/ _ \ | '_| Install dir: null
[junit4] 2> 1481441 INFO (jetty-launcher-6585-thread-2) [ ] o.a.s.s.SolrDispatchFilter |___/\___/_|_| Start time: 2019-03-17T15:16:14.688Z
[junit4] 2> 1481442 WARN (jetty-launcher-6585-thread-1) [ ] o.e.j.u.s.S.config No Client EndPointIdentificationAlgorithm configured for SslContextFactory@11ffe73[provider=null,keyStore=null,trustStore=null]
[junit4] 2> 1481442 INFO (jetty-launcher-6585-thread-1) [ ] o.e.j.s.AbstractConnector Started ServerConnector@664d7d84{SSL,[ssl, http/1.1]}{127.0.0.1:45615}
[junit4] 2> 1481442 INFO (jetty-launcher-6585-thread-1) [ ] o.e.j.s.Server Started @1481506ms
[junit4] 2> 1481442 INFO (jetty-launcher-6585-thread-1) [ ] o.a.s.c.s.e.JettySolrRunner Jetty properties: {hostContext=/solr, hostPort=45615}
[junit4] 2> 1481442 ERROR (jetty-launcher-6585-thread-1) [ ] o.a.s.u.StartupLoggingUtils Missing Java Option solr.log.dir. Logging may be missing or incomplete.
[junit4] 2> 1481442 INFO (jetty-launcher-6585-thread-1) [ ] o.a.s.s.SolrDispatchFilter Using logger factory org.apache.logging.slf4j.Log4jLoggerFactory
[junit4] 2> 1481442 INFO (jetty-launcher-6585-thread-1) [ ] o.a.s.s.SolrDispatchFilter ___ _ Welcome to Apache Solrâ„¢ version 9.0.0
[junit4] 2> 1481442 INFO (jetty-launcher-6585-thread-1) [ ] o.a.s.s.SolrDispatchFilter / __| ___| |_ _ Starting in cloud mode on port null
[junit4] 2> 1481442 INFO (jetty-launcher-6585-thread-1) [ ] o.a.s.s.SolrDispatchFilter \__ \/ _ \ | '_| Install dir: null
[junit4] 2> 1481442 INFO (jetty-launcher-6585-thread-1) [ ] o.a.s.s.SolrDispatchFilter |___/\___/_|_| Start time: 2019-03-17T15:16:14.689Z
[junit4] 2> 1481445 INFO (jetty-launcher-6585-thread-3) [ ] o.e.j.s.AbstractConnector Started ServerConnector@46d31a2d{SSL,[ssl, http/1.1]}{127.0.0.1:41738}
[junit4] 2> 1481445 INFO (jetty-launcher-6585-thread-3) [ ] o.e.j.s.Server Started @1481510ms
[junit4] 2> 1481445 INFO (jetty-launcher-6585-thread-3) [ ] o.a.s.c.s.e.JettySolrRunner Jetty properties: {hostContext=/solr, hostPort=41738}
[junit4] 2> 1481445 ERROR (jetty-launcher-6585-thread-3) [ ] o.a.s.u.StartupLoggingUtils Missing Java Option solr.log.dir. Logging may be missing or incomplete.
[junit4] 2> 1481445 INFO (jetty-launcher-6585-thread-3) [ ] o.a.s.s.SolrDispatchFilter Using logger factory org.apache.logging.slf4j.Log4jLoggerFactory
[junit4] 2> 1481445 INFO (jetty-launcher-6585-thread-3) [ ] o.a.s.s.SolrDispatchFilter ___ _ Welcome to Apache Solrâ„¢ version 9.0.0
[junit4] 2> 1481445 INFO (jetty-launcher-6585-thread-3) [ ] o.a.s.s.SolrDispatchFilter / __| ___| |_ _ Starting in cloud mode on port null
[junit4] 2> 1481445 INFO (jetty-launcher-6585-thread-3) [ ] o.a.s.s.SolrDispatchFilter \__ \/ _ \ | '_| Install dir: null
[junit4] 2> 1481445 INFO (jetty-launcher-6585-thread-3) [ ] o.a.s.s.SolrDispatchFilter |___/\___/_|_| Start time: 2019-03-17T15:16:14.692Z
[junit4] 2> 1481456 INFO (zkConnectionManagerCallback-6587-thread-1) [ ] o.a.s.c.c.ConnectionManager zkClient has connected
[junit4] 2> 1481457 INFO (jetty-launcher-6585-thread-2) [ ] o.a.s.s.SolrDispatchFilter solr.xml found in ZooKeeper. Loading...
[junit4] 2> 1481468 INFO (jetty-launcher-6585-thread-2) [ ] o.a.s.c.SolrXmlConfig Configuration parameter autoReplicaFailoverWorkLoopDelay is ignored
[junit4] 2> 1481468 INFO (jetty-launcher-6585-thread-2) [ ] o.a.s.c.SolrXmlConfig Configuration parameter autoReplicaFailoverBadNodeExpiration is ignored
[junit4] 2> 1481470 INFO (jetty-launcher-6585-thread-2) [ ] o.a.s.c.SolrXmlConfig MBean server found: com.sun.jmx.mbeanserver.JmxMBeanServer@1c4542d1, but no JMX reporters were configured - adding default JMX reporter.
[junit4] 2> 1481476 INFO (zkConnectionManagerCallback-6591-thread-1) [ ] o.a.s.c.c.ConnectionManager zkClient has connected
[junit4] 2> 1481476 INFO (jetty-launcher-6585-thread-3) [ ] o.a.s.s.SolrDispatchFilter solr.xml found in ZooKeeper. Loading...
[junit4] 2> 1481480 INFO (jetty-launcher-6585-thread-3) [ ] o.a.s.c.SolrXmlConfig Configuration parameter autoReplicaFailoverWorkLoopDelay is ignored
[junit4] 2> 1481481 INFO (jetty-launcher-6585-thread-3) [ ] o.a.s.c.SolrXmlConfig Configuration parameter autoReplicaFailoverBadNodeExpiration is ignored
[junit4] 2> 1481482 INFO (zkConnectionManagerCallback-6589-thread-1) [ ] o.a.s.c.c.ConnectionManager zkClient has connected
[junit4] 2> 1481483 INFO (jetty-launcher-6585-thread-1) [ ] o.a.s.s.SolrDispatchFilter solr.xml found in ZooKeeper. Loading...
[junit4] 2> 1481491 INFO (jetty-launcher-6585-thread-1) [ ] o.a.s.c.SolrXmlConfig Configuration parameter autoReplicaFailoverWorkLoopDelay is ignored
[junit4] 2> 1481491 INFO (jetty-launcher-6585-thread-1) [ ] o.a.s.c.SolrXmlConfig Configuration parameter autoReplicaFailoverBadNodeExpiration is ignored
[junit4] 2> 1481493 INFO (jetty-launcher-6585-thread-1) [ ] o.a.s.c.SolrXmlConfig MBean server found: com.sun.jmx.mbeanserver.JmxMBeanServer@1c4542d1, but no JMX reporters were configured - adding default JMX reporter.
[junit4] 2> 1481494 INFO (jetty-launcher-6585-thread-3) [ ] o.a.s.c.SolrXmlConfig MBean server found: com.sun.jmx.mbeanserver.JmxMBeanServer@1c4542d1, but no JMX reporters were configured - adding default JMX reporter.
[junit4] 2> 1481554 INFO (jetty-launcher-6585-thread-2) [ ] o.a.s.h.c.HttpShardHandlerFactory Host whitelist initialized: WhitelistHostChecker [whitelistHosts=null, whitelistHostCheckingEnabled=true]
[junit4] 2> 1481554 WARN (jetty-launcher-6585-thread-2) [ ] o.a.s.c.s.i.Http2SolrClient Create Http2SolrClient with HTTP/1.1 transport since Java 8 or lower versions does not support SSL + HTTP/2
[junit4] 2> 1481555 WARN (jetty-launcher-6585-thread-2) [ ] o.e.j.u.s.S.config No Client EndPointIdentificationAlgorithm configured for SslContextFactory@7381a014[provider=null,keyStore=null,trustStore=null]
[junit4] 2> 1481560 WARN (jetty-launcher-6585-thread-2) [ ] o.a.s.c.s.i.Http2SolrClient Create Http2SolrClient with HTTP/1.1 transport since Java 8 or lower versions does not support SSL + HTTP/2
[junit4] 2> 1481561 WARN (jetty-launcher-6585-thread-2) [ ] o.e.j.u.s.S.config No Client EndPointIdentificationAlgorithm configured for SslContextFactory@a06919c[provider=null,keyStore=null,trustStore=null]
[junit4] 2> 1481562 INFO (jetty-launcher-6585-thread-2) [ ] o.a.s.c.ZkContainer Zookeeper client=127.0.0.1:33706/solr
[junit4] 2> 1481584 INFO (zkConnectionManagerCallback-6600-thread-1) [ ] o.a.s.c.c.ConnectionManager zkClient has connected
[junit4] 2> 1481611 INFO (zkConnectionManagerCallback-6602-thread-1) [ ] o.a.s.c.c.ConnectionManager zkClient has connected
[junit4] 2> 1481644 INFO (jetty-launcher-6585-thread-1) [ ] o.a.s.h.c.HttpShardHandlerFactory Host whitelist initialized: WhitelistHostChecker [whitelistHosts=null, whitelistHostCheckingEnabled=true]
[junit4] 2> 1481645 WARN (jetty-launcher-6585-thread-1) [ ] o.a.s.c.s.i.Http2SolrClient Create Http2SolrClient with HTTP/1.1 transport since Java 8 or lower versions does not support SSL + HTTP/2
[junit4] 2> 1481662 WARN (jetty-launcher-6585-thread-1) [ ] o.e.j.u.s.S.config No Client EndPointIdentificationAlgorithm configured for SslContextFactory@4221c39a[provider=null,keyStore=null,trustStore=null]
[junit4] 2> 1481669 WARN (jetty-launcher-6585-thread-1) [ ] o.a.s.c.s.i.Http2SolrClient Create Http2SolrClient with HTTP/1.1 transport since Java 8 or lower versions does not support SSL + HTTP/2
[junit4] 2> 1481669 WARN (jetty-launcher-6585-thread-1) [ ] o.e.j.u.s.S.config No Client EndPointIdentificationAlgorithm configured for SslContextFactory@6cf6b13d[provider=null,keyStore=null,trustStore=null]
[junit4] 2> 1481671 INFO (jetty-launcher-6585-thread-1) [ ] o.a.s.c.ZkContainer Zookeeper client=127.0.0.1:33706/solr
[junit4] 2> 1481676 INFO (zkConnectionManagerCallback-6610-thread-1) [ ] o.a.s.c.c.ConnectionManager zkClient has connected
[junit4] 2> 1481677 INFO (jetty-launcher-6585-thread-3) [ ] o.a.s.h.c.HttpShardHandlerFactory Host whitelist initialized: WhitelistHostChecker [whitelistHosts=null, whitelistHostCheckingEnabled=true]
[junit4] 2> 1481678 WARN (jetty-launcher-6585-thread-3) [ ] o.a.s.c.s.i.Http2SolrClient Create Http2SolrClient with HTTP/1.1 transport since Java 8 or lower versions does not support SSL + HTTP/2
[junit4] 2> 1481706 WARN (jetty-launcher-6585-thread-3) [ ] o.e.j.u.s.S.config No Client EndPointIdentificationAlgorithm configured for SslContextFactory@434a9537[provider=null,keyStore=null,trustStore=null]
[junit4] 2> 1481709 WARN (jetty-launcher-6585-thread-3) [ ] o.a.s.c.s.i.Http2SolrClient Create Http2SolrClient with HTTP/1.1 transport since Java 8 or lower versions does not support SSL + HTTP/2
[junit4] 2> 1481710 INFO (zkConnectionManagerCallback-6613-thread-1) [ ] o.a.s.c.c.ConnectionManager zkClient has connected
[junit4] 2> 1481711 WARN (jetty-launcher-6585-thread-3) [ ] o.e.j.u.s.S.config No Client EndPointIdentificationAlgorithm configured for SslContextFactory@62b38970[provider=null,keyStore=null,trustStore=null]
[junit4] 2> 1481713 INFO (jetty-launcher-6585-thread-3) [ ] o.a.s.c.ZkContainer Zookeeper client=127.0.0.1:33706/solr
[junit4] 2> 1481716 INFO (zkConnectionManagerCallback-6620-thread-1) [ ] o.a.s.c.c.ConnectionManager zkClient has connected
[junit4] 2> 1481725 INFO (jetty-launcher-6585-thread-1) [n:127.0.0.1:45615_solr ] o.a.s.c.OverseerElectionContext I am going to be the leader 127.0.0.1:45615_solr
[junit4] 2> 1481727 INFO (jetty-launcher-6585-thread-1) [n:127.0.0.1:45615_solr ] o.a.s.c.Overseer Overseer (id=72973166701969417-127.0.0.1:45615_solr-n_0000000000) starting
[junit4] 2> 1481732 INFO (zkConnectionManagerCallback-6622-thread-1) [ ] o.a.s.c.c.ConnectionManager zkClient has connected
[junit4] 2> 1481741 INFO (jetty-launcher-6585-thread-2) [n:127.0.0.1:42064_solr ] o.a.s.c.ZkController Register node as live in ZooKeeper:/live_nodes/127.0.0.1:42064_solr
[junit4] 2> 1481760 INFO (zkCallback-6601-thread-1) [ ] o.a.s.c.c.ZkStateReader Updated live nodes from ZooKeeper... (0) -> (1)
[junit4] 2> 1481761 INFO (jetty-launcher-6585-thread-3) [n:127.0.0.1:41738_solr ] o.a.s.c.ZkController Publish node=127.0.0.1:41738_solr as DOWN
[junit4] 2> 1481762 INFO (zkConnectionManagerCallback-6629-thread-1) [ ] o.a.s.c.c.ConnectionManager zkClient has connected
[junit4] 2> 1481762 INFO (jetty-launcher-6585-thread-3) [n:127.0.0.1:41738_solr ] o.a.s.c.TransientSolrCoreCacheDefault Allocating transient cache for 4 transient cores
[junit4] 2> 1481762 INFO (jetty-launcher-6585-thread-3) [n:127.0.0.1:41738_solr ] o.a.s.c.ZkController Register node as live in ZooKeeper:/live_nodes/127.0.0.1:41738_solr
[junit4] 2> 1481764 INFO (jetty-launcher-6585-thread-1) [n:127.0.0.1:45615_solr ] o.a.s.c.c.ZkStateReader Updated live nodes from ZooKeeper... (0) -> (2)
[junit4] 2> 1481770 INFO (jetty-launcher-6585-thread-1) [n:127.0.0.1:45615_solr ] o.a.s.c.s.i.ZkClientClusterStateProvider Cluster at 127.0.0.1:33706/solr ready
[junit4] 2> 1481771 INFO (zkCallback-6612-thread-1) [ ] o.a.s.c.c.ZkStateReader Updated live nodes from ZooKeeper... (0) -> (2)
[junit4] 2> 1481772 INFO (OverseerStateUpdate-72973166701969417-127.0.0.1:45615_solr-n_0000000000) [n:127.0.0.1:45615_solr ] o.a.s.c.Overseer Starting to work on the main queue : 127.0.0.1:45615_solr
[junit4] 2> 1481773 INFO (zkCallback-6601-thread-1) [ ] o.a.s.c.c.ZkStateReader Updated live nodes from ZooKeeper... (1) -> (2)
[junit4] 2> 1481773 INFO (jetty-launcher-6585-thread-1) [n:127.0.0.1:45615_solr ] o.a.s.c.ZkController Publish node=127.0.0.1:45615_solr as DOWN
[junit4] 2> 1481776 INFO (jetty-launcher-6585-thread-1) [n:127.0.0.1:45615_solr ] o.a.s.c.TransientSolrCoreCacheDefault Allocating transient cache for 4 transient cores
[junit4] 2> 1481776 INFO (jetty-launcher-6585-thread-1) [n:127.0.0.1:45615_solr ] o.a.s.c.ZkController Register node as live in ZooKeeper:/live_nodes/127.0.0.1:45615_solr
[junit4] 2> 1481778 INFO (zkCallback-6621-thread-1) [ ] o.a.s.c.c.ZkStateReader Updated live nodes from ZooKeeper... (0) -> (3)
[junit4] 2> 1481778 INFO (zkCallback-6601-thread-1) [ ] o.a.s.c.c.ZkStateReader Updated live nodes from ZooKeeper... (2) -> (3)
[junit4] 2> 1481779 INFO (zkCallback-6612-thread-1) [ ] o.a.s.c.c.ZkStateReader Updated live nodes from ZooKeeper... (2) -> (3)
[junit4] 2> 1481780 INFO (zkCallback-6628-thread-1) [ ] o.a.s.c.c.ZkStateReader Updated live nodes from ZooKeeper... (2) -> (3)
[junit4] 2> 1481782 INFO (zkConnectionManagerCallback-6634-thread-1) [ ] o.a.s.c.c.ConnectionManager zkClient has connected
[junit4] 2> 1481790 INFO (jetty-launcher-6585-thread-2) [n:127.0.0.1:42064_solr ] o.a.s.c.c.ZkStateReader Updated live nodes from ZooKeeper... (0) -> (3)
[junit4] 2> 1481793 INFO (jetty-launcher-6585-thread-2) [n:127.0.0.1:42064_solr ] o.a.s.c.s.i.ZkClientClusterStateProvider Cluster at 127.0.0.1:33706/solr ready
[junit4] 2> 1481794 INFO (jetty-launcher-6585-thread-2) [n:127.0.0.1:42064_solr ] o.a.s.h.a.MetricsHistoryHandler No .system collection, keeping metrics history in memory.
[junit4] 2> 1481822 INFO (jetty-launcher-6585-thread-1) [n:127.0.0.1:45615_solr ] o.a.s.h.a.MetricsHistoryHandler No .system collection, keeping metrics history in memory.
[junit4] 2> 1481828 INFO (jetty-launcher-6585-thread-2) [n:127.0.0.1:42064_solr ] o.a.s.m.r.SolrJmxReporter JMX monitoring for 'solr.node' (registry 'solr.node') enabled at server: com.sun.jmx.mbeanserver.JmxMBeanServer@1c4542d1
[junit4] 2> 1481828 INFO (zkConnectionManagerCallback-6640-thread-1) [ ] o.a.s.c.c.ConnectionManager zkClient has connected
[junit4] 2> 1481830 INFO (jetty-launcher-6585-thread-3) [n:127.0.0.1:41738_solr ] o.a.s.c.c.ZkStateReader Updated live nodes from ZooKeeper... (0) -> (3)
[junit4] 2> 1481831 INFO (jetty-launcher-6585-thread-3) [n:127.0.0.1:41738_solr ] o.a.s.c.s.i.ZkClientClusterStateProvider Cluster at 127.0.0.1:33706/solr ready
[junit4] 2> 1481832 INFO (jetty-launcher-6585-thread-3) [n:127.0.0.1:41738_solr ] o.a.s.h.a.MetricsHistoryHandler No .system collection, keeping metrics history in memory.
[junit4] 2> 1481844 INFO (jetty-launcher-6585-thread-2) [n:127.0.0.1:42064_solr ] o.a.s.m.r.SolrJmxReporter JMX monitoring for 'solr.jvm' (registry 'solr.jvm') enabled at server: com.sun.jmx.mbeanserver.JmxMBeanServer@1c4542d1
[junit4] 2> 1481844 INFO (jetty-launcher-6585-thread-2) [n:127.0.0.1:42064_solr ] o.a.s.m.r.SolrJmxReporter JMX monitoring for 'solr.jetty' (registry 'solr.jetty') enabled at server: com.sun.jmx.mbeanserver.JmxMBeanServer@1c4542d1
[junit4] 2> 1481846 INFO (jetty-launcher-6585-thread-2) [n:127.0.0.1:42064_solr ] o.a.s.c.CorePropertiesLocator Found 0 core definitions underneath /x1/jenkins/jenkins-slave/workspace/Lucene-Solr-NightlyTests-master/checkout/solr/build/solr-core/test/J1/temp/solr.cloud.autoscaling.HdfsAutoAddReplicasIntegrationTest_CF3F1BCCCFED791E-001/tempDir-002/node2/.
[junit4] 2> 1481867 INFO (jetty-launcher-6585-thread-1) [n:127.0.0.1:45615_solr ] o.a.s.m.r.SolrJmxReporter JMX monitoring for 'solr.node' (registry 'solr.node') enabled at server: com.sun.jmx.mbeanserver.JmxMBeanServer@1c4542d1
[junit4] 2> 1481876 INFO (jetty-launcher-6585-thread-3) [n:127.0.0.1:41738_solr ] o.a.s.m.r.SolrJmxReporter JMX monitoring for 'solr.node' (registry 'solr.node') enabled at server: com.sun.jmx.mbeanserver.JmxMBeanServer@1c4542d1
[junit4] 2> 1481883 INFO (jetty-launcher-6585-thread-1) [n:127.0.0.1:45615_solr ] o.a.s.m.r.SolrJmxReporter JMX monitoring for 'solr.jvm' (registry 'solr.jvm') enabled at server: com.sun.jmx.mbeanserver.JmxMBeanServer@1c4542d1
[junit4] 2> 1481884 WARN (jetty-launcher-6585-thread-3) [n:127.0.0.1:41738_solr ] o.a.s.m.r.j.JmxMetricsReporter Unable to register gauge
[junit4] 2> => javax.management.InstanceNotFoundException: solr:dom1=jvm,name0=memory,name1=total,name=committed
[junit4] 2> at com.sun.jmx.interceptor.DefaultMBeanServerInterceptor.getMBean(DefaultMBeanServerInterceptor.java:1095)
[junit4] 2> javax.management.InstanceNotFoundException: solr:dom1=jvm,name0=memory,name1=total,name=committed
[junit4] 2> at com.sun.jmx.interceptor.DefaultMBeanServerInterceptor.getMBean(DefaultMBeanServerInterceptor.java:1095) ~[?:1.8.0_191]
[junit4] 2> at com.sun.jmx.interceptor.DefaultMBeanServerInterceptor.exclusiveUnregisterMBean(DefaultMBeanServerInterceptor.java:427) ~[?:1.8.0_191]
[junit4] 2> at com.sun.jmx.interceptor.DefaultMBeanServerInterceptor.unregisterMBean(DefaultMBeanServerInterceptor.java:415) ~[?:1.8.0_191]
[junit4] 2> at com.sun.jmx.mbeanserver.JmxMBeanServer.unregisterMBean(JmxMBeanServer.java:546) ~[?:1.8.0_191]
[junit4] 2> at org.apache.solr.metrics.reporters.jmx.JmxMetricsReporter$JmxListener.registerMBean(JmxMetricsReporter.java:531) ~[java/:?]
[junit4] 2> at org.apache.solr.metrics.reporters.jmx.JmxMetricsReporter$JmxListener.onGaugeAdded(JmxMetricsReporter.java:569) ~[java/:?]
[junit4] 2> at com.codahale.metrics.MetricRegistry.notifyListenerOfAddedMetric(MetricRegistry.java:454) ~[metrics-core-3.2.6.jar:3.2.6]
[junit4] 2> at com.codahale.metrics.MetricRegistry.addListener(MetricRegistry.java:297) ~[metrics-core-3.2.6.jar:3.2.6]
[junit4] 2> at org.apache.solr.metrics.reporters.jmx.JmxMetricsReporter.start(JmxMetricsReporter.java:729) ~[java/:?]
[junit4] 2> at org.apache.solr.metrics.reporters.SolrJmxReporter.doInit(SolrJmxReporter.java:110) ~[java/:?]
[junit4] 2> at org.apache.solr.metrics.SolrMetricReporter.init(SolrMetricReporter.java:70) ~[java/:?]
[junit4] 2> at org.apache.solr.metrics.SolrMetricManager.loadReporter(SolrMetricManager.java:916) ~[java/:?]
[junit4] 2> at org.apache.solr.metrics.SolrMetricManager.loadReporters(SolrMetricManager.java:843) ~[java/:?]
[junit4] 2> at org.apache.solr.core.CoreContainer.load(CoreContainer.java:605) ~[java/:?]
[junit4] 2> at org.apache.solr.servlet.SolrDispatchFilter.createCoreContainer(SolrDispatchFilter.java:252) ~[java/:?]
[junit4] 2> at org.apache.solr.servlet.SolrDispatchFilter.init(SolrDispatchFilter.java:172) ~[java/:?]
[junit4] 2> at org.eclipse.jetty.servlet.FilterHolder.initialize(FilterHolder.java:136) ~[jetty-servlet-9.4.14.v20181114.jar:9.4.14.v20181114]
[junit4] 2> at org.eclipse.jetty.servlet.ServletHandler.lambda$initialize$0(ServletHandler.java:750) ~[jetty-servlet-9.4.14.v20181114.jar:9.4.14.v20181114]
[junit4] 2> at java.util.Spliterators$ArraySpliterator.forEachRemaining(Spliterators.java:948) ~[?:1.8.0_191]
[junit4] 2> at java.util.stream.Streams$ConcatSpliterator.forEachRemaining(Streams.java:742) ~[?:1.8.0_191]
[junit4] 2> at java.util.stream.Streams$ConcatSpliterator.forEachRemaining(Streams.java:742) ~[?:1.8.0_191]
[junit4] 2> at java.util.stream.ReferencePipeline$Head.forEach(ReferencePipeline.java:580) ~[?:1.8.0_191]
[junit4] 2> at org.eclipse.jetty.servlet.ServletHandler.initialize(ServletHandler.java:744) ~[jetty-servlet-9.4.14.v20181114.jar:9.4.14.v20181114]
[junit4] 2> at org.eclipse.jetty.servlet.ServletHandler.updateMappings(ServletHandler.java:1449) ~[jetty-servlet-9.4.14.v20181114.jar:9.4.14.v20181114]
[junit4] 2> at org.eclipse.jetty.servlet.ServletHandler.setFilterMappings(ServletHandler.java:1513) ~[jetty-servlet-9.4.14.v20181114.jar:9.4.14.v20181114]
[junit4] 2> at org.eclipse.jetty.servlet.ServletHandler.addFilterMapping(ServletHandler.java:1158) ~[jetty-servlet-9.4.14.v20181114.jar:9.4.14.v20181114]
[junit4] 2> at org.eclipse.jetty.servlet.ServletHandler.addFilterWithMapping(ServletHandler.java:995) ~[jetty-servlet-9.4.14.v20181114.jar:9.4.14.v20181114]
[junit4] 2> at org.eclipse.jetty.servlet.ServletContextHandler.addFilter(ServletContextHandler.java:467) ~[jetty-servlet-9.4.14.v20181114.jar:9.4.14.v20181114]
[junit4] 2> at org.apache.solr.client.solrj.embedded.JettySolrRunner$1.lifeCycleStarted(JettySolrRunner.java:384) ~[java/:?]
[junit4] 2> at org.eclipse.jetty.util.component.AbstractLifeCycle.setStarted(AbstractLifeCycle.java:179) ~[jetty-util-9.4.14.v20181114.jar:9.4.14.v20181114]
[junit4] 2> at org.eclipse.jetty.util.component.AbstractLifeCycle.start(AbstractLifeCycle.java:69) ~[jetty-util-9.4.14.v20181114.jar:9.4.14.v20181114]
[junit4] 2> at org.apache.solr.client.solrj.embedded.JettySolrRunner.retryOnPortBindFailure(JettySolrRunner.java:558) ~[java/:?]
[junit4] 2> at org.apache.solr.client.solrj.embedded.JettySolrRunner.start(JettySolrRunner.java:497) ~[java/:?]
[junit4] 2> at org.apache.solr.client.solrj.embedded.JettySolrRunner.start(JettySolrRunner.java:465) ~[java/:?]
[junit4] 2> at org.apache.solr.cloud.MiniSolrCloudCluster.startJettySolrRunner(MiniSolrCloudCluster.java:467) ~[java/:?]
[junit4] 2> at org.apache.solr.cloud.MiniSolrCloudCluster.lambda$new$0(MiniSolrCloudCluster.java:300) ~[java/:?]
[junit4] 2> at java.util.concurrent.FutureTask.run(FutureTask.java:266) ~[?:1.8.0_191]
[junit4] 2> at org.apache.solr.common.util.ExecutorUtil$MDCAwareThreadPoolExecutor.lambda$execute$0(ExecutorUtil.java:209) ~[java/:?]
[junit4] 2> at java.util.concurrent.ThreadPoolExecutor.runWorker(ThreadPoolExecutor.java:1149) ~[?:1.8.0_191]
[junit4] 2> at java.util.concurrent.ThreadPoolExecutor$Worker.run(ThreadPoolExecutor.java:624) ~[?:1.8.0_191]
[junit4] 2> at java.lang.Thread.run(Thread.java:748) [?:1.8.0_191]
[junit4] 2> 1481884 INFO (jetty-launcher-6585-thread-1) [n:127.0.0.1:45615_solr ] o.a.s.m.r.SolrJmxReporter JMX monitoring for 'solr.jetty' (registry 'solr.jetty') enabled at server: com.sun.jmx.mbeanserver.JmxMBeanServer@1c4542d1
[junit4] 2> 1481891 INFO (jetty-launcher-6585-thread-1) [n:127.0.0.1:45615_solr ] o.a.s.c.CorePropertiesLocator Found 0 core definitions underneath /x1/jenkins/jenkins-slave/workspace/Lucene-Solr-NightlyTests-master/checkout/solr/build/solr-core/test/J1/temp/solr.cloud.autoscaling.HdfsAutoAddReplicasIntegrationTest_CF3F1BCCCFED791E-001/tempDir-002/node1/.
[junit4] 2> 1481899 INFO (jetty-launcher-6585-thread-3) [n:127.0.0.1:41738_solr ] o.a.s.m.r.SolrJmxReporter JMX monitoring for 'solr.jvm' (registry 'solr.jvm') enabled at server: com.sun.jmx.mbeanserver.JmxMBeanServer@1c4542d1
[junit4] 2> 1481899 INFO (jetty-launcher-6585-thread-3) [n:127.0.0.1:41738_solr ] o.a.s.m.r.SolrJmxReporter JMX monitoring for 'solr.jetty' (registry 'solr.jetty') enabled at server: com.sun.jmx.mbeanserver.JmxMBeanServer@1c4542d1
[junit4] 2> 1481901 INFO (jetty-launcher-6585-thread-3) [n:127.0.0.1:41738_solr ] o.a.s.c.CorePropertiesLocator Found 0 core definitions underneath /x1/jenkins/jenkins-slave/workspace/Lucene-Solr-NightlyTests-master/checkout/solr/build/solr-core/test/J1/temp/solr.cloud.autoscaling.HdfsAutoAddReplicasIntegrationTest_CF3F1BCCCFED791E-001/tempDir-002/node3/.
[junit4] 2> 1482012 INFO (zkConnectionManagerCallback-6647-thread-1) [ ] o.a.s.c.c.ConnectionManager zkClient has connected
[junit4] 2> 1482013 INFO (TEST-HdfsAutoAddReplicasIntegrationTest.testSimple-seed#[CF3F1BCCCFED791E]) [ ] o.a.s.c.c.ZkStateReader Updated live nodes from ZooKeeper... (0) -> (3)
[junit4] 2> 1482015 INFO (TEST-HdfsAutoAddReplicasIntegrationTest.testSimple-seed#[CF3F1BCCCFED791E]) [ ] o.a.s.c.s.i.ZkClientClusterStateProvider Cluster at 127.0.0.1:33706/solr ready
[junit4] 2> 1482056 INFO (qtp1983210628-25211) [n:127.0.0.1:41738_solr ] o.a.s.s.HttpSolrCall [admin] webapp=null path=/cluster params={wt=javabin&version=2} status=0 QTime=4
[junit4] 2> 1482063 INFO (qtp1983210628-25208) [n:127.0.0.1:41738_solr ] o.a.s.h.a.CollectionsHandler Invoked Collection Action :create with params collection.configName=conf&maxShardsPerNode=2&autoAddReplicas=true&name=testSimple1&nrtReplicas=2&action=CREATE&numShards=2&createNodeSet=127.0.0.1:45615_solr,127.0.0.1:42064_solr&wt=javabin&version=2 and sendToOCPQueue=true
[junit4] 2> 1482066 INFO (OverseerThreadFactory-6671-thread-1-processing-n:127.0.0.1:45615_solr) [n:127.0.0.1:45615_solr ] o.a.s.c.a.c.CreateCollectionCmd Create collection testSimple1
[junit4] 2> 1482177 INFO (OverseerStateUpdate-72973166701969417-127.0.0.1:45615_solr-n_0000000000) [n:127.0.0.1:45615_solr ] o.a.s.c.o.SliceMutator createReplica() {
[junit4] 2> "operation":"ADDREPLICA",
[junit4] 2> "collection":"testSimple1",
[junit4] 2> "shard":"shard1",
[junit4] 2> "core":"testSimple1_shard1_replica_n1",
[junit4] 2> "state":"down",
[junit4] 2> "base_url":"https://127.0.0.1:45615/solr",
[junit4] 2> "type":"NRT",
[junit4] 2> "waitForFinalState":"false"}
[junit4] 2> 1482180 INFO (OverseerStateUpdate-72973166701969417-127.0.0.1:45615_solr-n_0000000000) [n:127.0.0.1:45615_solr ] o.a.s.c.o.SliceMutator createReplica() {
[junit4] 2> "operation":"ADDREPLICA",
[junit4] 2> "collection":"testSimple1",
[junit4] 2> "shard":"shard1",
[junit4] 2> "core":"testSimple1_shard1_replica_n2",
[junit4] 2> "state":"down",
[junit4] 2> "base_url":"https://127.0.0.1:42064/solr",
[junit4] 2> "type":"NRT",
[junit4] 2> "waitForFinalState":"false"}
[junit4] 2> 1482184 INFO (OverseerStateUpdate-72973166701969417-127.0.0.1:45615_solr-n_0000000000) [n:127.0.0.1:45615_solr ] o.a.s.c.o.SliceMutator createReplica() {
[junit4] 2> "operation":"ADDREPLICA",
[junit4] 2> "collection":"testSimple1",
[junit4] 2> "shard":"shard2",
[junit4] 2> "core":"testSimple1_shard2_replica_n4",
[junit4] 2> "state":"down",
[junit4] 2> "base_url":"https://127.0.0.1:45615/solr",
[junit4] 2> "type":"NRT",
[junit4] 2> "waitForFinalState":"false"}
[junit4] 2> 1482187 INFO (OverseerStateUpdate-72973166701969417-127.0.0.1:45615_solr-n_0000000000) [n:127.0.0.1:45615_solr ] o.a.s.c.o.SliceMutator createReplica() {
[junit4] 2> "operation":"ADDREPLICA",
[junit4] 2> "collection":"testSimple1",
[junit4] 2> "shard":"shard2",
[junit4] 2> "core":"testSimple1_shard2_replica_n6",
[junit4] 2> "state":"down",
[junit4] 2> "base_url":"https://127.0.0.1:42064/solr",
[junit4] 2> "type":"NRT",
[junit4] 2> "waitForFinalState":"false"}
[junit4] 2> 1482530 INFO (qtp1990981398-25216) [n:127.0.0.1:45615_solr x:testSimple1_shard2_replica_n4] o.a.s.h.a.CoreAdminOperation core create command qt=/admin/cores&coreNodeName=core_node7&collection.configName=conf&newCollection=true&name=testSimple1_shard2_replica_n4&action=CREATE&numShards=2&collection=testSimple1&shard=shard2&wt=javabin&version=2&replicaType=NRT
[junit4] 2> 1482532 INFO (qtp697730379-25198) [n:127.0.0.1:42064_solr x:testSimple1_shard1_replica_n2] o.a.s.h.a.CoreAdminOperation core create command qt=/admin/cores&coreNodeName=core_node5&collection.configName=conf&newCollection=true&name=testSimple1_shard1_replica_n2&action=CREATE&numShards=2&collection=testSimple1&shard=shard1&wt=javabin&version=2&replicaType=NRT
[junit4] 2> 1482532 INFO (qtp697730379-25198) [n:127.0.0.1:42064_solr x:testSimple1_shard1_replica_n2] o.a.s.c.TransientSolrCoreCacheDefault Allocating transient cache for 4 transient cores
[junit4] 2> 1482558 INFO (qtp1990981398-25218) [n:127.0.0.1:45615_solr x:testSimple1_shard1_replica_n1] o.a.s.h.a.CoreAdminOperation core create command qt=/admin/cores&coreNodeName=core_node3&collection.configName=conf&newCollection=true&name=testSimple1_shard1_replica_n1&action=CREATE&numShards=2&collection=testSimple1&shard=shard1&wt=javabin&version=2&replicaType=NRT
[junit4] 2> 1482561 INFO (qtp697730379-25201) [n:127.0.0.1:42064_solr x:testSimple1_shard2_replica_n6] o.a.s.h.a.CoreAdminOperation core create command qt=/admin/cores&coreNodeName=core_node8&collection.configName=conf&newCollection=true&name=testSimple1_shard2_replica_n6&action=CREATE&numShards=2&collection=testSimple1&shard=shard2&wt=javabin&version=2&replicaType=NRT
[junit4] 2> 1483574 INFO (qtp697730379-25198) [n:127.0.0.1:42064_solr c:testSimple1 s:shard1 r:core_node5 x:testSimple1_shard1_replica_n2] o.a.s.c.SolrConfig Using Lucene MatchVersion: 9.0.0
[junit4] 2> 1483575 INFO (qtp1990981398-25218) [n:127.0.0.1:45615_solr c:testSimple1 s:shard1 r:core_node3 x:testSimple1_shard1_replica_n1] o.a.s.c.SolrConfig Using Lucene MatchVersion: 9.0.0
[junit4] 2> 1483584 INFO (qtp697730379-25198) [n:127.0.0.1:42064_solr c:testSimple1 s:shard1 r:core_node5 x:testSimple1_shard1_replica_n2] o.a.s.s.IndexSchema [testSimple1_shard1_replica_n2] Schema name=minimal
[junit4] 2> 1483587 INFO (qtp697730379-25198) [n:127.0.0.1:42064_solr c:testSimple1 s:shard1 r:core_node5 x:testSimple1_shard1_replica_n2] o.a.s.s.IndexSchema Loaded schema minimal/1.1 with uniqueid field id
[junit4] 2> 1483587 INFO (qtp697730379-25198) [n:127.0.0.1:42064_solr c:testSimple1 s:shard1 r:core_node5 x:testSimple1_shard1_replica_n2] o.a.s.c.CoreContainer Creating SolrCore 'testSimple1_shard1_replica_n2' using configuration from collection testSimple1, trusted=true
[junit4] 2> 1483588 INFO (qtp697730379-25198) [n:127.0.0.1:42064_solr c:testSimple1 s:shard1 r:core_node5 x:testSimple1_shard1_replica_n2] o.a.s.m.r.SolrJmxReporter JMX monitoring for 'solr.core.testSimple1.shard1.replica_n2' (registry 'solr.core.testSimple1.shard1.replica_n2') enabled at server: com.sun.jmx.mbeanserver.JmxMBeanServer@1c4542d1
[junit4] 2> 1483591 INFO (qtp697730379-25201) [n:127.0.0.1:42064_solr c:testSimple1 s:shard2 r:core_node8 x:testSimple1_shard2_replica_n6] o.a.s.c.SolrConfig Using Lucene MatchVersion: 9.0.0
[junit4] 2> 1483609 INFO (qtp1990981398-25218) [n:127.0.0.1:45615_solr c:testSimple1 s:shard1 r:core_node3 x:testSimple1_shard1_replica_n1] o.a.s.s.IndexSchema [testSimple1_shard1_replica_n1] Schema name=minimal
[junit4] 2> 1483610 INFO (qtp1990981398-25216) [n:127.0.0.1:45615_solr c:testSimple1 s:shard2 r:core_node7 x:testSimple1_shard2_replica_n4] o.a.s.c.SolrConfig Using Lucene MatchVersion: 9.0.0
[junit4] 2> 1483611 INFO (qtp697730379-25198) [n:127.0.0.1:42064_solr c:testSimple1 s:shard1 r:core_node5 x:testSimple1_shard1_replica_n2] o.a.s.c.HdfsDirectoryFactory solr.hdfs.home=hdfs://localhost:40741/solr_hdfs_home
[junit4] 2> 1483611 INFO (qtp697730379-25198) [n:127.0.0.1:42064_solr c:testSimple1 s:shard1 r:core_node5 x:testSimple1_shard1_replica_n2] o.a.s.c.HdfsDirectoryFactory Solr Kerberos Authentication disabled
[junit4] 2> 1483611 INFO (qtp697730379-25198) [n:127.0.0.1:42064_solr c:testSimple1 s:shard1 r:core_node5 x:testSimple1_shard1_replica_n2] o.a.s.c.SolrCore [[testSimple1_shard1_replica_n2] ] Opening new SolrCore at [/x1/jenkins/jenkins-slave/workspace/Lucene-Solr-NightlyTests-master/checkout/solr/build/solr-core/test/J1/temp/solr.cloud.autoscaling.HdfsAutoAddReplicasIntegrationTest_CF3F1BCCCFED791E-001/tempDir-002/node2/testSimple1_shard1_replica_n2], dataDir=[hdfs://localhost:40741/solr_hdfs_home/testSimple1/core_node5/data/]
[junit4] 2> 1483612 INFO (qtp1990981398-25218) [n:127.0.0.1:45615_solr c:testSimple1 s:shard1 r:core_node3 x:testSimple1_shard1_replica_n1] o.a.s.s.IndexSchema Loaded schema minimal/1.1 with uniqueid field id
[junit4] 2> 1483612 INFO (qtp1990981398-25218) [n:127.0.0.1:45615_solr c:testSimple1 s:shard1 r:core_node3 x:testSimple1_shard1_replica_n1] o.a.s.c.CoreContainer Creating SolrCore 'testSimple1_shard1_replica_n1' using configuration from collection testSimple1, trusted=true
[junit4] 2> 1483612 INFO (qtp697730379-25201) [n:127.0.0.1:42064_solr c:testSimple1 s:shard2 r:core_node8 x:testSimple1_shard2_replica_n6] o.a.s.s.IndexSchema [testSimple1_shard2_replica_n6] Schema name=minimal
[junit4] 2> 1483612 INFO (qtp1990981398-25218) [n:127.0.0.1:45615_solr c:testSimple1 s:shard1 r:core_node3 x:testSimple1_shard1_replica_n1] o.a.s.m.r.SolrJmxReporter JMX monitoring for 'solr.core.testSimple1.shard1.replica_n1' (registry 'solr.core.testSimple1.shard1.replica_n1') enabled at server: com.sun.jmx.mbeanserver.JmxMBeanServer@1c4542d1
[junit4] 2> 1483612 INFO (qtp1990981398-25218) [n:127.0.0.1:45615_solr c:testSimple1 s:shard1 r:core_node3 x:testSimple1_shard1_replica_n1] o.a.s.c.HdfsDirectoryFactory solr.hdfs.home=hdfs://localhost:40741/solr_hdfs_home
[junit4] 2> 1483612 INFO (qtp1990981398-25218) [n:127.0.0.1:45615_solr c:testSimple1 s:shard1 r:core_node3 x:testSimple1_shard1_replica_n1] o.a.s.c.HdfsDirectoryFactory Solr Kerberos Authentication disabled
[junit4] 2> 1483613 INFO (qtp1990981398-25218) [n:127.0.0.1:45615_solr c:testSimple1 s:shard1 r:core_node3 x:testSimple1_shard1_replica_n1] o.a.s.c.SolrCore [[testSimple1_shard1_replica_n1] ] Opening new SolrCore at [/x1/jenkins/jenkins-slave/workspace/Lucene-Solr-NightlyTests-master/checkout/solr/build/solr-core/test/J1/temp/solr.cloud.autoscaling.HdfsAutoAddReplicasIntegrationTest_CF3F1BCCCFED791E-001/tempDir-002/node1/testSimple1_shard1_replica_n1], dataDir=[hdfs://localhost:40741/solr_hdfs_home/testSimple1/core_node3/data/]
[junit4] 2> 1483613 INFO (qtp697730379-25198) [n:127.0.0.1:42064_solr c:testSimple1 s:shard1 r:core_node5 x:testSimple1_shard1_replica_n2] o.a.s.c.HdfsDirectoryFactory creating directory factory for path hdfs://localhost:40741/solr_hdfs_home/testSimple1/core_node5/data/snapshot_metadata
[junit4] 2> 1483615 INFO (qtp697730379-25201) [n:127.0.0.1:42064_solr c:testSimple1 s:shard2 r:core_node8 x:testSimple1_shard2_replica_n6] o.a.s.s.IndexSchema Loaded schema minimal/1.1 with uniqueid field id
[junit4] 2> 1483615 INFO (qtp697730379-25201) [n:127.0.0.1:42064_solr c:testSimple1 s:shard2 r:core_node8 x:testSimple1_shard2_replica_n6] o.a.s.c.CoreContainer Creating SolrCore 'testSimple1_shard2_replica_n6' using configuration from collection testSimple1, trusted=true
[junit4] 2> 1483616 INFO (qtp697730379-25201) [n:127.0.0.1:42064_solr c:testSimple1 s:shard2 r:core_node8 x:testSimple1_shard2_replica_n6] o.a.s.m.r.SolrJmxReporter JMX monitoring for 'solr.core.testSimple1.shard2.replica_n6' (registry 'solr.core.testSimple1.shard2.replica_n6') enabled at server: com.sun.jmx.mbeanserver.JmxMBeanServer@1c4542d1
[junit4] 2> 1483616 INFO (qtp1990981398-25218) [n:127.0.0.1:45615_solr c:testSimple1 s:shard1 r:core_node3 x:testSimple1_shard1_replica_n1] o.a.s.c.HdfsDirectoryFactory creating directory factory for path hdfs://localhost:40741/solr_hdfs_home/testSimple1/core_node3/data/snapshot_metadata
[junit4] 2> 1483616 INFO (qtp697730379-25201) [n:127.0.0.1:42064_solr c:testSimple1 s:shard2 r:core_node8 x:testSimple1_shard2_replica_n6] o.a.s.c.HdfsDirectoryFactory solr.hdfs.home=hdfs://localhost:40741/solr_hdfs_home
[junit4] 2> 1483616 INFO (qtp697730379-25201) [n:127.0.0.1:42064_solr c:testSimple1 s:shard2 r:core_node8 x:testSimple1_shard2_replica_n6] o.a.s.c.HdfsDirectoryFactory Solr Kerberos Authentication disabled
[junit4] 2> 1483616 INFO (qtp697730379-25201) [n:127.0.0.1:42064_solr c:testSimple1 s:shard2 r:core_node8 x:testSimple1_shard2_replica_n6] o.a.s.c.SolrCore [[testSimple1_shard2_replica_n6] ] Opening new SolrCore at [/x1/jenkins/jenkins-slave/workspace/Lucene-Solr-NightlyTests-master/checkout/solr/build/solr-core/test/J1/temp/solr.cloud.autoscaling.HdfsAutoAddReplicasIntegrationTest_CF3F1BCCCFED791E-001/tempDir-002/node2/testSimple1_shard2_replica_n6], dataDir=[hdfs://localhost:40741/solr_hdfs_home/testSimple1/core_node8/data/]
[junit4] 2> 1483618 INFO (qtp697730379-25201) [n:127.0.0.1:42064_solr c:testSimple1 s:shard2 r:core_node8 x:testSimple1_shard2_replica_n6] o.a.s.c.HdfsDirectoryFactory creating directory factory for path hdfs://localhost:40741/solr_hdfs_home/testSimple1/core_node8/data/snapshot_metadata
[junit4] 2> 1483620 INFO (qtp1990981398-25216) [n:127.0.0.1:45615_solr c:testSimple1 s:shard2 r:core_node7 x:testSimple1_shard2_replica_n4] o.a.s.s.IndexSchema [testSimple1_shard2_replica_n4] Schema name=minimal
[junit4] 2> 1483622 INFO (qtp1990981398-25216) [n:127.0.0.1:45615_solr c:testSimple1 s:shard2 r:core_node7 x:testSimple1_shard2_replica_n4] o.a.s.s.IndexSchema Loaded schema minimal/1.1 with uniqueid field id
[junit4] 2> 1483622 INFO (qtp1990981398-25216) [n:127.0.0.1:45615_solr c:testSimple1 s:shard2 r:core_node7 x:testSimple1_shard2_replica_n4] o.a.s.c.CoreContainer Creating SolrCore 'testSimple1_shard2_replica_n4' using configuration from collection testSimple1, trusted=true
[junit4] 2> 1483623 INFO (qtp1990981398-25216) [n:127.0.0.1:45615_solr c:testSimple1 s:shard2 r:core_node7 x:testSimple1_shard2_replica_n4] o.a.s.m.r.SolrJmxReporter JMX monitoring for 'solr.core.testSimple1.shard2.replica_n4' (registry 'solr.core.testSimple1.shard2.replica_n4') enabled at server: com.sun.jmx.mbeanserver.JmxMBeanServer@1c4542d1
[junit4] 2> 1483623 INFO (qtp1990981398-25216) [n:127.0.0.1:45615_solr c:testSimple1 s:shard2 r:core_node7 x:testSimple1_shard2_replica_n4] o.a.s.c.HdfsDirectoryFactory solr.hdfs.home=hdfs://localhost:40741/solr_hdfs_home
[junit4] 2> 1483623 INFO (qtp1990981398-25216) [n:127.0.0.1:45615_solr c:testSimple1 s:shard2 r:core_node7 x:testSimple1_shard2_replica_n4] o.a.s.c.HdfsDirectoryFactory Solr Kerberos Authentication disabled
[junit4] 2> 1483623 INFO (qtp1990981398-25216) [n:127.0.0.1:45615_solr c:testSimple1 s:shard2 r:core_node7 x:testSimple1_shard2_replica_n4] o.a.s.c.SolrCore [[testSimple1_shard2_replica_n4] ] Opening new SolrCore at [/x1/jenkins/jenkins-slave/workspace/Lucene-Solr-NightlyTests-master/checkout/solr/build/solr-core/test/J1/temp/solr.cloud.autoscaling.HdfsAutoAddReplicasIntegrationTest_CF3F1BCCCFED791E-001/tempDir-002/node1/testSimple1_shard2_replica_n4], dataDir=[hdfs://localhost:40741/solr_hdfs_home/testSimple1/core_node7/data/]
[junit4] 2> 1483623 INFO (qtp1990981398-25218) [n:127.0.0.1:45615_solr c:testSimple1 s:shard1 r:core_node3 x:testSimple1_shard1_replica_n1] o.a.s.c.HdfsDirectoryFactory Number of slabs of block cache [1] with direct memory allocation set to [true]
[junit4] 2> 1483623 INFO (qtp697730379-25198) [n:127.0.0.1:42064_solr c:testSimple1 s:shard1 r:core_node5 x:testSimple1_shard1_replica_n2] o.a.s.c.HdfsDirectoryFactory Number of slabs of block cache [1] with direct memory allocation set to [true]
[junit4] 2> 1483623 INFO (qtp697730379-25198) [n:127.0.0.1:42064_solr c:testSimple1 s:shard1 r:core_node5 x:testSimple1_shard1_replica_n2] o.a.s.c.HdfsDirectoryFactory Block cache target memory usage, slab size of [4194304] will allocate [1] slabs and use ~[4194304] bytes
[junit4] 2> 1483623 INFO (qtp1990981398-25218) [n:127.0.0.1:45615_solr c:testSimple1 s:shard1 r:core_node3 x:testSimple1_shard1_replica_n1] o.a.s.c.HdfsDirectoryFactory Block cache target memory usage, slab size of [4194304] will allocate [1] slabs and use ~[4194304] bytes
[junit4] 2> 1483625 INFO (qtp1990981398-25216) [n:127.0.0.1:45615_solr c:testSimple1 s:shard2 r:core_node7 x:testSimple1_shard2_replica_n4] o.a.s.c.HdfsDirectoryFactory creating directory factory for path hdfs://localhost:40741/solr_hdfs_home/testSimple1/core_node7/data/snapshot_metadata
[junit4] 2> 1483626 INFO (qtp697730379-25201) [n:127.0.0.1:42064_solr c:testSimple1 s:shard2 r:core_node8 x:testSimple1_shard2_replica_n6] o.a.s.c.HdfsDirectoryFactory Number of slabs of block cache [1] with direct memory allocation set to [true]
[junit4] 2> 1483626 INFO (qtp697730379-25201) [n:127.0.0.1:42064_solr c:testSimple1 s:shard2 r:core_node8 x:testSimple1_shard2_replica_n6] o.a.s.c.HdfsDirectoryFactory Block cache target memory usage, slab size of [4194304] will allocate [1] slabs and use ~[4194304] bytes
[junit4] 2> 1483627 INFO (qtp1990981398-25218) [n:127.0.0.1:45615_solr c:testSimple1 s:shard1 r:core_node3 x:testSimple1_shard1_replica_n1] o.a.s.s.b.BlockDirectory Block cache on write is disabled
[junit4] 2> 1483627 INFO (qtp697730379-25198) [n:127.0.0.1:42064_solr c:testSimple1 s:shard1 r:core_node5 x:testSimple1_shard1_replica_n2] o.a.s.s.b.BlockDirectory Block cache on write is disabled
[junit4] 2> 1483632 INFO (qtp1990981398-25218) [n:127.0.0.1:45615_solr c:testSimple1 s:shard1 r:core_node3 x:testSimple1_shard1_replica_n1] o.a.s.c.HdfsDirectoryFactory creating directory factory for path hdfs://localhost:40741/solr_hdfs_home/testSimple1/core_node3/data
[junit4] 2> 1483632 INFO (qtp697730379-25198) [n:127.0.0.1:42064_solr c:testSimple1 s:shard1 r:core_node5 x:testSimple1_shard1_replica_n2] o.a.s.c.HdfsDirectoryFactory creating directory factory for path hdfs://localhost:40741/solr_hdfs_home/testSimple1/core_node5/data
[junit4] 2> 1483633 INFO (qtp697730379-25201) [n:127.0.0.1:42064_solr c:testSimple1 s:shard2 r:core_node8 x:testSimple1_shard2_replica_n6] o.a.s.s.b.BlockDirectory Block cache on write is disabled
[junit4] 2> 1483636 INFO (qtp697730379-25201) [n:127.0.0.1:42064_solr c:testSimple1 s:shard2 r:core_node8 x:testSimple1_shard2_replica_n6] o.a.s.c.HdfsDirectoryFactory creating directory factory for path hdfs://localhost:40741/solr_hdfs_home/testSimple1/core_node8/data
[junit4] 2> 1483638 INFO (qtp1990981398-25216) [n:127.0.0.1:45615_solr c:testSimple1 s:shard2 r:core_node7 x:testSimple1_shard2_replica_n4] o.a.s.c.HdfsDirectoryFactory Number of slabs of block cache [1] with direct memory allocation set to [true]
[junit4] 2> 1483638 INFO (qtp1990981398-25216) [n:127.0.0.1:45615_solr c:testSimple1 s:shard2 r:core_node7 x:testSimple1_shard2_replica_n4] o.a.s.c.HdfsDirectoryFactory Block cache target memory usage, slab size of [4194304] will allocate [1] slabs and use ~[4194304] bytes
[junit4] 2> 1483645 INFO (qtp1990981398-25216) [n:127.0.0.1:45615_solr c:testSimple1 s:shard2 r:core_node7 x:testSimple1_shard2_replica_n4] o.a.s.s.b.BlockDirectory Block cache on write is disabled
[junit4] 2> 1483646 INFO (qtp1990981398-25216) [n:127.0.0.1:45615_solr c:testSimple1 s:shard2 r:core_node7 x:testSimple1_shard2_replica_n4] o.a.s.c.HdfsDirectoryFactory creating directory factory for path hdfs://localhost:40741/solr_hdfs_home/testSimple1/core_node7/data
[junit4] 2> 1483655 INFO (qtp1990981398-25218) [n:127.0.0.1:45615_solr c:testSimple1 s:shard1 r:core_node3 x:testSimple1_shard1_replica_n1] o.a.s.c.HdfsDirectoryFactory creating directory factory for path hdfs://localhost:40741/solr_hdfs_home/testSimple1/core_node3/data/index
[junit4] 2> 1483661 INFO (qtp697730379-25198) [n:127.0.0.1:42064_solr c:testSimple1 s:shard1 r:core_node5 x:testSimple1_shard1_replica_n2] o.a.s.c.HdfsDirectoryFactory creating directory factory for path hdfs://localhost:40741/solr_hdfs_home/testSimple1/core_node5/data/index
[junit4] 2> 1483661 INFO (qtp697730379-25201) [n:127.0.0.1:42064_solr c:testSimple1 s:shard2 r:core_node8 x:testSimple1_shard2_replica_n6] o.a.s.c.HdfsDirectoryFactory creating directory factory for path hdfs://localhost:40741/solr_hdfs_home/testSimple1/core_node8/data/index
[junit4] 2> 1483663 INFO (qtp1990981398-25218) [n:127.0.0.1:45615_solr c:testSimple1 s:shard1 r:core_node3 x:testSimple1_shard1_replica_n1] o.a.s.c.HdfsDirectoryFactory Number of slabs of block cache [1] with direct memory allocation set to [true]
[junit4] 2> 1483663 INFO (qtp1990981398-25218) [n:127.0.0.1:45615_solr c:testSimple1 s:shard1 r:core_node3 x:testSimple1_shard1_replica_n1] o.a.s.c.HdfsDirectoryFactory Block cache target memory usage, slab size of [4194304] will allocate [1] slabs and use ~[4194304] bytes
[junit4] 2> 1483668 INFO (qtp697730379-25198) [n:127.0.0.1:42064_solr c:testSimple1 s:shard1 r:core_node5 x:testSimple1_shard1_replica_n2] o.a.s.c.HdfsDirectoryFactory Number of slabs of block cache [1] with direct memory allocation set to [true]
[junit4] 2> 1483668 INFO (qtp697730379-25198) [n:127.0.0.1:42064_solr c:testSimple1 s:shard1 r:core_node5 x:testSimple1_shard1_replica_n2] o.a.s.c.HdfsDirectoryFactory Block cache target memory usage, slab size of [4194304] will allocate [1] slabs and use ~[4194304] bytes
[junit4] 2> 1483668 INFO (qtp1990981398-25218) [n:127.0.0.1:45615_solr c:testSimple1 s:shard1 r:core_node3 x:testSimple1_shard1_replica_n1] o.a.s.s.b.BlockDirectory Block cache on write is disabled
[junit4] 2> 1483672 INFO (qtp697730379-25201) [n:127.0.0.1:42064_solr c:testSimple1 s:shard2 r:core_node8 x:testSimple1_shard2_replica_n6] o.a.s.c.HdfsDirectoryFactory Number of slabs of block cache [1] with direct memory allocation set to [true]
[junit4] 2> 1483672 INFO (qtp697730379-25201) [n:127.0.0.1:42064_solr c:testSimple1 s:shard2 r:core_node8 x:testSimple1_shard2_replica_n6] o.a.s.c.HdfsDirectoryFactory Block cache target memory usage, slab size of [4194304] will allocate [1] slabs and use ~[4194304] bytes
[junit4] 2> 1483675 INFO (qtp697730379-25201) [n:127.0.0.1:42064_solr c:testSimple1 s:shard2 r:core_node8 x:testSimple1_shard2_replica_n6] o.a.s.s.b.BlockDirectory Block cache on write is disabled
[junit4] 2> 1483675 INFO (qtp1990981398-25216) [n:127.0.0.1:45615_solr c:testSimple1 s:shard2 r:core_node7 x:testSimple1_shard2_replica_n4] o.a.s.c.HdfsDirectoryFactory creating directory factory for path hdfs://localhost:40741/solr_hdfs_home/testSimple1/core_node7/data/index
[junit4] 2> 1483675 INFO (qtp697730379-25198) [n:127.0.0.1:42064_solr c:testSimple1 s:shard1 r:core_node5 x:testSimple1_shard1_replica_n2] o.a.s.s.b.BlockDirectory Block cache on write is disabled
[junit4] 2> 1483682 INFO (qtp1990981398-25216) [n:127.0.0.1:45615_solr c:testSimple1 s:shard2 r:core_node7 x:testSimple1_shard2_replica_n4] o.a.s.c.HdfsDirectoryFactory Number of slabs of block cache [1] with direct memory allocation set to [true]
[junit4] 2> 1483682 INFO (qtp1990981398-25216) [n:127.0.0.1:45615_solr c:testSimple1 s:shard2 r:core_node7 x:testSimple1_shard2_replica_n4] o.a.s.c.HdfsDirectoryFactory Block cache target memory usage, slab size of [4194304] will allocate [1] slabs and use ~[4194304] bytes
[junit4] 2> 1483686 INFO (qtp1990981398-25216) [n:127.0.0.1:45615_solr c:testSimple1 s:shard2 r:core_node7 x:testSimple1_shard2_replica_n4] o.a.s.s.b.BlockDirectory Block cache on write is disabled
[junit4] 2> 1483803 INFO (qtp697730379-25201) [n:127.0.0.1:42064_solr c:testSimple1 s:shard2 r:core_node8 x:testSimple1_shard2_replica_n6] o.a.s.u.UpdateHandler Using UpdateLog implementation: org.apache.solr.update.HdfsUpdateLog
[junit4] 2> 1483803 INFO (qtp697730379-25201) [n:127.0.0.1:42064_solr c:testSimple1 s:shard2 r:core_node8 x:testSimple1_shard2_replica_n6] o.a.s.u.UpdateLog Initializing UpdateLog: dataDir=null defaultSyncLevel=FLUSH numRecordsToKeep=100 maxNumLogsToKeep=10 numVersionBuckets=65536
[junit4] 2> 1483803 INFO (qtp697730379-25201) [n:127.0.0.1:42064_solr c:testSimple1 s:shard2 r:core_node8 x:testSimple1_shard2_replica_n6] o.a.s.u.HdfsUpdateLog Initializing HdfsUpdateLog: tlogDfsReplication=3
[junit4] 2> 1483803 INFO (qtp1990981398-25218) [n:127.0.0.1:45615_solr c:testSimple1 s:shard1 r:core_node3 x:testSimple1_shard1_replica_n1] o.a.s.u.UpdateHandler Using UpdateLog implementation: org.apache.solr.update.HdfsUpdateLog
[junit4] 2> 1483803 INFO (qtp1990981398-25218) [n:127.0.0.1:45615_solr c:testSimple1 s:shard1 r:core_node3 x:testSimple1_shard1_replica_n1] o.a.s.u.UpdateLog Initializing UpdateLog: dataDir=null defaultSyncLevel=FLUSH numRecordsToKeep=100 maxNumLogsToKeep=10 numVersionBuckets=65536
[junit4] 2> 1483803 INFO (qtp1990981398-25218) [n:127.0.0.1:45615_solr c:testSimple1 s:shard1 r:core_node3 x:testSimple1_shard1_replica_n1] o.a.s.u.HdfsUpdateLog Initializing HdfsUpdateLog: tlogDfsReplication=3
[junit4] 2> 1483811 INFO (qtp1990981398-25216) [n:127.0.0.1:45615_solr c:testSimple1 s:shard2 r:core_node7 x:testSimple1_shard2_replica_n4] o.a.s.u.UpdateHandler Using UpdateLog implementation: org.apache.solr.update.HdfsUpdateLog
[junit4] 2> 1483811 INFO (qtp1990981398-25216) [n:127.0.0.1:45615_solr c:testSimple1 s:shard2 r:core_node7 x:testSimple1_shard2_replica_n4] o.a.s.u.UpdateLog Initializing UpdateLog: dataDir=null defaultSyncLevel=FLUSH numRecordsToKeep=100 maxNumLogsToKeep=10 numVersionBuckets=65536
[junit4] 2> 1483811 INFO (qtp1990981398-25216) [n:127.0.0.1:45615_solr c:testSimple1 s:shard2 r:core_node7 x:testSimple1_shard2_replica_n4] o.a.s.u.HdfsUpdateLog Initializing HdfsUpdateLog: tlogDfsReplication=3
[junit4] 2> 1483817 INFO (qtp697730379-25201) [n:127.0.0.1:42064_solr c:testSimple1 s:shard2 r:core_node8 x:testSimple1_shard2_replica_n6] o.a.s.u.CommitTracker Hard AutoCommit: disabled
[junit4] 2> 1483817 INFO (qtp697730379-25201) [n:127.0.0.1:42064_solr c:testSimple1 s:shard2 r:core_node8 x:testSimple1_shard2_replica_n6] o.a.s.u.CommitTracker Soft AutoCommit: disabled
[junit4] 2> 1483846 INFO (qtp1990981398-25218) [n:127.0.0.1:45615_solr c:testSimple1 s:shard1 r:core_node3 x:testSimple1_shard1_replica_n1] o.a.s.u.CommitTracker Hard AutoCommit: disabled
[junit4] 2> 1483846 INFO (qtp1990981398-25218) [n:127.0.0.1:45615_solr c:testSimple1 s:shard1 r:core_node3 x:testSimple1_shard1_replica_n1] o.a.s.u.CommitTracker Soft AutoCommit: disabled
[junit4] 2> 1483852 INFO (qtp1990981398-25216) [n:127.0.0.1:45615_solr c:testSimple1 s:shard2 r:core_node7 x:testSimple1_shard2_replica_n4] o.a.s.u.CommitTracker Hard AutoCommit: disabled
[junit4] 2> 1483852 INFO (qtp1990981398-25216) [n:127.0.0.1:45615_solr c:testSimple1 s:shard2 r:core_node7 x:testSimple1_shard2_replica_n4] o.a.s.u.CommitTracker Soft AutoCommit: disabled
[junit4] 2> 1483882 INFO (qtp697730379-25201) [n:127.0.0.1:42064_solr c:testSimple1 s:shard2 r:core_node8 x:testSimple1_shard2_replica_n6] o.a.s.s.SolrIndexSearcher Opening [Searcher@421d4969[testSimple1_shard2_replica_n6] main]
[junit4] 2> 1483882 INFO (qtp1990981398-25218) [n:127.0.0.1:45615_solr c:testSimple1 s:shard1 r:core_node3 x:testSimple1_shard1_replica_n1] o.a.s.s.SolrIndexSearcher Opening [Searcher@117057ea[testSimple1_shard1_replica_n1] main]
[junit4] 2> 1483885 INFO (qtp697730379-25201) [n:127.0.0.1:42064_solr c:testSimple1 s:shard2 r:core_node8 x:testSimple1_shard2_replica_n6] o.a.s.r.ManagedResourceStorage Configured ZooKeeperStorageIO with znodeBase: /configs/conf
[junit4] 2> 1483885 INFO (qtp697730379-25201) [n:127.0.0.1:42064_solr c:testSimple1 s:shard2 r:core_node8 x:testSimple1_shard2_replica_n6] o.a.s.r.ManagedResourceStorage Loaded null at path _rest_managed.json using ZooKeeperStorageIO:path=/configs/conf
[junit4] 2> 1483885 INFO (qtp1990981398-25216) [n:127.0.0.1:45615_solr c:testSimple1 s:shard2 r:core_node7 x:testSimple1_shard2_replica_n4] o.a.s.s.SolrIndexSearcher Opening [Searcher@d1efd94[testSimple1_shard2_replica_n4] main]
[junit4] 2> 1483886 INFO (qtp697730379-25201) [n:127.0.0.1:42064_solr c:testSimple1 s:shard2 r:core_node8 x:testSimple1_shard2_replica_n6] o.a.s.h.ReplicationHandler Commits will be reserved for 10000ms.
[junit4] 2> 1483887 INFO (qtp697730379-25201) [n:127.0.0.1:42064_solr c:testSimple1 s:shard2 r:core_node8 x:testSimple1_shard2_replica_n6] o.a.s.u.UpdateLog Could not find max version in index or recent updates, using new clock 1628266327844061184
[junit4] 2> 1483887 INFO (qtp1990981398-25218) [n:127.0.0.1:45615_solr c:testSimple1 s:shard1 r:core_node3 x:testSimple1_shard1_replica_n1] o.a.s.r.ManagedResourceStorage Configured ZooKeeperStorageIO with znodeBase: /configs/conf
[junit4] 2> 1483888 INFO (qtp1990981398-25218) [n:127.0.0.1:45615_solr c:testSimple1 s:shard1 r:core_node3 x:testSimple1_shard1_replica_n1] o.a.s.r.ManagedResourceStorage Loaded null at path _rest_managed.json using ZooKeeperStorageIO:path=/configs/conf
[junit4] 2> 1483888 INFO (qtp1990981398-25216) [n:127.0.0.1:45615_solr c:testSimple1 s:shard2 r:core_node7 x:testSimple1_shard2_replica_n4] o.a.s.r.ManagedResourceStorage Configured ZooKeeperStorageIO with znodeBase: /configs/conf
[junit4] 2> 1483889 INFO (qtp1990981398-25216) [n:127.0.0.1:45615_solr c:testSimple1 s:shard2 r:core_node7 x:testSimple1_shard2_replica_n4] o.a.s.r.ManagedResourceStorage Loaded null at path _rest_managed.json using ZooKeeperStorageIO:path=/configs/conf
[junit4] 2> 1483889 INFO (qtp1990981398-25218) [n:127.0.0.1:45615_solr c:testSimple1 s:shard1 r:core_node3 x:testSimple1_shard1_replica_n1] o.a.s.h.ReplicationHandler Commits will be reserved for 10000ms.
[junit4] 2> 1483889 INFO (qtp1990981398-25218) [n:127.0.0.1:45615_solr c:testSimple1 s:shard1 r:core_node3 x:testSimple1_shard1_replica_n1] o.a.s.u.UpdateLog Could not find max version in index or recent updates, using new clock 1628266327846158336
[junit4] 2> 1483889 INFO (qtp1990981398-25216) [n:127.0.0.1:45615_solr c:testSimple1 s:shard2 r:core_node7 x:testSimple1_shard2_replica_n4] o.a.s.h.ReplicationHandler Commits will be reserved for 10000ms.
[junit4] 2> 1483889 INFO (qtp1990981398-25216) [n:127.0.0.1:45615_solr c:testSimple1 s:shard2 r:core_node7 x:testSimple1_shard2_replica_n4] o.a.s.u.UpdateLog Could not find max version in index or recent updates, using new clock 1628266327846158336
[junit4] 2> 1483892 INFO (searcherExecutor-6685-thread-1-processing-n:127.0.0.1:42064_solr x:testSimple1_shard2_replica_n6 c:testSimple1 s:shard2 r:core_node8) [n:127.0.0.1:42064_solr c:testSimple1 s:shard2 r:core_node8 x:testSimple1_shard2_replica_n6] o.a.s.c.SolrCore [testSimple1_shard2_replica_n6] Registered new searcher Searcher@421d4969[testSimple1_shard2_replica_n6] main{ExitableDirectoryReader(UninvertingDirectoryReader())}
[junit4] 2> 1483893 INFO (searcherExecutor-6684-thread-1-processing-n:127.0.0.1:45615_solr x:testSimple1_shard1_replica_n1 c:testSimple1 s:shard1 r:core_node3) [n:127.0.0.1:45615_solr c:testSimple1 s:shard1 r:core_node3 x:testSimple1_shard1_replica_n1] o.a.s.c.SolrCore [testSimple1_shard1_replica_n1] Registered new searcher Searcher@117057ea[testSimple1_shard1_replica_n1] main{ExitableDirectoryReader(UninvertingDirectoryReader())}
[junit4] 2> 1483894 INFO (searcherExecutor-6686-thread-1-processing-n:127.0.0.1:45615_solr x:testSimple1_shard2_replica_n4 c:testSimple1 s:shard2 r:core_node7) [n:127.0.0.1:45615_solr c:testSimple1 s:shard2 r:core_node7 x:testSimple1_shard2_replica_n4] o.a.s.c.SolrCore [testSimple1_shard2_replica_n4] Registered new searcher Searcher@d1efd94[testSimple1_shard2_replica_n4] main{ExitableDirectoryReader(UninvertingDirectoryReader())}
[junit4] 2> 1483901 INFO (qtp697730379-25201) [n:127.0.0.1:42064_solr c:testSimple1 s:shard2 r:core_node8 x:testSimple1_shard2_replica_n6] o.a.s.c.ZkShardTerms Successful update of terms at /collections/testSimple1/terms/shard2 to Terms{values={core_node8=0}, version=0}
[junit4] 2> 1483901 INFO (qtp697730379-25201) [n:127.0.0.1:42064_solr c:testSimple1 s:shard2 r:core_node8 x:testSimple1_shard2_replica_n6] o.a.s.c.ShardLeaderElectionContextBase make sure parent is created /collections/testSimple1/leaders/shard2
[junit4] 2> 1483902 INFO (qtp1990981398-25218) [n:127.0.0.1:45615_solr c:testSimple1 s:shard1 r:core_node3 x:testSimple1_shard1_replica_n1] o.a.s.c.ZkShardTerms Successful update of terms at /collections/testSimple1/terms/shard1 to Terms{values={core_node3=0}, version=0}
[junit4] 2> 1483902 INFO (qtp1990981398-25218) [n:127.0.0.1:45615_solr c:testSimple1 s:shard1 r:core_node3 x:testSimple1_shard1_replica_n1] o.a.s.c.ShardLeaderElectionContextBase make sure parent is created /collections/testSimple1/leaders/shard1
[junit4] 2> 1483908 INFO (qtp1990981398-25216) [n:127.0.0.1:45615_solr c:testSimple1 s:shard2 r:core_node7 x:testSimple1_shard2_replica_n4] o.a.s.c.ZkShardTerms Successful update of terms at /collections/testSimple1/terms/shard2 to Terms{values={core_node7=0, core_node8=0}, version=1}
[junit4] 2> 1483909 INFO (qtp1990981398-25216) [n:127.0.0.1:45615_solr c:testSimple1 s:shard2 r:core_node7 x:testSimple1_shard2_replica_n4] o.a.s.c.ShardLeaderElectionContextBase make sure parent is created /collections/testSimple1/leaders/shard2
[junit4] 2> 1483911 INFO (qtp697730379-25201) [n:127.0.0.1:42064_solr c:testSimple1 s:shard2 r:core_node8 x:testSimple1_shard2_replica_n6] o.a.s.c.ShardLeaderElectionContext Enough replicas found to continue.
[junit4] 2> 1483911 INFO (qtp697730379-25201) [n:127.0.0.1:42064_solr c:testSimple1 s:shard2 r:core_node8 x:testSimple1_shard2_replica_n6] o.a.s.c.ShardLeaderElectionContext I may be the new leader - try and sync
[junit4] 2> 1483911 INFO (qtp697730379-25201) [n:127.0.0.1:42064_solr c:testSimple1 s:shard2 r:core_node8 x:testSimple1_shard2_replica_n6] o.a.s.c.SyncStrategy Sync replicas to https://127.0.0.1:42064/solr/testSimple1_shard2_replica_n6/
[junit4] 2> 1483912 INFO (qtp1990981398-25218) [n:127.0.0.1:45615_solr c:testSimple1 s:shard1 r:core_node3 x:testSimple1_shard1_replica_n1] o.a.s.c.ShardLeaderElectionContext Waiting until we see more replicas up for shard shard1: total=2 found=1 timeoutin=14999ms
[junit4] 2> 1483912 INFO (qtp697730379-25201) [n:127.0.0.1:42064_solr c:testSimple1 s:shard2 r:core_node8 x:testSimple1_shard2_replica_n6] o.a.s.u.PeerSync PeerSync: core=testSimple1_shard2_replica_n6 url=https://127.0.0.1:42064/solr START replicas=[https://127.0.0.1:45615/solr/testSimple1_shard2_replica_n4/] nUpdates=100
[junit4] 2> 1483912 INFO (qtp697730379-25201) [n:127.0.0.1:42064_solr c:testSimple1 s:shard2 r:core_node8 x:testSimple1_shard2_replica_n6] o.a.s.u.PeerSync PeerSync: core=testSimple1_shard2_replica_n6 url=https://127.0.0.1:42064/solr DONE. We have no versions. sync failed.
[junit4] 2> 1483922 INFO (qtp1990981398-25215) [n:127.0.0.1:45615_solr c:testSimple1 s:shard2 r:core_node7 x:testSimple1_shard2_replica_n4] o.a.s.c.S.Request [testSimple1_shard2_replica_n4] webapp=/solr path=/get params={distrib=false&qt=/get&fingerprint=false&getVersions=100&wt=javabin&version=2} status=0 QTime=1
[junit4] 2> 1483922 INFO (qtp697730379-25201) [n:127.0.0.1:42064_solr c:testSimple1 s:shard2 r:core_node8 x:testSimple1_shard2_replica_n6] o.a.s.c.SyncStrategy Leader's attempt to sync with shard failed, moving to the next candidate
[junit4] 2> 1483922 INFO (qtp697730379-25201) [n:127.0.0.1:42064_solr c:testSimple1 s:shard2 r:core_node8 x:testSimple1_shard2_replica_n6] o.a.s.c.ShardLeaderElectionContext We failed sync, but we have no versions - we can't sync in that case - we were active before, so become leader anyway
[junit4] 2> 1483922 INFO (qtp697730379-25201) [n:127.0.0.1:42064_solr c:testSimple1 s:shard2 r:core_node8 x:testSimple1_shard2_replica_n6] o.a.s.c.ShardLeaderElectionContextBase Creating leader registration node /collections/testSimple1/leaders/shard2/leader after winning as /collections/testSimple1/leader_elect/shard2/election/72973166701969415-core_node8-n_0000000000
[junit4] 2> 1483926 INFO (qtp697730379-25201) [n:127.0.0.1:42064_solr c:testSimple1 s:shard2 r:core_node8 x:testSimple1_shard2_replica_n6] o.a.s.c.ShardLeaderElectionContext I am the new leader: https://127.0.0.1:42064/solr/testSimple1_shard2_replica_n6/ shard2
[junit4] 2> 1484029 INFO (zkCallback-6601-thread-2) [ ] o.a.s.c.c.ZkStateReader A cluster state change: [WatchedEvent state:SyncConnected type:NodeDataChanged path:/collections/testSimple1/state.json] for collection [testSimple1] has occurred - updating... (live nodes size: [3])
[junit4] 2> 1484029 INFO (zkCallback-6601-thread-1) [ ] o.a.s.c.c.ZkStateReader A cluster state change: [WatchedEvent state:SyncConnected type:NodeDataChanged path:/collections/testSimple1/state.json] for collection [testSimple1] has occurred - updating... (live nodes size: [3])
[junit4] 2> 1484031 INFO (qtp697730379-25201) [n:127.0.0.1:42064_solr c:testSimple1 s:shard2 r:core_node8 x:testSimple1_shard2_replica_n6] o.a.s.c.ZkController I am the leader, no recovery necessary
[junit4] 2> 1484042 INFO (qtp697730379-25201) [n:127.0.0.1:42064_solr c:testSimple1 s:shard2 r:core_node8 x:testSimple1_shard2_replica_n6] o.a.s.s.HttpSolrCall [admin] webapp=null path=/admin/cores params={qt=/admin/cores&coreNodeName=core_node8&collection.configName=conf&newCollection=true&name=testSimple1_shard2_replica_n6&action=CREATE&numShards=2&collection=testSimple1&shard=shard2&wt=javabin&version=2&replicaType=NRT} status=0 QTime=1480
[junit4] 2> 1484139 INFO (zkCallback-6601-thread-1) [ ]
[...truncated too long message...]
set property disallowed.ivy.jars.list as its length is 0.
-ivy-fail-disallowed-ivy-version:
ivy-fail:
ivy-configure:
[ivy:configure] :: loading settings :: file = /x1/jenkins/jenkins-slave/workspace/Lucene-Solr-NightlyTests-master/checkout/lucene/top-level-ivy-settings.xml
resolve:
ivy-availability-check:
[loadresource] Do not set property disallowed.ivy.jars.list as its length is 0.
-ivy-fail-disallowed-ivy-version:
ivy-fail:
ivy-fail:
ivy-configure:
[ivy:configure] :: loading settings :: file = /x1/jenkins/jenkins-slave/workspace/Lucene-Solr-NightlyTests-master/checkout/lucene/top-level-ivy-settings.xml
resolve:
ivy-availability-check:
[loadresource] Do not set property disallowed.ivy.jars.list as its length is 0.
-ivy-fail-disallowed-ivy-version:
ivy-fail:
ivy-configure:
[ivy:configure] :: loading settings :: file = /x1/jenkins/jenkins-slave/workspace/Lucene-Solr-NightlyTests-master/checkout/lucene/top-level-ivy-settings.xml
resolve:
ivy-availability-check:
[loadresource] Do not set property disallowed.ivy.jars.list as its length is 0.
-ivy-fail-disallowed-ivy-version:
ivy-fail:
ivy-fail:
ivy-configure:
[ivy:configure] :: loading settings :: file = /x1/jenkins/jenkins-slave/workspace/Lucene-Solr-NightlyTests-master/checkout/lucene/top-level-ivy-settings.xml
resolve:
ivy-availability-check:
[loadresource] Do not set property disallowed.ivy.jars.list as its length is 0.
-ivy-fail-disallowed-ivy-version:
ivy-fail:
ivy-fail:
ivy-configure:
[ivy:configure] :: loading settings :: file = /x1/jenkins/jenkins-slave/workspace/Lucene-Solr-NightlyTests-master/checkout/lucene/top-level-ivy-settings.xml
resolve:
ivy-availability-check:
[loadresource] Do not set property disallowed.ivy.jars.list as its length is 0.
-ivy-fail-disallowed-ivy-version:
ivy-fail:
ivy-fail:
ivy-configure:
[ivy:configure] :: loading settings :: file = /x1/jenkins/jenkins-slave/workspace/Lucene-Solr-NightlyTests-master/checkout/lucene/top-level-ivy-settings.xml
resolve:
ivy-availability-check:
[loadresource] Do not set property disallowed.ivy.jars.list as its length is 0.
-ivy-fail-disallowed-ivy-version:
ivy-fail:
ivy-fail:
ivy-configure:
[ivy:configure] :: loading settings :: file = /x1/jenkins/jenkins-slave/workspace/Lucene-Solr-NightlyTests-master/checkout/lucene/top-level-ivy-settings.xml
resolve:
ivy-availability-check:
[loadresource] Do not set property disallowed.ivy.jars.list as its length is 0.
-ivy-fail-disallowed-ivy-version:
ivy-fail:
ivy-fail:
ivy-configure:
[ivy:configure] :: loading settings :: file = /x1/jenkins/jenkins-slave/workspace/Lucene-Solr-NightlyTests-master/checkout/lucene/top-level-ivy-settings.xml
resolve:
ivy-availability-check:
[loadresource] Do not set property disallowed.ivy.jars.list as its length is 0.
-ivy-fail-disallowed-ivy-version:
ivy-fail:
ivy-fail:
ivy-configure:
[ivy:configure] :: loading settings :: file = /x1/jenkins/jenkins-slave/workspace/Lucene-Solr-NightlyTests-master/checkout/lucene/top-level-ivy-settings.xml
resolve:
ivy-availability-check:
[loadresource] Do not set property disallowed.ivy.jars.list as its length is 0.
-ivy-fail-disallowed-ivy-version:
ivy-fail:
ivy-fail:
ivy-configure:
[ivy:configure] :: loading settings :: file = /x1/jenkins/jenkins-slave/workspace/Lucene-Solr-NightlyTests-master/checkout/lucene/top-level-ivy-settings.xml
resolve:
ivy-availability-check:
[loadresource] Do not set property disallowed.ivy.jars.list as its length is 0.
-ivy-fail-disallowed-ivy-version:
ivy-fail:
ivy-fail:
ivy-configure:
[ivy:configure] :: loading settings :: file = /x1/jenkins/jenkins-slave/workspace/Lucene-Solr-NightlyTests-master/checkout/lucene/top-level-ivy-settings.xml
resolve:
ivy-availability-check:
[loadresource] Do not set property disallowed.ivy.jars.list as its length is 0.
-ivy-fail-disallowed-ivy-version:
ivy-fail:
ivy-fail:
ivy-configure:
[ivy:configure] :: loading settings :: file = /x1/jenkins/jenkins-slave/workspace/Lucene-Solr-NightlyTests-master/checkout/lucene/top-level-ivy-settings.xml
resolve:
ivy-availability-check:
[loadresource] Do not set property disallowed.ivy.jars.list as its length is 0.
-ivy-fail-disallowed-ivy-version:
ivy-fail:
ivy-fail:
ivy-configure:
[ivy:configure] :: loading settings :: file = /x1/jenkins/jenkins-slave/workspace/Lucene-Solr-NightlyTests-master/checkout/lucene/top-level-ivy-settings.xml
resolve:
jar-checksums:
[mkdir] Created dir: /x1/jenkins/jenkins-slave/workspace/Lucene-Solr-NightlyTests-master/checkout/solr/null266384507
[copy] Copying 239 files to /x1/jenkins/jenkins-slave/workspace/Lucene-Solr-NightlyTests-master/checkout/solr/null266384507
[delete] Deleting directory /x1/jenkins/jenkins-slave/workspace/Lucene-Solr-NightlyTests-master/checkout/solr/null266384507
check-working-copy:
[ivy:cachepath] :: resolving dependencies :: org.eclipse.jgit#org.eclipse.jgit-caller;working
[ivy:cachepath] confs: [default]
[ivy:cachepath] found org.eclipse.jgit#org.eclipse.jgit;4.6.0.201612231935-r in public
[ivy:cachepath] found com.jcraft#jsch;0.1.53 in public
[ivy:cachepath] found com.googlecode.javaewah#JavaEWAH;1.1.6 in public
[ivy:cachepath] found org.apache.httpcomponents#httpclient;4.3.6 in public
[ivy:cachepath] found org.apache.httpcomponents#httpcore;4.3.3 in public
[ivy:cachepath] found commons-logging#commons-logging;1.1.3 in public
[ivy:cachepath] found commons-codec#commons-codec;1.6 in public
[ivy:cachepath] found org.slf4j#slf4j-api;1.7.2 in public
[ivy:cachepath] :: resolution report :: resolve 40ms :: artifacts dl 2ms
---------------------------------------------------------------------
| | modules || artifacts |
| conf | number| search|dwnlded|evicted|| number|dwnlded|
---------------------------------------------------------------------
| default | 8 | 0 | 0 | 0 || 8 | 0 |
---------------------------------------------------------------------
[wc-checker] Initializing working copy...
[wc-checker] SLF4J: Failed to load class "org.slf4j.impl.StaticLoggerBinder".
[wc-checker] SLF4J: Defaulting to no-operation (NOP) logger implementation
[wc-checker] SLF4J: See http://www.slf4j.org/codes.html#StaticLoggerBinder for further details.
[wc-checker] Checking working copy status...
-jenkins-base:
BUILD SUCCESSFUL
Total time: 328 minutes 21 seconds
Archiving artifacts
java.lang.InterruptedException: no matches found within 10000
at hudson.FilePath$ValidateAntFileMask.hasMatch(FilePath.java:2847)
at hudson.FilePath$ValidateAntFileMask.invoke(FilePath.java:2726)
at hudson.FilePath$ValidateAntFileMask.invoke(FilePath.java:2707)
at hudson.FilePath$FileCallableWrapper.call(FilePath.java:3086)
Also: hudson.remoting.Channel$CallSiteStackTrace: Remote call to lucene
at hudson.remoting.Channel.attachCallSiteStackTrace(Channel.java:1741)
at hudson.remoting.UserRequest$ExceptionResponse.retrieve(UserRequest.java:357)
at hudson.remoting.Channel.call(Channel.java:955)
at hudson.FilePath.act(FilePath.java:1072)
at hudson.FilePath.act(FilePath.java:1061)
at hudson.FilePath.validateAntFileMask(FilePath.java:2705)
at hudson.tasks.ArtifactArchiver.perform(ArtifactArchiver.java:243)
at hudson.tasks.BuildStepCompatibilityLayer.perform(BuildStepCompatibilityLayer.java:81)
at hudson.tasks.BuildStepMonitor$1.perform(BuildStepMonitor.java:20)
at hudson.model.AbstractBuild$AbstractBuildExecution.perform(AbstractBuild.java:744)
at hudson.model.AbstractBuild$AbstractBuildExecution.performAllBuildSteps(AbstractBuild.java:690)
at hudson.model.Build$BuildExecution.post2(Build.java:186)
at hudson.model.AbstractBuild$AbstractBuildExecution.post(AbstractBuild.java:635)
at hudson.model.Run.execute(Run.java:1835)
at hudson.model.FreeStyleBuild.run(FreeStyleBuild.java:43)
at hudson.model.ResourceController.execute(ResourceController.java:97)
at hudson.model.Executor.run(Executor.java:429)
Caused: hudson.FilePath$TunneledInterruptedException
at hudson.FilePath$FileCallableWrapper.call(FilePath.java:3088)
at hudson.remoting.UserRequest.perform(UserRequest.java:212)
at hudson.remoting.UserRequest.perform(UserRequest.java:54)
at hudson.remoting.Request$2.run(Request.java:369)
at hudson.remoting.InterceptingExecutorService$1.call(InterceptingExecutorService.java:72)
at java.util.concurrent.FutureTask.run(FutureTask.java:266)
at java.util.concurrent.ThreadPoolExecutor.runWorker(ThreadPoolExecutor.java:1142)
at java.util.concurrent.ThreadPoolExecutor$Worker.run(ThreadPoolExecutor.java:617)
at java.lang.Thread.run(Thread.java:748)
Caused: java.lang.InterruptedException: java.lang.InterruptedException: no matches found within 10000
at hudson.FilePath.act(FilePath.java:1074)
at hudson.FilePath.act(FilePath.java:1061)
at hudson.FilePath.validateAntFileMask(FilePath.java:2705)
at hudson.tasks.ArtifactArchiver.perform(ArtifactArchiver.java:243)
at hudson.tasks.BuildStepCompatibilityLayer.perform(BuildStepCompatibilityLayer.java:81)
at hudson.tasks.BuildStepMonitor$1.perform(BuildStepMonitor.java:20)
at hudson.model.AbstractBuild$AbstractBuildExecution.perform(AbstractBuild.java:744)
at hudson.model.AbstractBuild$AbstractBuildExecution.performAllBuildSteps(AbstractBuild.java:690)
at hudson.model.Build$BuildExecution.post2(Build.java:186)
at hudson.model.AbstractBuild$AbstractBuildExecution.post(AbstractBuild.java:635)
at hudson.model.Run.execute(Run.java:1835)
at hudson.model.FreeStyleBuild.run(FreeStyleBuild.java:43)
at hudson.model.ResourceController.execute(ResourceController.java:97)
at hudson.model.Executor.run(Executor.java:429)
No artifacts found that match the file pattern "**/*.events,heapdumps/**,**/hs_err_pid*". Configuration error?
Recording test results
Build step 'Publish JUnit test result report' changed build result to UNSTABLE
Email was triggered for: Unstable (Test Failures)
Sending email for trigger: Unstable (Test Failures)