You are viewing a plain text version of this content. The canonical link for it is here.
Posted to commits@hudi.apache.org by "Ethan Guo (Jira)" <ji...@apache.org> on 2024/04/13 20:09:00 UTC

[jira] [Updated] (HUDI-7467) TestHoodieDeltaStreamer. testAutoGenerateRecordKeys

     [ https://issues.apache.org/jira/browse/HUDI-7467?page=com.atlassian.jira.plugin.system.issuetabpanels:all-tabpanel ]

Ethan Guo updated HUDI-7467:
----------------------------
    Description: 
This test is flaky and sometimes it fails in Azure CI.  We need to reproduce it locally and check why it is flaky (if there is any bug causing it, or it's due to test setup).

[https://dev.azure.com/apache-hudi-ci-org/apache-hudi-ci/_build/results?buildId=22725&view=logs&j=dcedfe73-9485-5cc5-817a-73b61fc5dcb0&t=9df7def4-004b-5fb7-f042-da5d723783ad&s=859b8d9a-8fd6-5a5c-6f5e-f84f1990894e]
{code:java}
[ERROR] Tests run: 131, Failures: 1, Errors: 0, Skipped: 2, Time elapsed: 2,459.289 s <<< FAILURE! - in org.apache.hudi.utilities.deltastreamer.TestHoodieDeltaStreamer
[ERROR] testAutoGenerateRecordKeys  Time elapsed: 14.248 s  <<< FAILURE!
org.opentest4j.AssertionFailedError: expected: <300> but was: <500>
	at org.junit.jupiter.api.AssertionUtils.fail(AssertionUtils.java:55)
	at org.junit.jupiter.api.AssertionUtils.failNotEqual(AssertionUtils.java:62)
	at org.junit.jupiter.api.AssertEquals.assertEquals(AssertEquals.java:166)
	at org.junit.jupiter.api.AssertEquals.assertEquals(AssertEquals.java:161)
	at org.junit.jupiter.api.Assertions.assertEquals(Assertions.java:611)
	at org.apache.hudi.utilities.deltastreamer.HoodieDeltaStreamerTestBase.assertRecordCount(HoodieDeltaStreamerTestBase.java:486)
	at org.apache.hudi.utilities.deltastreamer.TestHoodieDeltaStreamer.testAutoGenerateRecordKeys(TestHoodieDeltaStreamer.java:2823) {code}

  was:
https://dev.azure.com/apache-hudi-ci-org/apache-hudi-ci/_build/results?buildId=22725&view=logs&j=dcedfe73-9485-5cc5-817a-73b61fc5dcb0&t=9df7def4-004b-5fb7-f042-da5d723783ad&s=859b8d9a-8fd6-5a5c-6f5e-f84f1990894e
{code:java}
[ERROR] Tests run: 131, Failures: 1, Errors: 0, Skipped: 2, Time elapsed: 2,459.289 s <<< FAILURE! - in org.apache.hudi.utilities.deltastreamer.TestHoodieDeltaStreamer
[ERROR] testAutoGenerateRecordKeys  Time elapsed: 14.248 s  <<< FAILURE!
org.opentest4j.AssertionFailedError: expected: <300> but was: <500>
	at org.junit.jupiter.api.AssertionUtils.fail(AssertionUtils.java:55)
	at org.junit.jupiter.api.AssertionUtils.failNotEqual(AssertionUtils.java:62)
	at org.junit.jupiter.api.AssertEquals.assertEquals(AssertEquals.java:166)
	at org.junit.jupiter.api.AssertEquals.assertEquals(AssertEquals.java:161)
	at org.junit.jupiter.api.Assertions.assertEquals(Assertions.java:611)
	at org.apache.hudi.utilities.deltastreamer.HoodieDeltaStreamerTestBase.assertRecordCount(HoodieDeltaStreamerTestBase.java:486)
	at org.apache.hudi.utilities.deltastreamer.TestHoodieDeltaStreamer.testAutoGenerateRecordKeys(TestHoodieDeltaStreamer.java:2823) {code}


> TestHoodieDeltaStreamer. testAutoGenerateRecordKeys
> ---------------------------------------------------
>
>                 Key: HUDI-7467
>                 URL: https://issues.apache.org/jira/browse/HUDI-7467
>             Project: Apache Hudi
>          Issue Type: Bug
>            Reporter: Lin Liu
>            Assignee: tao pan
>            Priority: Major
>
> This test is flaky and sometimes it fails in Azure CI.  We need to reproduce it locally and check why it is flaky (if there is any bug causing it, or it's due to test setup).
> [https://dev.azure.com/apache-hudi-ci-org/apache-hudi-ci/_build/results?buildId=22725&view=logs&j=dcedfe73-9485-5cc5-817a-73b61fc5dcb0&t=9df7def4-004b-5fb7-f042-da5d723783ad&s=859b8d9a-8fd6-5a5c-6f5e-f84f1990894e]
> {code:java}
> [ERROR] Tests run: 131, Failures: 1, Errors: 0, Skipped: 2, Time elapsed: 2,459.289 s <<< FAILURE! - in org.apache.hudi.utilities.deltastreamer.TestHoodieDeltaStreamer
> [ERROR] testAutoGenerateRecordKeys  Time elapsed: 14.248 s  <<< FAILURE!
> org.opentest4j.AssertionFailedError: expected: <300> but was: <500>
> 	at org.junit.jupiter.api.AssertionUtils.fail(AssertionUtils.java:55)
> 	at org.junit.jupiter.api.AssertionUtils.failNotEqual(AssertionUtils.java:62)
> 	at org.junit.jupiter.api.AssertEquals.assertEquals(AssertEquals.java:166)
> 	at org.junit.jupiter.api.AssertEquals.assertEquals(AssertEquals.java:161)
> 	at org.junit.jupiter.api.Assertions.assertEquals(Assertions.java:611)
> 	at org.apache.hudi.utilities.deltastreamer.HoodieDeltaStreamerTestBase.assertRecordCount(HoodieDeltaStreamerTestBase.java:486)
> 	at org.apache.hudi.utilities.deltastreamer.TestHoodieDeltaStreamer.testAutoGenerateRecordKeys(TestHoodieDeltaStreamer.java:2823) {code}



--
This message was sent by Atlassian Jira
(v8.20.10#820010)