You are viewing a plain text version of this content. The canonical link for it is here.
Posted to notifications@maven.apache.org by Apache Jenkins Server <je...@builds.apache.org> on 2020/01/16 10:14:01 UTC

Build failed in Jenkins: Maven TLP » maven-project-info-reports-plugin » MPIR-385 #4

See https://builds.apache.org/job/maven-box/job/maven-project-info-reports-plugin/job/MPIR-385/4/

Changes:

* Add JDK 15
* Add Maven 3.6.3

No tests ran.

Build log:
Branch indexing
Obtained Jenkinsfile from a15271a904bc768b50ea751e0b363cfa042289f3
Running in Durability level: MAX_SURVIVABILITY
Loading library jenkins-env@master
Attempting to resolve master from remote references...
 > git --version # timeout=10
 > git ls-remote -h https://gitbox.apache.org/repos/asf/maven-jenkins-env.git # timeout=10
Found match: refs/heads/master revision 60cdcce21e0f2ffbb7982b6bcb3085938bc43694
No credentials specified
 > git rev-parse --is-inside-work-tree # timeout=10
Fetching changes from the remote Git repository
 > git config remote.origin.url https://gitbox.apache.org/repos/asf/maven-jenkins-env.git # timeout=10
Fetching without tags
Fetching upstream changes from https://gitbox.apache.org/repos/asf/maven-jenkins-env.git
 > git --version # timeout=10
 > git fetch --no-tags --progress https://gitbox.apache.org/repos/asf/maven-jenkins-env.git +refs/heads/*:refs/remotes/origin/*
Checking out Revision 60cdcce21e0f2ffbb7982b6bcb3085938bc43694 (master)
 > git config core.sparsecheckout # timeout=10
 > git checkout -f 60cdcce21e0f2ffbb7982b6bcb3085938bc43694
Commit message: "Add Maven 3.6.3"
 > git rev-list --no-walk 7765a90edaad26e06bc4c32b05b561342f8db351 # timeout=10
Loading library jenkins-lib@master
Attempting to resolve master from remote references...
 > git --version # timeout=10
 > git ls-remote -h https://gitbox.apache.org/repos/asf/maven-jenkins-lib.git # timeout=10
Found match: refs/heads/master revision 57fbd117325ce13ef69bd591f457300c75dfc13b
No credentials specified
 > git rev-parse --is-inside-work-tree # timeout=10
Fetching changes from the remote Git repository
 > git config remote.origin.url https://gitbox.apache.org/repos/asf/maven-jenkins-lib.git # timeout=10
Fetching without tags
Fetching upstream changes from https://gitbox.apache.org/repos/asf/maven-jenkins-lib.git
 > git --version # timeout=10
 > git fetch --no-tags --progress https://gitbox.apache.org/repos/asf/maven-jenkins-lib.git +refs/heads/*:refs/remotes/origin/*
Checking out Revision 57fbd117325ce13ef69bd591f457300c75dfc13b (master)
 > git config core.sparsecheckout # timeout=10
 > git checkout -f 57fbd117325ce13ef69bd591f457300c75dfc13b
Commit message: "echo NODE_NAME"
 > git rev-list --no-walk 57fbd117325ce13ef69bd591f457300c75dfc13b # timeout=10
[Pipeline] Start of Pipeline
[Pipeline] properties
[Pipeline] echo
OS: linux JDK: 7 Maven: 3.2.x => Label: ubuntu && !H30 JDK: JDK 1.7 (latest) Maven: Maven 3.2.5
[Pipeline] echo
OS: linux JDK: 7 Maven: 3.3.x => Label: ubuntu && !H30 JDK: JDK 1.7 (latest) Maven: Maven 3.3.9
[Pipeline] echo
OS: linux JDK: 7 Maven: 3.5.x => Label: ubuntu && !H30 JDK: JDK 1.7 (latest) Maven: Maven 3.5.4
[Pipeline] echo
OS: linux JDK: 7 Maven: 3.6.x => Label: ubuntu && !H30 JDK: JDK 1.7 (latest) Maven: Maven 3.6.2
[Pipeline] echo
OS: linux JDK: 8 Maven: 3.6.x => Label: ubuntu && !H30 JDK: JDK 1.8 (latest) Maven: Maven 3.6.2
[Pipeline] echo
OS: linux JDK: 11 Maven: 3.6.x => Label: ubuntu && !H30 JDK: JDK 11 (latest) Maven: Maven 3.6.2
[Pipeline] echo
OS: linux JDK: 13 Maven: 3.6.x => Label: ubuntu && !H30 JDK: JDK 13 (latest) Maven: Maven 3.6.2
[Pipeline] echo
OS: linux JDK: 14 Maven: 3.6.x => Label: ubuntu && !H30 JDK: JDK 14 (latest) Maven: Maven 3.6.2
[Pipeline] echo
OS: windows JDK: 7 Maven: 3.2.x => Label: Windows JDK: JDK 1.7 (latest) Maven: Maven 3.2.5 (Windows)
[Pipeline] echo
OS: windows JDK: 7 Maven: 3.3.x => Label: Windows JDK: JDK 1.7 (latest) Maven: Maven 3.3.9 (Windows)
[Pipeline] echo
OS: windows JDK: 7 Maven: 3.5.x => Label: Windows JDK: JDK 1.7 (latest) Maven: Maven 3.5.2 (Windows)
[Pipeline] echo
OS: windows JDK: 7 Maven: 3.6.x => Label: Windows JDK: JDK 1.7 (latest) Maven: Maven 3.6.2 (Windows)
[Pipeline] echo
OS: windows JDK: 8 Maven: 3.6.x => Label: Windows JDK: JDK 1.8 (latest) Maven: Maven 3.6.2 (Windows)
[Pipeline] echo
OS: windows JDK: 11 Maven: 3.6.x => Label: Windows JDK: JDK 11 (latest) Maven: Maven 3.6.2 (Windows)
[Pipeline] echo
OS: windows JDK: 13 Maven: 3.6.x => Label: Windows JDK: JDK 13 (latest) Maven: Maven 3.6.2 (Windows)
[Pipeline] echo
OS: windows JDK: 14 Maven: 3.6.x => Label: Windows JDK: JDK 14 (latest) Maven: Maven 3.6.2 (Windows)
[Pipeline] parallel
[Pipeline] { (Branch: linux-jdk7-m3.2.x_build)
[Pipeline] { (Branch: linux-jdk7-m3.3.x_build)
[Pipeline] { (Branch: linux-jdk7-m3.5.x_build)
[Pipeline] { (Branch: linux-jdk7-m3.6.x_build)
[Pipeline] { (Branch: linux-jdk8-m3.6.x_build)
[Pipeline] { (Branch: linux-jdk11-m3.6.x_build)
[Pipeline] { (Branch: linux-jdk13-m3.6.x_build)
[Pipeline] { (Branch: linux-jdk14-m3.6.x_build)
[Pipeline] { (Branch: windows-jdk7-m3.2.x_build)
[Pipeline] { (Branch: windows-jdk7-m3.3.x_build)
[Pipeline] { (Branch: windows-jdk7-m3.5.x_build)
[Pipeline] { (Branch: windows-jdk7-m3.6.x_build)
[Pipeline] { (Branch: windows-jdk8-m3.6.x_build)
[Pipeline] { (Branch: windows-jdk11-m3.6.x_build)
[Pipeline] { (Branch: windows-jdk13-m3.6.x_build)
[Pipeline] { (Branch: windows-jdk14-m3.6.x_build)
[Pipeline] node
[Pipeline] node
[Pipeline] node
[Pipeline] node
[Pipeline] node
[Pipeline] node
[Pipeline] node
[Pipeline] node
[Pipeline] node
[Pipeline] node
[Pipeline] node
[Pipeline] node
[Pipeline] node
[Pipeline] node
[Pipeline] node
[Pipeline] node
Still waiting to schedule task
Waiting for next available executor on ‘ubuntu&&!H30’
Still waiting to schedule task
Waiting for next available executor on ‘ubuntu&&!H30’
Still waiting to schedule task
Waiting for next available executor on ‘ubuntu&&!H30’
Still waiting to schedule task
Waiting for next available executor on ‘ubuntu&&!H30’
Still waiting to schedule task
Waiting for next available executor on ‘ubuntu&&!H30’
Still waiting to schedule task
Waiting for next available executor on ‘ubuntu&&!H30’
Still waiting to schedule task
Waiting for next available executor on ‘ubuntu&&!H30’
Still waiting to schedule task
Waiting for next available executor on ‘ubuntu&&!H30’
Still waiting to schedule task
Waiting for next available executor on ‘Windows’
Still waiting to schedule task
Waiting for next available executor on ‘Windows’
Still waiting to schedule task
Waiting for next available executor on ‘Windows’
Still waiting to schedule task
Waiting for next available executor on ‘Windows’
Still waiting to schedule task
Waiting for next available executor on ‘Windows’
Still waiting to schedule task
Waiting for next available executor on ‘Windows’
Still waiting to schedule task
Waiting for next available executor on ‘Windows’
Still waiting to schedule task
Waiting for next available executor on ‘Windows’
Aborted by slachiewicz
[Pipeline] // node
[Pipeline] // node
[Pipeline] // node
[Pipeline] // node
[Pipeline] // node
[Pipeline] // node
[Pipeline] // node
[Pipeline] // node
[Pipeline] // node
[Pipeline] // node
[Pipeline] // node
[Pipeline] // node
[Pipeline] // node
[Pipeline] // node
[Pipeline] // node
[Pipeline] // node
[Pipeline] }
Failed in branch linux-jdk7-m3.2.x_build
[Pipeline] }
Failed in branch linux-jdk7-m3.3.x_build
[Pipeline] }
Failed in branch linux-jdk7-m3.5.x_build
[Pipeline] }
Failed in branch linux-jdk7-m3.6.x_build
[Pipeline] }
Failed in branch linux-jdk8-m3.6.x_build
[Pipeline] }
Failed in branch linux-jdk11-m3.6.x_build
[Pipeline] }
Failed in branch linux-jdk13-m3.6.x_build
[Pipeline] }
Failed in branch linux-jdk14-m3.6.x_build
[Pipeline] }
Failed in branch windows-jdk7-m3.2.x_build
[Pipeline] }
Failed in branch windows-jdk7-m3.3.x_build
[Pipeline] }
Failed in branch windows-jdk7-m3.5.x_build
[Pipeline] }
Failed in branch windows-jdk7-m3.6.x_build
[Pipeline] }
Failed in branch windows-jdk8-m3.6.x_build
[Pipeline] }
Failed in branch windows-jdk11-m3.6.x_build
[Pipeline] }
Failed in branch windows-jdk13-m3.6.x_build
[Pipeline] }
Failed in branch windows-jdk14-m3.6.x_build
[Pipeline] // parallel
[Pipeline] stage
[Pipeline] { (Notifications)
[Pipeline] echo
Build result: FAILURE
[Pipeline] jiraIssueSelector
[Pipeline] echo
The authors of changes [slachiewicz].
[Pipeline] echo
Sending email ...
[Pipeline] emailext

Build succeeded in Jenkins: Maven TLP » maven-project-info-reports-plugin » MPIR-385 #6

Posted by Apache Jenkins Server <je...@builds.apache.org>.
See https://builds.apache.org/job/maven-box/job/maven-project-info-reports-plugin/job/MPIR-385/6/

No changes.

All tests passed

Build failed in Jenkins: Maven TLP » maven-project-info-reports-plugin » MPIR-385 #5

Posted by Apache Jenkins Server <je...@builds.apache.org>.
See https://builds.apache.org/job/maven-box/job/maven-project-info-reports-plugin/job/MPIR-385/5/

Changes:

* H30 is having issues

All tests passed

Build log:
[...truncated 4002 lines...]
[withMaven] junitPublisher - Archive test results for Maven artifact org.apache.maven.plugins:maven-project-info-reports-plugin:maven-plugin:3.0.2-SNAPSHOT generated by maven-surefire-plugin:test (default-test): linux-jdk11-m3.6.x_build/target/surefire-reports/*.xml
Recording test results
[withMaven] junitPublisher - Archive test results for Maven artifact org.apache.maven.plugins:maven-project-info-reports-plugin:maven-plugin:3.0.2-SNAPSHOT generated by maven-surefire-plugin:test (default-test): linux-jdk7-m3.5.x_build/target/surefire-reports/*.xml
Recording test results
[withMaven] junitPublisher - Archive test results for Maven artifact org.apache.maven.plugins:maven-project-info-reports-plugin:maven-plugin:3.0.2-SNAPSHOT generated by maven-surefire-plugin:test (default-test): linux-jdk7-m3.2.x_build/target/surefire-reports/*.xml
Recording test results
[withMaven] junitPublisher - Archive test results for Maven artifact org.apache.maven.plugins:maven-project-info-reports-plugin:maven-plugin:3.0.2-SNAPSHOT generated by maven-surefire-plugin:test (default-test): linux-jdk13-m3.6.x_build/target/surefire-reports/*.xml
Recording test results
ERROR: Cannot delete workspace :Unable to delete 'f:\jenkins\jenkins-slave\workspace\ect-info-reports-plugin_MPIR-385@2'. Tried 3 times (of a maximum of 3) waiting 0.1 sec between attempts.
ERROR: Cannot delete workspace :Unable to delete 'f:\jenkins\jenkins-slave\workspace\ect-info-reports-plugin_MPIR-385@2'. Tried 3 times (of a maximum of 3) waiting 0.1 sec between attempts.
[withMaven] junitPublisher - Archive test results for Maven artifact org.apache.maven.plugins:maven-project-info-reports-plugin:maven-plugin:3.0.2-SNAPSHOT generated by maven-surefire-plugin:test (default-test): linux-jdk7-m3.3.x_build/target/surefire-reports/*.xml
Recording test results
[withMaven] openTasksPublisher - Scan Tasks for Maven artifact org.apache.maven.plugins:maven-project-info-reports-plugin:maven-plugin:3.0.2-SNAPSHOT in source directory linux-jdk8-m3.6.x_build/src/main/java
[TASKS] Scanning folder '/home/jenkins/jenkins-slave/workspace/ect-info-reports-plugin_MPIR-385@2' for files matching the pattern 'linux-jdk8-m3.6.x_build/src/main/java/**/*' - excludes: null
[TASKS] Found 27 files to scan for tasks
[TASKS] Found 13 open tasks.
Skipping warnings blame since pipelines do not have an SCM link.%n
[TASKS] Computing warning deltas based on reference build #1
[withMaven] invokerPublisher - Archive invoker results for Maven artifact MavenArtifact{org.apache.maven.plugins:maven-project-info-reports-plugin:maven-plugin:3.0.2-SNAPSHOT(version: 3.0.2-SNAPSHOT, snapshot:false) } generated by PluginInvocation{org.apache.maven.plugins:maven-invoker-plugin:3.1.0@integration-test  integration-test}: linux-jdk8-m3.6.x_build/target/invoker-reports/*.xml
[withMaven] openTasksPublisher - Scan Tasks for Maven artifact org.apache.maven.plugins:maven-project-info-reports-plugin:maven-plugin:3.0.2-SNAPSHOT in source directory linux-jdk7-m3.3.x_build/src/main/java
[TASKS] Scanning folder '/home/jenkins/jenkins-slave/workspace/ect-info-reports-plugin_MPIR-385@2' for files matching the pattern 'linux-jdk7-m3.3.x_build/src/main/java/**/*' - excludes: null
[TASKS] Found 27 files to scan for tasks
[TASKS] Found 13 open tasks.
Skipping warnings blame since pipelines do not have an SCM link.%n
[TASKS] Computing warning deltas based on reference build #1
[withMaven] invokerPublisher - Archive invoker results for Maven artifact MavenArtifact{org.apache.maven.plugins:maven-project-info-reports-plugin:maven-plugin:3.0.2-SNAPSHOT(version: 3.0.2-SNAPSHOT, snapshot:false) } generated by PluginInvocation{org.apache.maven.plugins:maven-invoker-plugin:3.1.0@integration-test  integration-test}: linux-jdk7-m3.3.x_build/target/invoker-reports/*.xml
[withMaven] openTasksPublisher - Scan Tasks for Maven artifact org.apache.maven.plugins:maven-project-info-reports-plugin:maven-plugin:3.0.2-SNAPSHOT in source directory linux-jdk13-m3.6.x_build/src/main/java
[TASKS] Scanning folder '/home/jenkins/jenkins-slave/workspace/ect-info-reports-plugin_MPIR-385@2' for files matching the pattern 'linux-jdk13-m3.6.x_build/src/main/java/**/*' - excludes: null
[TASKS] Found 27 files to scan for tasks
[TASKS] Found 13 open tasks.
Skipping warnings blame since pipelines do not have an SCM link.%n
[TASKS] Computing warning deltas based on reference build #1
[withMaven] invokerPublisher - Archive invoker results for Maven artifact MavenArtifact{org.apache.maven.plugins:maven-project-info-reports-plugin:maven-plugin:3.0.2-SNAPSHOT(version: 3.0.2-SNAPSHOT, snapshot:false) } generated by PluginInvocation{org.apache.maven.plugins:maven-invoker-plugin:3.1.0@integration-test  integration-test}: linux-jdk13-m3.6.x_build/target/invoker-reports/*.xml
[withMaven] openTasksPublisher - Scan Tasks for Maven artifact org.apache.maven.plugins:maven-project-info-reports-plugin:maven-plugin:3.0.2-SNAPSHOT in source directory linux-jdk7-m3.2.x_build/src/main/java
[TASKS] Scanning folder '/home/jenkins/jenkins-slave/workspace/ect-info-reports-plugin_MPIR-385@2' for files matching the pattern 'linux-jdk7-m3.2.x_build/src/main/java/**/*' - excludes: null
[TASKS] Found 27 files to scan for tasks
[TASKS] Found 13 open tasks.
Skipping warnings blame since pipelines do not have an SCM link.%n
[TASKS] Computing warning deltas based on reference build #1
[withMaven] invokerPublisher - Archive invoker results for Maven artifact MavenArtifact{org.apache.maven.plugins:maven-project-info-reports-plugin:maven-plugin:3.0.2-SNAPSHOT(version: 3.0.2-SNAPSHOT, snapshot:false) } generated by PluginInvocation{org.apache.maven.plugins:maven-invoker-plugin:3.1.0@integration-test  integration-test}: linux-jdk7-m3.2.x_build/target/invoker-reports/*.xml
[withMaven] openTasksPublisher - Scan Tasks for Maven artifact org.apache.maven.plugins:maven-project-info-reports-plugin:maven-plugin:3.0.2-SNAPSHOT in source directory linux-jdk7-m3.5.x_build/src/main/java
[TASKS] Scanning folder '/home/jenkins/jenkins-slave/workspace/ect-info-reports-plugin_MPIR-385@2' for files matching the pattern 'linux-jdk7-m3.5.x_build/src/main/java/**/*' - excludes: null
[TASKS] Found 27 files to scan for tasks
[TASKS] Found 13 open tasks.
Skipping warnings blame since pipelines do not have an SCM link.%n
[TASKS] Computing warning deltas based on reference build #1
[withMaven] invokerPublisher - Archive invoker results for Maven artifact MavenArtifact{org.apache.maven.plugins:maven-project-info-reports-plugin:maven-plugin:3.0.2-SNAPSHOT(version: 3.0.2-SNAPSHOT, snapshot:false) } generated by PluginInvocation{org.apache.maven.plugins:maven-invoker-plugin:3.1.0@integration-test  integration-test}: linux-jdk7-m3.5.x_build/target/invoker-reports/*.xml
[Pipeline] }
Failed in branch windows-jdk11-m3.6.x_build
[Pipeline] }
[Pipeline] cleanWs
[Pipeline] cleanWs
[WS-CLEANUP] Deleting project workspace...
[WS-CLEANUP] Deferred wipeout is used...
[WS-CLEANUP] Deleting project workspace...
[WS-CLEANUP] Deferred wipeout is used...
[Pipeline] // stage
[Pipeline] }
ERROR: ERROR: [withMaven] WARNING Exception executing Maven reporter 'Pipeline Graph Publisher' / org.jenkinsci.plugins.pipeline.maven.publishers.PipelineGraphPublisher. Please report a bug associated for the component 'pipeline-maven-plugin' at https://issues.jenkins-ci.org 
[withMaven] WARNING Exception executing Maven reporter 'Pipeline Graph Publisher' / org.jenkinsci.plugins.pipeline.maven.publishers.PipelineGraphPublisher. Please report a bug associated for the component 'pipeline-maven-plugin' at https://issues.jenkins-ci.org 
org.jenkinsci.plugins.pipeline.maven.util.RuntimeSqlException: org.h2.jdbc.JdbcSQLIntegrityConstraintViolationException: Unique index or primary key violation: "PUBLIC.IDX_JENKINS_BUILD ON PUBLIC.JENKINS_BUILD(JOB_ID, NUMBER) VALUES 256097"; SQL statement:
INSERT INTO JENKINS_BUILD(JOB_ID, NUMBER) VALUES (?, ?) [23505-199]
org.jenkinsci.plugins.pipeline.maven.util.RuntimeSqlException: org.h2.jdbc.JdbcSQLIntegrityConstraintViolationException: Unique index or primary key violation: "PUBLIC.IDX_JENKINS_BUILD ON PUBLIC.JENKINS_BUILD(JOB_ID, NUMBER) VALUES 256097"; SQL statement:
INSERT INTO JENKINS_BUILD(JOB_ID, NUMBER) VALUES (?, ?) [23505-199]
	at org.jenkinsci.plugins.pipeline.maven.dao.AbstractPipelineMavenPluginDao.getOrCreateBuildPrimaryKey(AbstractPipelineMavenPluginDao.java:398)
	at org.jenkinsci.plugins.pipeline.maven.dao.AbstractPipelineMavenPluginDao.getOrCreateBuildPrimaryKey(AbstractPipelineMavenPluginDao.java:398)
	at org.jenkinsci.plugins.pipeline.maven.dao.AbstractPipelineMavenPluginDao.recordGeneratedArtifact(AbstractPipelineMavenPluginDao.java:184)
	at org.jenkinsci.plugins.pipeline.maven.dao.AbstractPipelineMavenPluginDao.recordGeneratedArtifact(AbstractPipelineMavenPluginDao.java:184)
	at org.jenkinsci.plugins.pipeline.maven.dao.PipelineMavenPluginMonitoringDao.recordGeneratedArtifact(PipelineMavenPluginMonitoringDao.java:61)
	at org.jenkinsci.plugins.pipeline.maven.dao.PipelineMavenPluginMonitoringDao.recordGeneratedArtifact(PipelineMavenPluginMonitoringDao.java:61)
	at org.jenkinsci.plugins.pipeline.maven.publishers.PipelineGraphPublisher.recordGeneratedArtifacts(PipelineGraphPublisher.java:215)
	at org.jenkinsci.plugins.pipeline.maven.publishers.PipelineGraphPublisher.recordGeneratedArtifacts(PipelineGraphPublisher.java:215)
	at org.jenkinsci.plugins.pipeline.maven.publishers.PipelineGraphPublisher.process(PipelineGraphPublisher.java:94)
	at org.jenkinsci.plugins.pipeline.maven.publishers.PipelineGraphPublisher.process(PipelineGraphPublisher.java:94)
	at org.jenkinsci.plugins.pipeline.maven.MavenSpyLogProcessor.processMavenSpyLogs(MavenSpyLogProcessor.java:154)
	at org.jenkinsci.plugins.pipeline.maven.MavenSpyLogProcessor.processMavenSpyLogs(MavenSpyLogProcessor.java:154)
	at org.jenkinsci.plugins.pipeline.maven.WithMavenStepExecution2$WithMavenStepExecutionCallBack.finished(WithMavenStepExecution2.java:1108)
	at org.jenkinsci.plugins.pipeline.maven.WithMavenStepExecution2$WithMavenStepExecutionCallBack.finished(WithMavenStepExecution2.java:1108)
	at org.jenkinsci.plugins.pipeline.maven.fix.jenkins49337.GeneralNonBlockingStepExecution$TailCall.lambda$onSuccess$0(GeneralNonBlockingStepExecution.java:142)
	at org.jenkinsci.plugins.pipeline.maven.fix.jenkins49337.GeneralNonBlockingStepExecution$TailCall.lambda$onSuccess$0(GeneralNonBlockingStepExecution.java:142)
	at org.jenkinsci.plugins.pipeline.maven.fix.jenkins49337.GeneralNonBlockingStepExecution.lambda$run$0(GeneralNonBlockingStepExecution.java:85)
	at org.jenkinsci.plugins.pipeline.maven.fix.jenkins49337.GeneralNonBlockingStepExecution.lambda$run$0(GeneralNonBlockingStepExecution.java:85)
	at java.util.concurrent.Executors$RunnableAdapter.call(Executors.java:511)
	at java.util.concurrent.Executors$RunnableAdapter.call(Executors.java:511)
	at java.util.concurrent.FutureTask.run(FutureTask.java:266)
	at java.util.concurrent.FutureTask.run(FutureTask.java:266)
	at java.util.concurrent.ThreadPoolExecutor.runWorker(ThreadPoolExecutor.java:1149)
	at java.util.concurrent.ThreadPoolExecutor$Worker.run(ThreadPoolExecutor.java:624)
	at java.util.concurrent.ThreadPoolExecutor.runWorker(ThreadPoolExecutor.java:1149)
	at java.lang.Thread.run(Thread.java:748)
	at java.util.concurrent.ThreadPoolExecutor$Worker.run(ThreadPoolExecutor.java:624)
	at java.lang.Thread.run(Thread.java:748)
Caused by: org.h2.jdbc.JdbcSQLIntegrityConstraintViolationException: Unique index or primary key violation: "PUBLIC.IDX_JENKINS_BUILD ON PUBLIC.JENKINS_BUILD(JOB_ID, NUMBER) VALUES 256097"; SQL statement:
INSERT INTO JENKINS_BUILD(JOB_ID, NUMBER) VALUES (?, ?) [23505-199]
Caused by: org.h2.jdbc.JdbcSQLIntegrityConstraintViolationException: Unique index or primary key violation: "PUBLIC.IDX_JENKINS_BUILD ON PUBLIC.JENKINS_BUILD(JOB_ID, NUMBER) VALUES 256097"; SQL statement:
INSERT INTO JENKINS_BUILD(JOB_ID, NUMBER) VALUES (?, ?) [23505-199]
	at org.h2.message.DbException.getJdbcSQLException(DbException.java:457)
	at org.h2.message.DbException.getJdbcSQLException(DbException.java:427)
	at org.h2.message.DbException.getJdbcSQLException(DbException.java:457)
	at org.h2.message.DbException.get(DbException.java:205)
	at org.h2.message.DbException.get(DbException.java:181)
	at org.h2.message.DbException.getJdbcSQLException(DbException.java:427)
	at org.h2.index.BaseIndex.getDuplicateKeyException(BaseIndex.java:103)
	at org.h2.message.DbException.get(DbException.java:205)
	at org.h2.mvstore.db.MVSecondaryIndex.checkUnique(MVSecondaryIndex.java:220)
	at org.h2.message.DbException.get(DbException.java:181)
	at org.h2.mvstore.db.MVSecondaryIndex.add(MVSecondaryIndex.java:196)
	at org.h2.index.BaseIndex.getDuplicateKeyException(BaseIndex.java:103)
	at org.h2.mvstore.db.MVTable.addRow(MVTable.java:546)
	at org.h2.command.dml.Insert.insertRows(Insert.java:180)
	at org.h2.mvstore.db.MVSecondaryIndex.checkUnique(MVSecondaryIndex.java:220)
	at org.h2.command.dml.Insert.update(Insert.java:132)
	at org.h2.mvstore.db.MVSecondaryIndex.add(MVSecondaryIndex.java:196)
	at org.h2.command.CommandContainer.update(CommandContainer.java:133)
	at org.h2.command.Command.executeUpdate(Command.java:267)
	at org.h2.mvstore.db.MVTable.addRow(MVTable.java:546)
	at org.h2.jdbc.JdbcPreparedStatement.execute(JdbcPreparedStatement.java:250)
	at com.zaxxer.hikari.pool.ProxyPreparedStatement.execute(ProxyPreparedStatement.java:44)
	at org.h2.command.dml.Insert.insertRows(Insert.java:180)
	at com.zaxxer.hikari.pool.HikariProxyPreparedStatement.execute(HikariProxyPreparedStatement.java)
	at org.jenkinsci.plugins.pipeline.maven.dao.AbstractPipelineMavenPluginDao.getOrCreateBuildPrimaryKey(AbstractPipelineMavenPluginDao.java:391)
	at org.h2.command.dml.Insert.update(Insert.java:132)
	at org.h2.command.CommandContainer.update(CommandContainer.java:133)
	... 13 more
	at org.h2.command.Command.executeUpdate(Command.java:267)
	at org.h2.jdbc.JdbcPreparedStatement.execute(JdbcPreparedStatement.java:250)
	at com.zaxxer.hikari.pool.ProxyPreparedStatement.execute(ProxyPreparedStatement.java:44)
	at com.zaxxer.hikari.pool.HikariProxyPreparedStatement.execute(HikariProxyPreparedStatement.java)
	at org.jenkinsci.plugins.pipeline.maven.dao.AbstractPipelineMavenPluginDao.getOrCreateBuildPrimaryKey(AbstractPipelineMavenPluginDao.java:391)
	... 13 more
[Pipeline] // ws
[Pipeline] }
[Pipeline] // node
[Pipeline] }
Failed in branch linux-jdk7-m3.6.x_build
[withMaven] Publishers: Generated Artifacts Publisher: 1300 ms, Junit Publisher: 6205 ms, Open Task Scanner Publisher: 1727 ms, Dependencies Fingerprint Publisher: 1 ms, Invoker Publisher: 28753 ms, Pipeline Graph Publisher: 36 ms
[withMaven] Publishers: Generated Artifacts Publisher: 1301 ms, Junit Publisher: 18421 ms, Open Task Scanner Publisher: 1789 ms, Dependencies Fingerprint Publisher: 1 ms, Invoker Publisher: 16236 ms, Pipeline Graph Publisher: 39 ms
[withMaven] Publishers: Generated Artifacts Publisher: 1300 ms, Junit Publisher: 12230 ms, Open Task Scanner Publisher: 1800 ms, Invoker Publisher: 22278 ms, Pipeline Graph Publisher: 38 ms
ERROR: Cannot delete workspace :Unable to delete 'f:\jenkins\jenkins-slave\workspace\ect-info-reports-plugin_MPIR-385@2'. Tried 3 times (of a maximum of 3) waiting 0.1 sec between attempts.
ERROR: Cannot delete workspace :Unable to delete 'f:\jenkins\jenkins-slave\workspace\ect-info-reports-plugin_MPIR-385@2'. Tried 3 times (of a maximum of 3) waiting 0.1 sec between attempts.
[Pipeline] }
[withMaven] openTasksPublisher - Scan Tasks for Maven artifact org.apache.maven.plugins:maven-project-info-reports-plugin:maven-plugin:3.0.2-SNAPSHOT in source directory linux-jdk11-m3.6.x_build/src/main/java
[Pipeline] // stage
[Pipeline] }
[Pipeline] }
[Pipeline] // stage
[Pipeline] // ws
[Pipeline] }
[Pipeline] }
[Pipeline] // ws
[Pipeline] // node
[Pipeline] // withMaven
[Pipeline] // withMaven
[Pipeline] // withMaven
[Pipeline] }
Failed in branch windows-jdk7-m3.6.x_build
[Pipeline] }
[Pipeline] cleanWs
[Pipeline] cleanWs
[Pipeline] cleanWs
[Pipeline] // node
[Pipeline] }
Failed in branch windows-jdk7-m3.2.x_build
[TASKS] Scanning folder '/home/jenkins/jenkins-slave/workspace/ect-info-reports-plugin_MPIR-385@3@2' for files matching the pattern 'linux-jdk11-m3.6.x_build/src/main/java/**/*' - excludes: null
[TASKS] Found 27 files to scan for tasks
[TASKS] Found 13 open tasks.
Skipping warnings blame since pipelines do not have an SCM link.%n
[TASKS] Computing warning deltas based on reference build #1
[WS-CLEANUP] Deleting project workspace...
[WS-CLEANUP] Deferred wipeout is used...
[WS-CLEANUP] Deleting project workspace...
[WS-CLEANUP] Deferred wipeout is used...
[WS-CLEANUP] Deleting project workspace...
[WS-CLEANUP] Deferred wipeout is used...
[WS-CLEANUP] done
[Pipeline] }
[WS-CLEANUP] done
[Pipeline] // stage
[Pipeline] }
[Pipeline] }
[WS-CLEANUP] done
[Pipeline] // ws
[Pipeline] // stage
[Pipeline] }
[Pipeline] }
[Pipeline] }
[Pipeline] // node
[Pipeline] // stage
[Pipeline] // ws
[Pipeline] }
[Pipeline] }
[Pipeline] }
[Pipeline] // ws
[Pipeline] // node
[Pipeline] }
[Pipeline] }
[Pipeline] // node
[Pipeline] }
[withMaven] invokerPublisher - Archive invoker results for Maven artifact MavenArtifact{org.apache.maven.plugins:maven-project-info-reports-plugin:maven-plugin:3.0.2-SNAPSHOT(version: 3.0.2-SNAPSHOT, snapshot:false) } generated by PluginInvocation{org.apache.maven.plugins:maven-invoker-plugin:3.1.0@integration-test  integration-test}: linux-jdk11-m3.6.x_build/target/invoker-reports/*.xml
[withMaven] Publishers: Generated Artifacts Publisher: 1302 ms, Junit Publisher: 24511 ms, Open Task Scanner Publisher: 1787 ms, Dependencies Fingerprint Publisher: 1 ms, Invoker Publisher: 13256 ms, Pipeline Graph Publisher: 1 ms
[Pipeline] // withMaven
[Pipeline] cleanWs
[WS-CLEANUP] Deleting project workspace...
[WS-CLEANUP] Deferred wipeout is used...
[WS-CLEANUP] done
[Pipeline] }
[Pipeline] // stage
[Pipeline] }
[Pipeline] // ws
[Pipeline] }
[Pipeline] // node
[Pipeline] }
[withMaven] Publishers: Generated Artifacts Publisher: 1291 ms, Junit Publisher: 30564 ms, Open Task Scanner Publisher: 1332 ms, Dependencies Fingerprint Publisher: 1 ms, Invoker Publisher: 13144 ms, Pipeline Graph Publisher: 1 ms
[Pipeline] // withMaven
[Pipeline] cleanWs
[WS-CLEANUP] Deleting project workspace...
[WS-CLEANUP] Deferred wipeout is used...
[WS-CLEANUP] done
[Pipeline] }
[Pipeline] // stage
[Pipeline] }
[Pipeline] // ws
[Pipeline] }
[Pipeline] // node
[Pipeline] }
[withMaven] Publishers: Generated Artifacts Publisher: 1275 ms, Junit Publisher: 37075 ms, Open Task Scanner Publisher: 1591 ms, Dependencies Fingerprint Publisher: 1 ms, Invoker Publisher: 12528 ms, Pipeline Graph Publisher: 1 ms
[Pipeline] // withMaven
[Pipeline] cleanWs
[WS-CLEANUP] Deleting project workspace...
[WS-CLEANUP] Deferred wipeout is used...
[WS-CLEANUP] done
[Pipeline] }
[Pipeline] // stage
[Pipeline] }
[Pipeline] // ws
[Pipeline] }
[Pipeline] // node
[Pipeline] }
[Pipeline] // parallel
[Pipeline] stage
[Pipeline] { (Notifications)
[Pipeline] echo
Build result: FAILURE
[Pipeline] jiraIssueSelector
[Pipeline] echo
The authors of changes [rfscholte].
[Pipeline] echo
Sending email ...
[Pipeline] emailext