You are viewing a plain text version of this content. The canonical link for it is here.
Posted to dev@nutch.apache.org by Apache Jenkins Server <je...@builds.apache.org> on 2016/06/20 02:53:43 UTC
Build failed in Jenkins: Nutch-trunk #3374
See <https://builds.apache.org/job/Nutch-trunk/3374/changes>
Changes:
[lewis.mcgibbney] Prepare for Nutch 1.13 development
------------------------------------------
[...truncated 4296 lines...]
init:
[mkdir] Created dir: <https://builds.apache.org/job/Nutch-trunk/ws/build/urlnormalizer-regex/classes>
[mkdir] Created dir: <https://builds.apache.org/job/Nutch-trunk/ws/build/urlnormalizer-regex/test/lib>
[mkdir] Created dir: <https://builds.apache.org/job/Nutch-trunk/ws/build/plugins/urlnormalizer-regex>
init-plugin:
deps-jar:
clean-lib:
resolve-default:
[ivy:resolve] :: loading settings :: file = <https://builds.apache.org/job/Nutch-trunk/ws/ivy/ivysettings.xml>
compile:
[echo] Compiling plugin: urlnormalizer-regex
[javac] Compiling 2 source files to <https://builds.apache.org/job/Nutch-trunk/ws/build/urlnormalizer-regex/classes>
[javac] Creating empty <https://builds.apache.org/job/Nutch-trunk/ws/build/urlnormalizer-regex/classes/org/apache/nutch/net/urlnormalizer/regex/package-info.class>
jar:
[jar] Building jar: <https://builds.apache.org/job/Nutch-trunk/ws/build/urlnormalizer-regex/urlnormalizer-regex.jar>
deps-test:
init:
init-plugin:
clean-lib:
resolve-default:
[ivy:resolve] :: loading settings :: file = <https://builds.apache.org/job/Nutch-trunk/ws/ivy/ivysettings.xml>
compile:
jar:
deps-test:
deploy:
copy-generated-lib:
deploy:
[copy] Copying 1 file to <https://builds.apache.org/job/Nutch-trunk/ws/build/plugins/urlnormalizer-regex>
copy-generated-lib:
[copy] Copying 1 file to <https://builds.apache.org/job/Nutch-trunk/ws/build/plugins/urlnormalizer-regex>
[mkdir] Created dir: <https://builds.apache.org/job/Nutch-trunk/ws/build/urlnormalizer-slash/test/data>
[copy] Copying 1 file to <https://builds.apache.org/job/Nutch-trunk/ws/build/urlnormalizer-slash/test/data>
init:
[mkdir] Created dir: <https://builds.apache.org/job/Nutch-trunk/ws/build/urlnormalizer-slash/classes>
[mkdir] Created dir: <https://builds.apache.org/job/Nutch-trunk/ws/build/urlnormalizer-slash/test/lib>
[mkdir] Created dir: <https://builds.apache.org/job/Nutch-trunk/ws/build/plugins/urlnormalizer-slash>
init-plugin:
deps-jar:
clean-lib:
resolve-default:
[ivy:resolve] :: loading settings :: file = <https://builds.apache.org/job/Nutch-trunk/ws/ivy/ivysettings.xml>
compile:
[echo] Compiling plugin: urlnormalizer-slash
[javac] Compiling 1 source file to <https://builds.apache.org/job/Nutch-trunk/ws/build/urlnormalizer-slash/classes>
jar:
[jar] Building jar: <https://builds.apache.org/job/Nutch-trunk/ws/build/urlnormalizer-slash/urlnormalizer-slash.jar>
deps-test:
deploy:
[copy] Copying 1 file to <https://builds.apache.org/job/Nutch-trunk/ws/build/plugins/urlnormalizer-slash>
copy-generated-lib:
[copy] Copying 1 file to <https://builds.apache.org/job/Nutch-trunk/ws/build/plugins/urlnormalizer-slash>
compile:
job:
[jar] Building jar: <https://builds.apache.org/job/Nutch-trunk/ws/build/apache-nutch-1.13-SNAPSHOT.job>
test-core:
[mkdir] Created dir: <https://builds.apache.org/job/Nutch-trunk/ws/build/test/data>
[copy] Copying 48 files to <https://builds.apache.org/job/Nutch-trunk/ws/build/test/data>
[copy] Copying 1 file to <https://builds.apache.org/job/Nutch-trunk/ws/build/test/classes>
[copy] Copying 1 file to <https://builds.apache.org/job/Nutch-trunk/ws/build/test/classes>
[copy] Copying 1 file to <https://builds.apache.org/job/Nutch-trunk/ws/build/test/classes>
[copy] Copying 1 file to <https://builds.apache.org/job/Nutch-trunk/ws/build/test/classes>
[junit] Running org.apache.nutch.crawl.TestAdaptiveFetchSchedule
[junit] Tests run: 1, Failures: 0, Errors: 0, Skipped: 0, Time elapsed: 0.419 sec
[junit] Running org.apache.nutch.crawl.TestCrawlDbFilter
[junit] Tests run: 1, Failures: 0, Errors: 0, Skipped: 0, Time elapsed: 4.229 sec
[junit] Running org.apache.nutch.crawl.TestCrawlDbMerger
[junit] Tests run: 1, Failures: 0, Errors: 0, Skipped: 0, Time elapsed: 3.91 sec
[junit] Running org.apache.nutch.crawl.TestCrawlDbStates
[junit] Tests run: 6, Failures: 0, Errors: 1, Skipped: 0, Time elapsed: 4.211 sec
[junit] Test org.apache.nutch.crawl.TestCrawlDbStates FAILED
[junit] Running org.apache.nutch.crawl.TestGenerator
[junit] Tests run: 4, Failures: 0, Errors: 0, Skipped: 0, Time elapsed: 42.734 sec
[junit] Running org.apache.nutch.crawl.TestInjector
[junit] Tests run: 1, Failures: 0, Errors: 0, Skipped: 0, Time elapsed: 5.802 sec
[junit] Running org.apache.nutch.crawl.TestLinkDbMerger
[junit] Tests run: 1, Failures: 0, Errors: 0, Skipped: 0, Time elapsed: 4.251 sec
[junit] Running org.apache.nutch.crawl.TestSignatureFactory
[junit] Tests run: 1, Failures: 0, Errors: 0, Skipped: 0, Time elapsed: 0.395 sec
[junit] Running org.apache.nutch.fetcher.TestFetcher
[junit] Tests run: 2, Failures: 0, Errors: 0, Skipped: 0, Time elapsed: 14.737 sec
[junit] Running org.apache.nutch.indexer.TestIndexerMapReduce
[junit] Tests run: 1, Failures: 0, Errors: 0, Skipped: 0, Time elapsed: 1.544 sec
[junit] Running org.apache.nutch.indexer.TestIndexingFilters
[junit] Tests run: 3, Failures: 0, Errors: 0, Skipped: 0, Time elapsed: 0.996 sec
[junit] Running org.apache.nutch.metadata.TestMetadata
[junit] Tests run: 10, Failures: 0, Errors: 0, Skipped: 0, Time elapsed: 0.165 sec
[junit] Running org.apache.nutch.metadata.TestSpellCheckedMetadata
[junit] Tests run: 11, Failures: 0, Errors: 0, Skipped: 0, Time elapsed: 3.104 sec
[junit] Running org.apache.nutch.net.TestURLFilters
[junit] Tests run: 1, Failures: 0, Errors: 0, Skipped: 0, Time elapsed: 0.601 sec
[junit] Running org.apache.nutch.net.TestURLNormalizers
[junit] Tests run: 1, Failures: 0, Errors: 0, Skipped: 0, Time elapsed: 0.613 sec
[junit] Running org.apache.nutch.parse.TestOutlinkExtractor
[junit] Tests run: 4, Failures: 0, Errors: 0, Skipped: 0, Time elapsed: 0.089 sec
[junit] Running org.apache.nutch.parse.TestParseData
[junit] Tests run: 2, Failures: 0, Errors: 0, Skipped: 0, Time elapsed: 0.095 sec
[junit] Running org.apache.nutch.parse.TestParseText
[junit] Tests run: 1, Failures: 0, Errors: 0, Skipped: 0, Time elapsed: 0.079 sec
[junit] Running org.apache.nutch.parse.TestParserFactory
[junit] Tests run: 2, Failures: 0, Errors: 0, Skipped: 0, Time elapsed: 2.057 sec
[junit] Running org.apache.nutch.plugin.TestPluginSystem
[junit] Tests run: 7, Failures: 0, Errors: 0, Skipped: 0, Time elapsed: 1.864 sec
[junit] Running org.apache.nutch.protocol.TestContent
[junit] Tests run: 2, Failures: 0, Errors: 0, Skipped: 0, Time elapsed: 0.701 sec
[junit] Running org.apache.nutch.protocol.TestProtocolFactory
[junit] Tests run: 2, Failures: 0, Errors: 0, Skipped: 0, Time elapsed: 0.828 sec
[junit] Running org.apache.nutch.segment.TestSegmentMerger
[junit] Tests run: 1, Failures: 0, Errors: 0, Skipped: 0, Time elapsed: 130.636 sec
[junit] Running org.apache.nutch.segment.TestSegmentMergerCrawlDatums
[junit] Tests run: 7, Failures: 0, Errors: 0, Skipped: 0, Time elapsed: 116.9 sec
[junit] Running org.apache.nutch.service.TestNutchServer
[junit] Tests run: 1, Failures: 0, Errors: 0, Skipped: 0, Time elapsed: 1.531 sec
[junit] Running org.apache.nutch.tools.TestCommonCrawlDataDumper
[junit] Tests run: 1, Failures: 0, Errors: 0, Skipped: 0, Time elapsed: 2.085 sec
[junit] Running org.apache.nutch.util.TestEncodingDetector
[junit] Tests run: 1, Failures: 0, Errors: 0, Skipped: 0, Time elapsed: 0.764 sec
[junit] Running org.apache.nutch.util.TestGZIPUtils
[junit] Tests run: 3, Failures: 0, Errors: 0, Skipped: 0, Time elapsed: 0.382 sec
[junit] Running org.apache.nutch.util.TestMimeUtil
[junit] Tests run: 4, Failures: 0, Errors: 0, Skipped: 0, Time elapsed: 1.51 sec
[junit] Running org.apache.nutch.util.TestNodeWalker
[junit] Tests run: 1, Failures: 0, Errors: 0, Skipped: 0, Time elapsed: 0.252 sec
[junit] Running org.apache.nutch.util.TestPrefixStringMatcher
[junit] Tests run: 1, Failures: 0, Errors: 0, Skipped: 0, Time elapsed: 0.124 sec
[junit] Running org.apache.nutch.util.TestStringUtil
[junit] Tests run: 1, Failures: 0, Errors: 0, Skipped: 0, Time elapsed: 0.071 sec
[junit] Running org.apache.nutch.util.TestSuffixStringMatcher
[junit] Tests run: 1, Failures: 0, Errors: 0, Skipped: 0, Time elapsed: 0.131 sec
[junit] Running org.apache.nutch.util.TestTableUtil
[junit] Tests run: 2, Failures: 0, Errors: 0, Skipped: 0, Time elapsed: 0.083 sec
[junit] Running org.apache.nutch.util.TestURLUtil
[junit] Tests run: 8, Failures: 0, Errors: 0, Skipped: 0, Time elapsed: 0.967 sec
BUILD FAILED
<https://builds.apache.org/job/Nutch-trunk/ws/build.xml>:495: Tests failed!
Total time: 10 minutes 7 seconds
Build step 'Invoke Ant' marked build as failure
Publishing Javadoc
[xUnit] [INFO] - Starting to record.
[xUnit] [INFO] - Processing JUnit
[xUnit] [INFO] - [JUnit] - 35 test report file(s) were found with the pattern 'build/test/TEST-*.xml' relative to '<https://builds.apache.org/job/Nutch-trunk/ws/'> for the testing framework 'JUnit'.
[xUnit] [INFO] - Converting '<https://builds.apache.org/job/Nutch-trunk/ws/build/test/TEST-org.apache.nutch.crawl.TestAdaptiveFetchSchedule.xml'> .
[xUnit] [INFO] - Converting '<https://builds.apache.org/job/Nutch-trunk/ws/build/test/TEST-org.apache.nutch.crawl.TestCrawlDbFilter.xml'> .
[xUnit] [INFO] - Converting '<https://builds.apache.org/job/Nutch-trunk/ws/build/test/TEST-org.apache.nutch.crawl.TestCrawlDbMerger.xml'> .
[xUnit] [INFO] - Converting '<https://builds.apache.org/job/Nutch-trunk/ws/build/test/TEST-org.apache.nutch.crawl.TestCrawlDbStates.xml'> .
[xUnit] [INFO] - Converting '<https://builds.apache.org/job/Nutch-trunk/ws/build/test/TEST-org.apache.nutch.crawl.TestGenerator.xml'> .
[xUnit] [INFO] - Converting '<https://builds.apache.org/job/Nutch-trunk/ws/build/test/TEST-org.apache.nutch.crawl.TestInjector.xml'> .
[xUnit] [INFO] - Converting '<https://builds.apache.org/job/Nutch-trunk/ws/build/test/TEST-org.apache.nutch.crawl.TestLinkDbMerger.xml'> .
[xUnit] [INFO] - Converting '<https://builds.apache.org/job/Nutch-trunk/ws/build/test/TEST-org.apache.nutch.crawl.TestSignatureFactory.xml'> .
[xUnit] [INFO] - Converting '<https://builds.apache.org/job/Nutch-trunk/ws/build/test/TEST-org.apache.nutch.fetcher.TestFetcher.xml'> .
[xUnit] [INFO] - Converting '<https://builds.apache.org/job/Nutch-trunk/ws/build/test/TEST-org.apache.nutch.indexer.TestIndexerMapReduce.xml'> .
[xUnit] [INFO] - Converting '<https://builds.apache.org/job/Nutch-trunk/ws/build/test/TEST-org.apache.nutch.indexer.TestIndexingFilters.xml'> .
[xUnit] [INFO] - Converting '<https://builds.apache.org/job/Nutch-trunk/ws/build/test/TEST-org.apache.nutch.metadata.TestMetadata.xml'> .
[xUnit] [INFO] - Converting '<https://builds.apache.org/job/Nutch-trunk/ws/build/test/TEST-org.apache.nutch.metadata.TestSpellCheckedMetadata.xml'> .
[xUnit] [INFO] - Converting '<https://builds.apache.org/job/Nutch-trunk/ws/build/test/TEST-org.apache.nutch.net.TestURLFilters.xml'> .
[xUnit] [INFO] - Converting '<https://builds.apache.org/job/Nutch-trunk/ws/build/test/TEST-org.apache.nutch.net.TestURLNormalizers.xml'> .
[xUnit] [INFO] - Converting '<https://builds.apache.org/job/Nutch-trunk/ws/build/test/TEST-org.apache.nutch.parse.TestOutlinkExtractor.xml'> .
[xUnit] [INFO] - Converting '<https://builds.apache.org/job/Nutch-trunk/ws/build/test/TEST-org.apache.nutch.parse.TestParseData.xml'> .
[xUnit] [INFO] - Converting '<https://builds.apache.org/job/Nutch-trunk/ws/build/test/TEST-org.apache.nutch.parse.TestParseText.xml'> .
[xUnit] [INFO] - Converting '<https://builds.apache.org/job/Nutch-trunk/ws/build/test/TEST-org.apache.nutch.parse.TestParserFactory.xml'> .
[xUnit] [INFO] - Converting '<https://builds.apache.org/job/Nutch-trunk/ws/build/test/TEST-org.apache.nutch.plugin.TestPluginSystem.xml'> .
[xUnit] [INFO] - Converting '<https://builds.apache.org/job/Nutch-trunk/ws/build/test/TEST-org.apache.nutch.protocol.TestContent.xml'> .
[xUnit] [INFO] - Converting '<https://builds.apache.org/job/Nutch-trunk/ws/build/test/TEST-org.apache.nutch.protocol.TestProtocolFactory.xml'> .
[xUnit] [INFO] - Converting '<https://builds.apache.org/job/Nutch-trunk/ws/build/test/TEST-org.apache.nutch.segment.TestSegmentMerger.xml'> .
[xUnit] [INFO] - Converting '<https://builds.apache.org/job/Nutch-trunk/ws/build/test/TEST-org.apache.nutch.segment.TestSegmentMergerCrawlDatums.xml'> .
[xUnit] [INFO] - Converting '<https://builds.apache.org/job/Nutch-trunk/ws/build/test/TEST-org.apache.nutch.service.TestNutchServer.xml'> .
[xUnit] [INFO] - Converting '<https://builds.apache.org/job/Nutch-trunk/ws/build/test/TEST-org.apache.nutch.tools.TestCommonCrawlDataDumper.xml'> .
[xUnit] [INFO] - Converting '<https://builds.apache.org/job/Nutch-trunk/ws/build/test/TEST-org.apache.nutch.util.TestEncodingDetector.xml'> .
[xUnit] [INFO] - Converting '<https://builds.apache.org/job/Nutch-trunk/ws/build/test/TEST-org.apache.nutch.util.TestGZIPUtils.xml'> .
[xUnit] [INFO] - Converting '<https://builds.apache.org/job/Nutch-trunk/ws/build/test/TEST-org.apache.nutch.util.TestMimeUtil.xml'> .
[xUnit] [INFO] - Converting '<https://builds.apache.org/job/Nutch-trunk/ws/build/test/TEST-org.apache.nutch.util.TestNodeWalker.xml'> .
[xUnit] [INFO] - Converting '<https://builds.apache.org/job/Nutch-trunk/ws/build/test/TEST-org.apache.nutch.util.TestPrefixStringMatcher.xml'> .
[xUnit] [INFO] - Converting '<https://builds.apache.org/job/Nutch-trunk/ws/build/test/TEST-org.apache.nutch.util.TestStringUtil.xml'> .
[xUnit] [INFO] - Converting '<https://builds.apache.org/job/Nutch-trunk/ws/build/test/TEST-org.apache.nutch.util.TestSuffixStringMatcher.xml'> .
[xUnit] [INFO] - Converting '<https://builds.apache.org/job/Nutch-trunk/ws/build/test/TEST-org.apache.nutch.util.TestTableUtil.xml'> .
[xUnit] [INFO] - Converting '<https://builds.apache.org/job/Nutch-trunk/ws/build/test/TEST-org.apache.nutch.util.TestURLUtil.xml'> .
[xUnit] [INFO] - Processing JUnit
[xUnit] [INFO] - [JUnit] - 35 test report file(s) were found with the pattern 'build/**/test/TEST-*.xml' relative to '<https://builds.apache.org/job/Nutch-trunk/ws/'> for the testing framework 'JUnit'.
[xUnit] [INFO] - Converting '<https://builds.apache.org/job/Nutch-trunk/ws/build/test/TEST-org.apache.nutch.crawl.TestAdaptiveFetchSchedule.xml'> .
[xUnit] [INFO] - Converting '<https://builds.apache.org/job/Nutch-trunk/ws/build/test/TEST-org.apache.nutch.crawl.TestCrawlDbFilter.xml'> .
[xUnit] [INFO] - Converting '<https://builds.apache.org/job/Nutch-trunk/ws/build/test/TEST-org.apache.nutch.crawl.TestCrawlDbMerger.xml'> .
[xUnit] [INFO] - Converting '<https://builds.apache.org/job/Nutch-trunk/ws/build/test/TEST-org.apache.nutch.crawl.TestCrawlDbStates.xml'> .
[xUnit] [INFO] - Converting '<https://builds.apache.org/job/Nutch-trunk/ws/build/test/TEST-org.apache.nutch.crawl.TestGenerator.xml'> .
[xUnit] [INFO] - Converting '<https://builds.apache.org/job/Nutch-trunk/ws/build/test/TEST-org.apache.nutch.crawl.TestInjector.xml'> .
[xUnit] [INFO] - Converting '<https://builds.apache.org/job/Nutch-trunk/ws/build/test/TEST-org.apache.nutch.crawl.TestLinkDbMerger.xml'> .
[xUnit] [INFO] - Converting '<https://builds.apache.org/job/Nutch-trunk/ws/build/test/TEST-org.apache.nutch.crawl.TestSignatureFactory.xml'> .
[xUnit] [INFO] - Converting '<https://builds.apache.org/job/Nutch-trunk/ws/build/test/TEST-org.apache.nutch.fetcher.TestFetcher.xml'> .
[xUnit] [INFO] - Converting '<https://builds.apache.org/job/Nutch-trunk/ws/build/test/TEST-org.apache.nutch.indexer.TestIndexerMapReduce.xml'> .
[xUnit] [INFO] - Converting '<https://builds.apache.org/job/Nutch-trunk/ws/build/test/TEST-org.apache.nutch.indexer.TestIndexingFilters.xml'> .
[xUnit] [INFO] - Converting '<https://builds.apache.org/job/Nutch-trunk/ws/build/test/TEST-org.apache.nutch.metadata.TestMetadata.xml'> .
[xUnit] [INFO] - Converting '<https://builds.apache.org/job/Nutch-trunk/ws/build/test/TEST-org.apache.nutch.metadata.TestSpellCheckedMetadata.xml'> .
[xUnit] [INFO] - Converting '<https://builds.apache.org/job/Nutch-trunk/ws/build/test/TEST-org.apache.nutch.net.TestURLFilters.xml'> .
[xUnit] [INFO] - Converting '<https://builds.apache.org/job/Nutch-trunk/ws/build/test/TEST-org.apache.nutch.net.TestURLNormalizers.xml'> .
[xUnit] [INFO] - Converting '<https://builds.apache.org/job/Nutch-trunk/ws/build/test/TEST-org.apache.nutch.parse.TestOutlinkExtractor.xml'> .
[xUnit] [INFO] - Converting '<https://builds.apache.org/job/Nutch-trunk/ws/build/test/TEST-org.apache.nutch.parse.TestParseData.xml'> .
[xUnit] [INFO] - Converting '<https://builds.apache.org/job/Nutch-trunk/ws/build/test/TEST-org.apache.nutch.parse.TestParseText.xml'> .
[xUnit] [INFO] - Converting '<https://builds.apache.org/job/Nutch-trunk/ws/build/test/TEST-org.apache.nutch.parse.TestParserFactory.xml'> .
[xUnit] [INFO] - Converting '<https://builds.apache.org/job/Nutch-trunk/ws/build/test/TEST-org.apache.nutch.plugin.TestPluginSystem.xml'> .
[xUnit] [INFO] - Converting '<https://builds.apache.org/job/Nutch-trunk/ws/build/test/TEST-org.apache.nutch.protocol.TestContent.xml'> .
[xUnit] [INFO] - Converting '<https://builds.apache.org/job/Nutch-trunk/ws/build/test/TEST-org.apache.nutch.protocol.TestProtocolFactory.xml'> .
[xUnit] [INFO] - Converting '<https://builds.apache.org/job/Nutch-trunk/ws/build/test/TEST-org.apache.nutch.segment.TestSegmentMerger.xml'> .
[xUnit] [INFO] - Converting '<https://builds.apache.org/job/Nutch-trunk/ws/build/test/TEST-org.apache.nutch.segment.TestSegmentMergerCrawlDatums.xml'> .
[xUnit] [INFO] - Converting '<https://builds.apache.org/job/Nutch-trunk/ws/build/test/TEST-org.apache.nutch.service.TestNutchServer.xml'> .
[xUnit] [INFO] - Converting '<https://builds.apache.org/job/Nutch-trunk/ws/build/test/TEST-org.apache.nutch.tools.TestCommonCrawlDataDumper.xml'> .
[xUnit] [INFO] - Converting '<https://builds.apache.org/job/Nutch-trunk/ws/build/test/TEST-org.apache.nutch.util.TestEncodingDetector.xml'> .
[xUnit] [INFO] - Converting '<https://builds.apache.org/job/Nutch-trunk/ws/build/test/TEST-org.apache.nutch.util.TestGZIPUtils.xml'> .
[xUnit] [INFO] - Converting '<https://builds.apache.org/job/Nutch-trunk/ws/build/test/TEST-org.apache.nutch.util.TestMimeUtil.xml'> .
[xUnit] [INFO] - Converting '<https://builds.apache.org/job/Nutch-trunk/ws/build/test/TEST-org.apache.nutch.util.TestNodeWalker.xml'> .
[xUnit] [INFO] - Converting '<https://builds.apache.org/job/Nutch-trunk/ws/build/test/TEST-org.apache.nutch.util.TestPrefixStringMatcher.xml'> .
[xUnit] [INFO] - Converting '<https://builds.apache.org/job/Nutch-trunk/ws/build/test/TEST-org.apache.nutch.util.TestStringUtil.xml'> .
[xUnit] [INFO] - Converting '<https://builds.apache.org/job/Nutch-trunk/ws/build/test/TEST-org.apache.nutch.util.TestSuffixStringMatcher.xml'> .
[xUnit] [INFO] - Converting '<https://builds.apache.org/job/Nutch-trunk/ws/build/test/TEST-org.apache.nutch.util.TestTableUtil.xml'> .
[xUnit] [INFO] - Converting '<https://builds.apache.org/job/Nutch-trunk/ws/build/test/TEST-org.apache.nutch.util.TestURLUtil.xml'> .
[xUnit] [INFO] - Check 'Failed Tests' threshold.
[xUnit] [INFO] - Check 'Skipped Tests' threshold.
[xUnit] [INFO] - Setting the build status to FAILURE
[xUnit] [INFO] - Stopping recording.
Jenkins build is back to normal : Nutch-trunk #3375
Posted by Apache Jenkins Server <je...@builds.apache.org>.
See <https://builds.apache.org/job/Nutch-trunk/3375/changes>