You are viewing a plain text version of this content. The canonical link for it is here.
Posted to builds@beam.apache.org by Apache Jenkins Server <je...@builds.apache.org> on 2023/08/08 22:27:02 UTC
Build failed in Jenkins: beam_PostCommit_Java_DataflowV2 #3385
See <https://ci-beam.apache.org/job/beam_PostCommit_Java_DataflowV2/3385/display/redirect>
Changes:
------------------------------------------
[...truncated 64.14 KB...]
Finished license_scripts.sh
> Task :sdks:java:container:java8:copyJavaThirdPartyLicenses
> Task :release:go-licenses:java:dockerRun
+ go-licenses csv github.com/apache/beam/sdks/v2/java/container
+ tee /output/licenses/list.csv
> Task :sdks:java:container:downloadCloudProfilerAgent
% Total % Received % Xferd Average Speed Time Time Time Current
Dload Upload Total Spent Left Speed
0 0 0 0 0 0 0 0 --:--:-- --:--:-- --:--:-- 0version.txt
NOTICES
profiler_java_agent.so
100 4183k 100 4183k 0 0 22.5M 0 --:--:-- --:--:-- --:--:-- 22.5M
> Task :sdks:java:container:goPrepare UP-TO-DATE
> Task :release:go-licenses:java:dockerRun
W0808 21:58:09.627940 85 library.go:101] "golang.org/x/sys/unix" contains non-Go code that can't be inspected for further dependencies:
/go/pkg/mod/golang.org/x/sys@v0.9.0/unix/asm_linux_amd64.s
> Task :sdks:java:container:goBuild
/home/jenkins/go/bin/go1.20.6 build -o ./build/target/linux_amd64/boot boot.go boot_test.go pathingjar.go pathingjar_test.go
> Task :sdks:java:container:java8:copySdkHarnessLauncher
Execution optimizations have been disabled for task ':sdks:java:container:java8:copySdkHarnessLauncher' to ensure correctness due to the following reasons:
- Gradle detected a problem with the following location: '<https://ci-beam.apache.org/job/beam_PostCommit_Java_DataflowV2/ws/src/sdks/java/container/build/target'.> Reason: Task ':sdks:java:container:java8:copySdkHarnessLauncher' uses this output of task ':sdks:java:container:pullLicenses' without declaring an explicit or implicit dependency. This can lead to incorrect results being produced, depending on what order the tasks are executed. Please refer to https://docs.gradle.org/7.6.2/userguide/validation_problems.html#implicit_dependency for more details about this problem.
> Task :release:go-licenses:java:dockerRun
github.com/apache/beam/sdks/v2/go,https://github.com/apache/beam/blob/sdks/v2.49.0/sdks/go/README.md,Apache-2.0
github.com/apache/beam/sdks/v2/java/container,https://github.com/apache/beam/blob/sdks/v2.49.0/sdks/LICENSE,Apache-2.0
github.com/golang/protobuf,https://github.com/golang/protobuf/blob/v1.5.3/LICENSE,BSD-3-Clause
golang.org/x/net,https://cs.opensource.google/go/x/net/+/v0.11.0:LICENSE,BSD-3-Clause
golang.org/x/sys/unix,https://cs.opensource.google/go/x/sys/+/v0.9.0:LICENSE,BSD-3-Clause
golang.org/x/text,https://cs.opensource.google/go/x/text/+/v0.10.0:LICENSE,BSD-3-Clause
google.golang.org/genproto/googleapis/rpc/status,https://github.com/googleapis/go-genproto/blob/e85fd2cbaebc/googleapis/rpc/LICENSE,Apache-2.0
google.golang.org/grpc,https://github.com/grpc/grpc-go/blob/v1.56.1/LICENSE,Apache-2.0
google.golang.org/protobuf,https://github.com/protocolbuffers/protobuf-go/blob/v1.31.0/LICENSE,BSD-3-Clause
+ chmod -R a+w /output/licenses
> Task :release:go-licenses:java:createLicenses
> Task :sdks:java:container:java8:copyGolangLicenses
> Task :sdks:java:container:java8:dockerPrepare
> Task :sdks:java:container:java8:docker
#1 [internal] load build definition from Dockerfile
#1 transferring dockerfile: 2.58kB done
#1 DONE 0.0s
#2 [internal] load .dockerignore
#2 transferring context: 2B done
#2 DONE 0.0s
#3 [internal] load metadata for docker.io/library/eclipse-temurin:8
#3 DONE 0.3s
#4 [ 1/16] FROM docker.io/library/eclipse-temurin:8@sha256:019f810cc052d5eb3c35d912a3f6e8bcf98155828a7356e6a0d511939fc737d8
#4 CACHED
#5 [internal] load build context
#5 transferring context: 47.08MB 0.3s done
#5 DONE 0.3s
#6 [ 2/16] ADD target/slf4j-api.jar /opt/apache/beam/jars/
#6 DONE 1.0s
#7 [ 3/16] ADD target/slf4j-jdk14.jar /opt/apache/beam/jars/
#7 DONE 0.1s
#8 [ 4/16] ADD target/jcl-over-slf4j.jar /opt/apache/beam/jars/
#8 DONE 0.1s
#9 [ 5/16] ADD target/log4j-over-slf4j.jar /opt/apache/beam/jars/
#9 DONE 0.1s
#10 [ 6/16] ADD target/log4j-to-slf4j.jar /opt/apache/beam/jars/
#10 DONE 0.1s
#11 [ 7/16] ADD target/beam-sdks-java-harness.jar /opt/apache/beam/jars/
#11 DONE 0.1s
#12 [ 8/16] COPY target/jamm.jar target/open-module-agent*.jar /opt/apache/beam/jars/
#12 DONE 0.1s
#13 [ 9/16] COPY target/linux_amd64/boot /opt/apache/beam/
#13 DONE 0.2s
#14 [10/16] COPY target/LICENSE /opt/apache/beam/
#14 DONE 0.1s
#15 [11/16] COPY target/NOTICE /opt/apache/beam/
#15 DONE 0.1s
#16 [12/16] ADD target/third_party_licenses /opt/apache/beam/third_party_licenses/
#16 DONE 0.2s
#17 [13/16] COPY target/LICENSE target/options/* /opt/apache/beam/options/
#17 DONE 0.1s
#18 [14/16] COPY target/go-licenses/* /opt/apache/beam/third_party_licenses/golang/
#18 DONE 0.1s
#19 [15/16] RUN if [ "true" = "false" ] ; then rm -rf /opt/apache/beam/third_party_licenses ; fi
#19 DONE 0.4s
#20 [16/16] COPY target/profiler/* /opt/google_cloud_profiler/
#20 DONE 0.1s
#21 exporting to image
#21 exporting layers
#21 exporting layers 0.2s done
#21 writing image sha256:278dd274c4a9092ac6b88158f564e770e9a1bd73c6670bec340e58662cca31f0 done
#21 naming to docker.io/apache/beam_java8_sdk:2.50.0.dev done
#21 DONE 0.2s
> Task :runners:google-cloud-dataflow-java:buildAndPushDockerJavaContainer
WARNING: `gcloud docker` will not be supported for Docker client versions above 18.03.
As an alternative, use `gcloud auth configure-docker` to configure `docker` to
use `gcloud` as a credential helper, then use `docker` as you would for non-GCR
registries, e.g. `docker pull gcr.io/project-id/my-image`. Add
`--verbosity=error` to silence this warning: `gcloud docker
--verbosity=error -- pull gcr.io/project-id/my-image`.
See: https://cloud.google.com/container-registry/docs/support/deprecation-notices#gcloud-docker
The push refers to repository [us.gcr.io/apache-beam-testing/java-postcommit-it/java]
bcb4ea3c8eba: Preparing
5f70bf18a086: Preparing
3c71e90f97db: Preparing
4bded8e49600: Preparing
9b9b2f61ba64: Preparing
a20bae950a08: Preparing
c0e49a623fae: Preparing
44a969848c5b: Preparing
d74fcb68be01: Preparing
64df0a660ef6: Preparing
a707e4eb228d: Preparing
fd8a240eeb44: Preparing
d42e57017afa: Preparing
fc0ebc205a7e: Preparing
e5c33e0ff66e: Preparing
c5eb8ce528b2: Preparing
ea7a4f522970: Preparing
18456c7abcd6: Preparing
410573e54541: Preparing
59c56aee1fb4: Preparing
d74fcb68be01: Waiting
64df0a660ef6: Waiting
a707e4eb228d: Waiting
fd8a240eeb44: Waiting
a20bae950a08: Waiting
d42e57017afa: Waiting
c5eb8ce528b2: Waiting
fc0ebc205a7e: Waiting
44a969848c5b: Waiting
410573e54541: Waiting
e5c33e0ff66e: Waiting
ea7a4f522970: Waiting
59c56aee1fb4: Waiting
18456c7abcd6: Waiting
c0e49a623fae: Waiting
5f70bf18a086: Layer already exists
3c71e90f97db: Pushed
a20bae950a08: Pushed
4bded8e49600: Pushed
9b9b2f61ba64: Pushed
bcb4ea3c8eba: Pushed
c0e49a623fae: Pushed
d74fcb68be01: Pushed
64df0a660ef6: Pushed
a707e4eb228d: Pushed
fd8a240eeb44: Pushed
44a969848c5b: Pushed
c5eb8ce528b2: Layer already exists
ea7a4f522970: Layer already exists
410573e54541: Layer already exists
18456c7abcd6: Layer already exists
59c56aee1fb4: Layer already exists
d42e57017afa: Pushed
fc0ebc205a7e: Pushed
e5c33e0ff66e: Pushed
20230808215744: digest: sha256:0e487f5421ee8f435391822210d7c883d0e63ca85ed8423000d9e9a9e414f6c1 size: 4504
> Task :runners:google-cloud-dataflow-java:coreSDKJavaRunnerV2IntegrationTest NO-SOURCE
> Task :runners:google-cloud-dataflow-java:examplesJavaRunnerV2IntegrationTest
***********************************************************
***********************************************************
**********************Set Up Pubsub************************
The Pub/Sub topic has been set up for this example: projects/apache-beam-testing/topics/testpipeline-jenkins-0808215837-c5bee253
The Pub/Sub subscription has been set up for this example: projects/apache-beam-testing/subscriptions/testpipeline-jenkins-0808215837-c5bee253
*************************Tear Down*************************
The Pub/Sub topic has been deleted: projects/apache-beam-testing/topics/testpipeline-jenkins-0808215837-c5bee253
The Pub/Sub subscription has been deleted: projects/apache-beam-testing/subscriptions/testpipeline-jenkins-0808215837-c5bee253
***********************************************************
***********************************************************
***********************************************************
***********************************************************
**********************Set Up Pubsub************************
The Pub/Sub topic has been set up for this example: projects/apache-beam-testing/topics/testpipeline-jenkins-0808215837-e8cc3cb5
The Pub/Sub subscription has been set up for this example: projects/apache-beam-testing/subscriptions/testpipeline-jenkins-0808215837-e8cc3cb5
*************************Tear Down*************************
The Pub/Sub topic has been deleted: projects/apache-beam-testing/topics/testpipeline-jenkins-0808215837-e8cc3cb5
The Pub/Sub subscription has been deleted: projects/apache-beam-testing/subscriptions/testpipeline-jenkins-0808215837-e8cc3cb5
***********************************************************
***********************************************************
> Task :runners:google-cloud-dataflow-java:cleanUpDockerJavaImages
Untagged: us.gcr.io/apache-beam-testing/java-postcommit-it/java:20230808215744
Untagged: us.gcr.io/apache-beam-testing/java-postcommit-it/java@sha256:0e487f5421ee8f435391822210d7c883d0e63ca85ed8423000d9e9a9e414f6c1
WARNING: Successfully resolved tag to sha256, but it is recommended to use sha256 directly.
Tag: [us.gcr.io/apache-beam-testing/java-postcommit-it/java:20230808215744]
- referencing digest: [us.gcr.io/apache-beam-testing/java-postcommit-it/java@sha256:0e487f5421ee8f435391822210d7c883d0e63ca85ed8423000d9e9a9e414f6c1]
Deleted [[us.gcr.io/apache-beam-testing/java-postcommit-it/java:20230808215744] (referencing [us.gcr.io/apache-beam-testing/java-postcommit-it/java@sha256:0e487f5421ee8f435391822210d7c883d0e63ca85ed8423000d9e9a9e414f6c1])].
Removing untagged image us.gcr.io/apache-beam-testing/java-postcommit-it/java@sha256:0e487f5421ee8f435391822210d7c883d0e63ca85ed8423000d9e9a9e414f6c1
FAILURE: Build failed with an exception.
* What went wrong:
Execution failed for task ':sdks:java:io:google-cloud-platform:compileTestJava'.
> Compilation failed; see the compiler error output for details.
* Try:
> Run with --stacktrace option to get the stack trace.
> Run with --info or --debug option to get more log output.
* Get more help at https://help.gradle.org
Deprecated Gradle features were used in this build, making it incompatible with Gradle 8.0.
You can use '--warning-mode all' to show the individual deprecation warnings and determine if they come from your own scripts or plugins.
See https://docs.gradle.org/7.6.2/userguide/command_line_interface.html#sec:command_line_warnings
Execution optimizations have been disabled for 1 invalid unit(s) of work during this build to ensure correctness.
Please consult deprecation warnings for more details.
BUILD FAILED in 29m 31s
154 actionable tasks: 97 executed, 53 from cache, 4 up-to-date
Publishing build scan...
https://ge.apache.org/s/iih7y2i5t76aq
Build step 'Invoke Gradle script' changed build result to FAILURE
Build step 'Invoke Gradle script' marked build as failure
---------------------------------------------------------------------
To unsubscribe, e-mail: builds-unsubscribe@beam.apache.org
For additional commands, e-mail: builds-help@beam.apache.org
Jenkins build is back to normal : beam_PostCommit_Java_DataflowV2 #3389
Posted by Apache Jenkins Server <je...@builds.apache.org>.
See <https://ci-beam.apache.org/job/beam_PostCommit_Java_DataflowV2/3389/display/redirect>
---------------------------------------------------------------------
To unsubscribe, e-mail: builds-unsubscribe@beam.apache.org
For additional commands, e-mail: builds-help@beam.apache.org
beam_PostCommit_Java_DataflowV2 - Build # 3388 - Aborted!
Posted by Apache Jenkins Server <je...@builds.apache.org>.
beam_PostCommit_Java_DataflowV2 - Build # 3388 - Aborted:
Check console output at https://ci-beam.apache.org/job/beam_PostCommit_Java_DataflowV2/3388/ to view the results.
Build failed in Jenkins: beam_PostCommit_Java_DataflowV2 #3387
Posted by Apache Jenkins Server <je...@builds.apache.org>.
See <https://ci-beam.apache.org/job/beam_PostCommit_Java_DataflowV2/3387/display/redirect?page=changes>
Changes:
[noreply] Merge pull request #27921: Update changelog to mention new
------------------------------------------
[...truncated 70.42 KB...]
#10 DONE 0.1s
#11 [ 7/16] ADD target/beam-sdks-java-harness.jar /opt/apache/beam/jars/
#11 DONE 0.1s
#12 [ 8/16] COPY target/jamm.jar target/open-module-agent*.jar /opt/apache/beam/jars/
#12 DONE 0.1s
#13 [ 9/16] COPY target/linux_amd64/boot /opt/apache/beam/
#13 DONE 0.2s
#14 [10/16] COPY target/LICENSE /opt/apache/beam/
#14 DONE 0.1s
#15 [11/16] COPY target/NOTICE /opt/apache/beam/
#15 DONE 0.1s
#16 [12/16] ADD target/third_party_licenses /opt/apache/beam/third_party_licenses/
#16 DONE 0.3s
#17 [13/16] COPY target/LICENSE target/options/* /opt/apache/beam/options/
#17 DONE 0.1s
#18 [14/16] COPY target/go-licenses/* /opt/apache/beam/third_party_licenses/golang/
#18 DONE 0.1s
#19 [15/16] RUN if [ "true" = "false" ] ; then rm -rf /opt/apache/beam/third_party_licenses ; fi
#19 DONE 0.3s
#20 [16/16] COPY target/profiler/* /opt/google_cloud_profiler/
#20 DONE 0.2s
#21 exporting to image
#21 exporting layers
#21 exporting layers 0.2s done
#21 writing image sha256:28482a072ead544ba38cfabad25bc63c1e7ded51f12adfde2ff3a3109db8df99 done
#21 naming to docker.io/apache/beam_java8_sdk:2.50.0.dev done
#21 DONE 0.2s
> Task :runners:google-cloud-dataflow-java:buildAndPushDockerJavaContainer
WARNING: `gcloud docker` will not be supported for Docker client versions above 18.03.
As an alternative, use `gcloud auth configure-docker` to configure `docker` to
use `gcloud` as a credential helper, then use `docker` as you would for non-GCR
registries, e.g. `docker pull gcr.io/project-id/my-image`. Add
`--verbosity=error` to silence this warning: `gcloud docker
--verbosity=error -- pull gcr.io/project-id/my-image`.
See: https://cloud.google.com/container-registry/docs/support/deprecation-notices#gcloud-docker
The push refers to repository [us.gcr.io/apache-beam-testing/java-postcommit-it/java]
5182af2a6074: Preparing
5f70bf18a086: Preparing
bc0aaf6f1d44: Preparing
10f13efdffe6: Preparing
6fccb499fe6d: Preparing
9d5b0886f925: Preparing
f04a88dc5e47: Preparing
a1d32aff3b5a: Preparing
07d29f7db83e: Preparing
35d77d25acf5: Preparing
51e18d05ee41: Preparing
e9a47221e642: Preparing
ff24bd0a5d5a: Preparing
b6e7d0ba030a: Preparing
baa4c0493405: Preparing
c5eb8ce528b2: Preparing
ea7a4f522970: Preparing
18456c7abcd6: Preparing
410573e54541: Preparing
59c56aee1fb4: Preparing
f04a88dc5e47: Waiting
e9a47221e642: Waiting
a1d32aff3b5a: Waiting
51e18d05ee41: Waiting
ff24bd0a5d5a: Waiting
9d5b0886f925: Waiting
07d29f7db83e: Waiting
baa4c0493405: Waiting
b6e7d0ba030a: Waiting
410573e54541: Waiting
59c56aee1fb4: Waiting
18456c7abcd6: Waiting
ea7a4f522970: Waiting
5f70bf18a086: Layer already exists
10f13efdffe6: Pushed
9d5b0886f925: Pushed
bc0aaf6f1d44: Pushed
07d29f7db83e: Pushed
6fccb499fe6d: Pushed
f04a88dc5e47: Pushed
5182af2a6074: Pushed
a1d32aff3b5a: Pushed
51e18d05ee41: Pushed
ff24bd0a5d5a: Pushed
c5eb8ce528b2: Layer already exists
35d77d25acf5: Pushed
ea7a4f522970: Layer already exists
18456c7abcd6: Layer already exists
410573e54541: Layer already exists
59c56aee1fb4: Layer already exists
e9a47221e642: Pushed
b6e7d0ba030a: Pushed
baa4c0493405: Pushed
20230809095741: digest: sha256:8dd76153f8bf4ae5da1d841c29f879a64569d85e7ff0484ef2d79859661f7bb4 size: 4504
> Task :runners:google-cloud-dataflow-java:coreSDKJavaRunnerV2IntegrationTest NO-SOURCE
> Task :runners:google-cloud-dataflow-java:examplesJavaRunnerV2IntegrationTest
***********************************************************
***********************************************************
**********************Set Up Pubsub************************
The Pub/Sub topic has been set up for this example: projects/apache-beam-testing/topics/testpipeline-jenkins-0809095832-2cb70e51
The Pub/Sub subscription has been set up for this example: projects/apache-beam-testing/subscriptions/testpipeline-jenkins-0809095832-2cb70e51
*************************Tear Down*************************
The Pub/Sub topic has been deleted: projects/apache-beam-testing/topics/testpipeline-jenkins-0809095832-2cb70e51
The Pub/Sub subscription has been deleted: projects/apache-beam-testing/subscriptions/testpipeline-jenkins-0809095832-2cb70e51
***********************************************************
***********************************************************
***********************************************************
***********************************************************
**********************Set Up Pubsub************************
The Pub/Sub topic has been set up for this example: projects/apache-beam-testing/topics/testpipeline-jenkins-0809095831-81f16cf1
The Pub/Sub subscription has been set up for this example: projects/apache-beam-testing/subscriptions/testpipeline-jenkins-0809095831-81f16cf1
*************************Tear Down*************************
The Pub/Sub topic has been deleted: projects/apache-beam-testing/topics/testpipeline-jenkins-0809095831-81f16cf1
The Pub/Sub subscription has been deleted: projects/apache-beam-testing/subscriptions/testpipeline-jenkins-0809095831-81f16cf1
***********************************************************
***********************************************************
> Task :runners:google-cloud-dataflow-java:googleCloudPlatformRunnerV2IntegrationTest
org.apache.beam.sdk.io.gcp.bigquery.StorageApiSinkSchemaUpdateIT > testExactlyOnceWithIgnoreUnknownValues[0] FAILED
java.lang.RuntimeException at StorageApiSinkSchemaUpdateIT.java:365
org.apache.beam.sdk.io.gcp.bigquery.StorageApiSinkSchemaUpdateIT > testAtLeastOnceWithAutoSchemaUpdate[0] FAILED
java.lang.RuntimeException at StorageApiSinkSchemaUpdateIT.java:365
org.apache.beam.sdk.io.gcp.bigquery.StorageApiSinkSchemaUpdateIT > testAtLeastOnce[0] FAILED
java.lang.RuntimeException at StorageApiSinkSchemaUpdateIT.java:365
org.apache.beam.sdk.io.gcp.bigquery.StorageApiSinkSchemaUpdateIT > testAtLeastOnceWithIgnoreUnknownValues[0] FAILED
java.lang.RuntimeException at StorageApiSinkSchemaUpdateIT.java:365
org.apache.beam.sdk.io.gcp.bigquery.StorageApiSinkSchemaUpdateIT > testExactlyOnce[0] FAILED
java.lang.RuntimeException at StorageApiSinkSchemaUpdateIT.java:365
org.apache.beam.sdk.io.gcp.bigquery.StorageApiSinkSchemaUpdateIT > testExactlyOnceWithAutoSchemaUpdate[0] FAILED
java.lang.RuntimeException at StorageApiSinkSchemaUpdateIT.java:365
org.apache.beam.sdk.io.gcp.bigquery.StorageApiSinkSchemaUpdateIT > testExactlyOnceWithIgnoreUnknownValues[1] FAILED
java.lang.RuntimeException at StorageApiSinkSchemaUpdateIT.java:365
org.apache.beam.sdk.io.gcp.bigquery.StorageApiSinkSchemaUpdateIT > testAtLeastOnceWithAutoSchemaUpdate[1] FAILED
java.lang.RuntimeException at StorageApiSinkSchemaUpdateIT.java:365
org.apache.beam.sdk.io.gcp.bigquery.StorageApiSinkSchemaUpdateIT > testAtLeastOnce[1] FAILED
java.lang.RuntimeException at StorageApiSinkSchemaUpdateIT.java:365
org.apache.beam.sdk.io.gcp.bigquery.StorageApiSinkSchemaUpdateIT > testAtLeastOnceWithIgnoreUnknownValues[1] FAILED
java.lang.RuntimeException at StorageApiSinkSchemaUpdateIT.java:365
org.apache.beam.sdk.io.gcp.bigquery.StorageApiSinkSchemaUpdateIT > testExactlyOnce[1] FAILED
java.lang.RuntimeException at StorageApiSinkSchemaUpdateIT.java:365
org.apache.beam.sdk.io.gcp.bigquery.StorageApiSinkSchemaUpdateIT > testExactlyOnceWithAutoSchemaUpdate[1] FAILED
java.lang.RuntimeException at StorageApiSinkSchemaUpdateIT.java:365
org.apache.beam.sdk.io.gcp.bigquery.StorageApiSinkSchemaUpdateIT > testExactlyOnceWithIgnoreUnknownValues[2] FAILED
java.lang.RuntimeException at StorageApiSinkSchemaUpdateIT.java:365
org.apache.beam.sdk.io.gcp.bigquery.StorageApiSinkSchemaUpdateIT > testAtLeastOnceWithAutoSchemaUpdate[2] FAILED
java.lang.RuntimeException at StorageApiSinkSchemaUpdateIT.java:365
org.apache.beam.sdk.io.gcp.bigquery.StorageApiSinkSchemaUpdateIT > testAtLeastOnce[2] FAILED
java.lang.RuntimeException at StorageApiSinkSchemaUpdateIT.java:365
org.apache.beam.sdk.io.gcp.bigquery.StorageApiSinkSchemaUpdateIT > testAtLeastOnceWithIgnoreUnknownValues[2] FAILED
java.lang.RuntimeException at StorageApiSinkSchemaUpdateIT.java:365
org.apache.beam.sdk.io.gcp.bigquery.StorageApiSinkSchemaUpdateIT > testExactlyOnce[2] FAILED
java.lang.RuntimeException at StorageApiSinkSchemaUpdateIT.java:365
org.apache.beam.sdk.io.gcp.bigquery.StorageApiSinkSchemaUpdateIT > testExactlyOnceWithAutoSchemaUpdate[2] FAILED
java.lang.RuntimeException at StorageApiSinkSchemaUpdateIT.java:365
org.apache.beam.sdk.io.gcp.bigquery.StorageApiSinkSchemaUpdateIT > testExactlyOnceWithIgnoreUnknownValues[3] FAILED
java.lang.RuntimeException at StorageApiSinkSchemaUpdateIT.java:365
org.apache.beam.sdk.io.gcp.bigquery.StorageApiSinkSchemaUpdateIT > testAtLeastOnceWithAutoSchemaUpdate[3] FAILED
java.lang.RuntimeException at StorageApiSinkSchemaUpdateIT.java:365
org.apache.beam.sdk.io.gcp.bigquery.StorageApiSinkSchemaUpdateIT > testAtLeastOnce[3] FAILED
java.lang.RuntimeException at StorageApiSinkSchemaUpdateIT.java:365
org.apache.beam.sdk.io.gcp.bigquery.StorageApiSinkSchemaUpdateIT > testAtLeastOnceWithIgnoreUnknownValues[3] FAILED
java.lang.RuntimeException at StorageApiSinkSchemaUpdateIT.java:365
org.apache.beam.sdk.io.gcp.bigquery.StorageApiSinkSchemaUpdateIT > testExactlyOnce[3] FAILED
java.lang.RuntimeException at StorageApiSinkSchemaUpdateIT.java:365
org.apache.beam.sdk.io.gcp.bigquery.StorageApiSinkSchemaUpdateIT > testExactlyOnceWithAutoSchemaUpdate[3] FAILED
java.lang.RuntimeException at StorageApiSinkSchemaUpdateIT.java:365
126 tests completed, 24 failed, 3 skipped
> Task :runners:google-cloud-dataflow-java:googleCloudPlatformRunnerV2IntegrationTest FAILED
> Task :runners:google-cloud-dataflow-java:cleanUpDockerJavaImages
Untagged: us.gcr.io/apache-beam-testing/java-postcommit-it/java:20230809095741
Untagged: us.gcr.io/apache-beam-testing/java-postcommit-it/java@sha256:8dd76153f8bf4ae5da1d841c29f879a64569d85e7ff0484ef2d79859661f7bb4
Deleted: sha256:28482a072ead544ba38cfabad25bc63c1e7ded51f12adfde2ff3a3109db8df99
WARNING: Successfully resolved tag to sha256, but it is recommended to use sha256 directly.
Tag: [us.gcr.io/apache-beam-testing/java-postcommit-it/java:20230809095741]
- referencing digest: [us.gcr.io/apache-beam-testing/java-postcommit-it/java@sha256:8dd76153f8bf4ae5da1d841c29f879a64569d85e7ff0484ef2d79859661f7bb4]
Deleted [[us.gcr.io/apache-beam-testing/java-postcommit-it/java:20230809095741] (referencing [us.gcr.io/apache-beam-testing/java-postcommit-it/java@sha256:8dd76153f8bf4ae5da1d841c29f879a64569d85e7ff0484ef2d79859661f7bb4])].
Removing untagged image us.gcr.io/apache-beam-testing/java-postcommit-it/java@sha256:8dd76153f8bf4ae5da1d841c29f879a64569d85e7ff0484ef2d79859661f7bb4
FAILURE: Build failed with an exception.
* What went wrong:
Execution failed for task ':runners:google-cloud-dataflow-java:googleCloudPlatformRunnerV2IntegrationTest'.
> There were failing tests. See the report at: file://<https://ci-beam.apache.org/job/beam_PostCommit_Java_DataflowV2/ws/src/runners/google-cloud-dataflow-java/build/reports/tests/googleCloudPlatformRunnerV2IntegrationTest/index.html>
* Try:
> Run with --stacktrace option to get the stack trace.
> Run with --info or --debug option to get more log output.
* Get more help at https://help.gradle.org
Deprecated Gradle features were used in this build, making it incompatible with Gradle 8.0.
You can use '--warning-mode all' to show the individual deprecation warnings and determine if they come from your own scripts or plugins.
See https://docs.gradle.org/7.6.2/userguide/command_line_interface.html#sec:command_line_warnings
Execution optimizations have been disabled for 1 invalid unit(s) of work during this build to ensure correctness.
Please consult deprecation warnings for more details.
BUILD FAILED in 3h 20m 18s
156 actionable tasks: 98 executed, 54 from cache, 4 up-to-date
Publishing build scan...
https://ge.apache.org/s/7mtyhenqvcgx2
Build step 'Invoke Gradle script' changed build result to FAILURE
Build step 'Invoke Gradle script' marked build as failure
---------------------------------------------------------------------
To unsubscribe, e-mail: builds-unsubscribe@beam.apache.org
For additional commands, e-mail: builds-help@beam.apache.org
Build failed in Jenkins: beam_PostCommit_Java_DataflowV2 #3386
Posted by Apache Jenkins Server <je...@builds.apache.org>.
See <https://ci-beam.apache.org/job/beam_PostCommit_Java_DataflowV2/3386/display/redirect>
Changes:
------------------------------------------
[...truncated 70.19 KB...]
#10 [ 6/16] ADD target/log4j-to-slf4j.jar /opt/apache/beam/jars/
#10 DONE 0.1s
#11 [ 7/16] ADD target/beam-sdks-java-harness.jar /opt/apache/beam/jars/
#11 DONE 0.1s
#12 [ 8/16] COPY target/jamm.jar target/open-module-agent*.jar /opt/apache/beam/jars/
#12 DONE 0.1s
#13 [ 9/16] COPY target/linux_amd64/boot /opt/apache/beam/
#13 DONE 0.2s
#14 [10/16] COPY target/LICENSE /opt/apache/beam/
#14 DONE 0.1s
#15 [11/16] COPY target/NOTICE /opt/apache/beam/
#15 DONE 0.1s
#16 [12/16] ADD target/third_party_licenses /opt/apache/beam/third_party_licenses/
#16 DONE 0.3s
#17 [13/16] COPY target/LICENSE target/options/* /opt/apache/beam/options/
#17 DONE 0.1s
#18 [14/16] COPY target/go-licenses/* /opt/apache/beam/third_party_licenses/golang/
#18 DONE 0.1s
#19 [15/16] RUN if [ "true" = "false" ] ; then rm -rf /opt/apache/beam/third_party_licenses ; fi
#19 DONE 0.3s
#20 [16/16] COPY target/profiler/* /opt/google_cloud_profiler/
#20 DONE 0.1s
#21 exporting to image
#21 exporting layers
#21 exporting layers 0.2s done
#21 writing image sha256:c42a7881bdc74c88d8ee0b4c7b6cd5fbd939020c0242a284d314c66d0cf7a18f done
#21 naming to docker.io/apache/beam_java8_sdk:2.50.0.dev done
#21 DONE 0.2s
> Task :runners:google-cloud-dataflow-java:buildAndPushDockerJavaContainer
WARNING: `gcloud docker` will not be supported for Docker client versions above 18.03.
As an alternative, use `gcloud auth configure-docker` to configure `docker` to
use `gcloud` as a credential helper, then use `docker` as you would for non-GCR
registries, e.g. `docker pull gcr.io/project-id/my-image`. Add
`--verbosity=error` to silence this warning: `gcloud docker
--verbosity=error -- pull gcr.io/project-id/my-image`.
See: https://cloud.google.com/container-registry/docs/support/deprecation-notices#gcloud-docker
The push refers to repository [us.gcr.io/apache-beam-testing/java-postcommit-it/java]
0e838ab4beba: Preparing
5f70bf18a086: Preparing
890dc70867ae: Preparing
b42022fc6d92: Preparing
0983fa516b84: Preparing
3ff30c0d7165: Preparing
74e29369a409: Preparing
af5769ea6716: Preparing
164b8fd6eeff: Preparing
77db64187a18: Preparing
1e3f8f0f2b0c: Preparing
46657dfd3ba4: Preparing
d96d7c70d664: Preparing
32d01effbdd9: Preparing
45f07dbefa89: Preparing
c5eb8ce528b2: Preparing
ea7a4f522970: Preparing
3ff30c0d7165: Waiting
18456c7abcd6: Preparing
410573e54541: Preparing
74e29369a409: Waiting
59c56aee1fb4: Preparing
77db64187a18: Waiting
1e3f8f0f2b0c: Waiting
af5769ea6716: Waiting
32d01effbdd9: Waiting
d96d7c70d664: Waiting
46657dfd3ba4: Waiting
c5eb8ce528b2: Waiting
410573e54541: Waiting
45f07dbefa89: Waiting
ea7a4f522970: Waiting
5f70bf18a086: Layer already exists
b42022fc6d92: Pushed
890dc70867ae: Pushed
3ff30c0d7165: Pushed
0983fa516b84: Pushed
164b8fd6eeff: Pushed
0e838ab4beba: Pushed
74e29369a409: Pushed
77db64187a18: Pushed
1e3f8f0f2b0c: Pushed
af5769ea6716: Pushed
c5eb8ce528b2: Layer already exists
ea7a4f522970: Layer already exists
18456c7abcd6: Layer already exists
410573e54541: Layer already exists
46657dfd3ba4: Pushed
59c56aee1fb4: Layer already exists
d96d7c70d664: Pushed
32d01effbdd9: Pushed
45f07dbefa89: Pushed
20230809035741: digest: sha256:f493de092ca9a25b21eaa313bd5c7bc74aa676a67a8ce0b4ad836906007e6872 size: 4504
> Task :runners:google-cloud-dataflow-java:coreSDKJavaRunnerV2IntegrationTest NO-SOURCE
> Task :runners:google-cloud-dataflow-java:examplesJavaRunnerV2IntegrationTest
***********************************************************
***********************************************************
**********************Set Up Pubsub************************
The Pub/Sub topic has been set up for this example: projects/apache-beam-testing/topics/testpipeline-jenkins-0809035832-ed2f2e8b
The Pub/Sub subscription has been set up for this example: projects/apache-beam-testing/subscriptions/testpipeline-jenkins-0809035832-ed2f2e8b
*************************Tear Down*************************
The Pub/Sub topic has been deleted: projects/apache-beam-testing/topics/testpipeline-jenkins-0809035832-ed2f2e8b
The Pub/Sub subscription has been deleted: projects/apache-beam-testing/subscriptions/testpipeline-jenkins-0809035832-ed2f2e8b
***********************************************************
***********************************************************
***********************************************************
***********************************************************
**********************Set Up Pubsub************************
The Pub/Sub topic has been set up for this example: projects/apache-beam-testing/topics/testpipeline-jenkins-0809035832-749e28ab
The Pub/Sub subscription has been set up for this example: projects/apache-beam-testing/subscriptions/testpipeline-jenkins-0809035832-749e28ab
*************************Tear Down*************************
The Pub/Sub topic has been deleted: projects/apache-beam-testing/topics/testpipeline-jenkins-0809035832-749e28ab
The Pub/Sub subscription has been deleted: projects/apache-beam-testing/subscriptions/testpipeline-jenkins-0809035832-749e28ab
***********************************************************
***********************************************************
> Task :runners:google-cloud-dataflow-java:googleCloudPlatformRunnerV2IntegrationTest
org.apache.beam.sdk.io.gcp.bigquery.StorageApiSinkSchemaUpdateIT > testExactlyOnceWithIgnoreUnknownValues[0] FAILED
java.lang.RuntimeException at StorageApiSinkSchemaUpdateIT.java:365
org.apache.beam.sdk.io.gcp.bigquery.StorageApiSinkSchemaUpdateIT > testAtLeastOnceWithAutoSchemaUpdate[0] FAILED
java.lang.RuntimeException at StorageApiSinkSchemaUpdateIT.java:365
org.apache.beam.sdk.io.gcp.bigquery.StorageApiSinkSchemaUpdateIT > testAtLeastOnce[0] FAILED
java.lang.RuntimeException at StorageApiSinkSchemaUpdateIT.java:365
org.apache.beam.sdk.io.gcp.bigquery.StorageApiSinkSchemaUpdateIT > testAtLeastOnceWithIgnoreUnknownValues[0] FAILED
java.lang.RuntimeException at StorageApiSinkSchemaUpdateIT.java:365
org.apache.beam.sdk.io.gcp.bigquery.StorageApiSinkSchemaUpdateIT > testExactlyOnce[0] FAILED
java.lang.RuntimeException at StorageApiSinkSchemaUpdateIT.java:365
org.apache.beam.sdk.io.gcp.bigquery.StorageApiSinkSchemaUpdateIT > testExactlyOnceWithAutoSchemaUpdate[0] FAILED
java.lang.RuntimeException at StorageApiSinkSchemaUpdateIT.java:365
org.apache.beam.sdk.io.gcp.bigquery.StorageApiSinkSchemaUpdateIT > testExactlyOnceWithIgnoreUnknownValues[1] FAILED
java.lang.RuntimeException at StorageApiSinkSchemaUpdateIT.java:365
org.apache.beam.sdk.io.gcp.bigquery.StorageApiSinkSchemaUpdateIT > testAtLeastOnceWithAutoSchemaUpdate[1] FAILED
java.lang.RuntimeException at StorageApiSinkSchemaUpdateIT.java:365
org.apache.beam.sdk.io.gcp.bigquery.StorageApiSinkSchemaUpdateIT > testAtLeastOnce[1] FAILED
java.lang.RuntimeException at StorageApiSinkSchemaUpdateIT.java:365
org.apache.beam.sdk.io.gcp.bigquery.StorageApiSinkSchemaUpdateIT > testAtLeastOnceWithIgnoreUnknownValues[1] FAILED
java.lang.RuntimeException at StorageApiSinkSchemaUpdateIT.java:365
org.apache.beam.sdk.io.gcp.bigquery.StorageApiSinkSchemaUpdateIT > testExactlyOnce[1] FAILED
java.lang.RuntimeException at StorageApiSinkSchemaUpdateIT.java:365
org.apache.beam.sdk.io.gcp.bigquery.StorageApiSinkSchemaUpdateIT > testExactlyOnceWithAutoSchemaUpdate[1] FAILED
java.lang.RuntimeException at StorageApiSinkSchemaUpdateIT.java:365
org.apache.beam.sdk.io.gcp.bigquery.StorageApiSinkSchemaUpdateIT > testExactlyOnceWithIgnoreUnknownValues[2] FAILED
java.lang.RuntimeException at StorageApiSinkSchemaUpdateIT.java:365
org.apache.beam.sdk.io.gcp.bigquery.StorageApiSinkSchemaUpdateIT > testAtLeastOnceWithAutoSchemaUpdate[2] FAILED
java.lang.RuntimeException at StorageApiSinkSchemaUpdateIT.java:365
org.apache.beam.sdk.io.gcp.bigquery.StorageApiSinkSchemaUpdateIT > testAtLeastOnce[2] FAILED
java.lang.RuntimeException at StorageApiSinkSchemaUpdateIT.java:365
org.apache.beam.sdk.io.gcp.bigquery.StorageApiSinkSchemaUpdateIT > testAtLeastOnceWithIgnoreUnknownValues[2] FAILED
java.lang.RuntimeException at StorageApiSinkSchemaUpdateIT.java:365
org.apache.beam.sdk.io.gcp.bigquery.StorageApiSinkSchemaUpdateIT > testExactlyOnce[2] FAILED
java.lang.RuntimeException at StorageApiSinkSchemaUpdateIT.java:365
org.apache.beam.sdk.io.gcp.bigquery.StorageApiSinkSchemaUpdateIT > testExactlyOnceWithAutoSchemaUpdate[2] FAILED
java.lang.RuntimeException at StorageApiSinkSchemaUpdateIT.java:365
org.apache.beam.sdk.io.gcp.bigquery.StorageApiSinkSchemaUpdateIT > testExactlyOnceWithIgnoreUnknownValues[3] FAILED
java.lang.RuntimeException at StorageApiSinkSchemaUpdateIT.java:365
org.apache.beam.sdk.io.gcp.bigquery.StorageApiSinkSchemaUpdateIT > testAtLeastOnceWithAutoSchemaUpdate[3] FAILED
java.lang.RuntimeException at StorageApiSinkSchemaUpdateIT.java:365
org.apache.beam.sdk.io.gcp.bigquery.StorageApiSinkSchemaUpdateIT > testAtLeastOnce[3] FAILED
java.lang.RuntimeException at StorageApiSinkSchemaUpdateIT.java:365
org.apache.beam.sdk.io.gcp.bigquery.StorageApiSinkSchemaUpdateIT > testAtLeastOnceWithIgnoreUnknownValues[3] FAILED
java.lang.RuntimeException at StorageApiSinkSchemaUpdateIT.java:365
org.apache.beam.sdk.io.gcp.bigquery.StorageApiSinkSchemaUpdateIT > testExactlyOnce[3] FAILED
java.lang.RuntimeException at StorageApiSinkSchemaUpdateIT.java:365
org.apache.beam.sdk.io.gcp.bigquery.StorageApiSinkSchemaUpdateIT > testExactlyOnceWithAutoSchemaUpdate[3] FAILED
java.lang.RuntimeException at StorageApiSinkSchemaUpdateIT.java:365
126 tests completed, 24 failed, 3 skipped
> Task :runners:google-cloud-dataflow-java:googleCloudPlatformRunnerV2IntegrationTest FAILED
> Task :runners:google-cloud-dataflow-java:cleanUpDockerJavaImages
Untagged: us.gcr.io/apache-beam-testing/java-postcommit-it/java:20230809035741
Untagged: us.gcr.io/apache-beam-testing/java-postcommit-it/java@sha256:f493de092ca9a25b21eaa313bd5c7bc74aa676a67a8ce0b4ad836906007e6872
Deleted: sha256:c42a7881bdc74c88d8ee0b4c7b6cd5fbd939020c0242a284d314c66d0cf7a18f
WARNING: Successfully resolved tag to sha256, but it is recommended to use sha256 directly.
Tag: [us.gcr.io/apache-beam-testing/java-postcommit-it/java:20230809035741]
- referencing digest: [us.gcr.io/apache-beam-testing/java-postcommit-it/java@sha256:f493de092ca9a25b21eaa313bd5c7bc74aa676a67a8ce0b4ad836906007e6872]
Deleted [[us.gcr.io/apache-beam-testing/java-postcommit-it/java:20230809035741] (referencing [us.gcr.io/apache-beam-testing/java-postcommit-it/java@sha256:f493de092ca9a25b21eaa313bd5c7bc74aa676a67a8ce0b4ad836906007e6872])].
Removing untagged image us.gcr.io/apache-beam-testing/java-postcommit-it/java@sha256:f493de092ca9a25b21eaa313bd5c7bc74aa676a67a8ce0b4ad836906007e6872
FAILURE: Build failed with an exception.
* What went wrong:
Execution failed for task ':runners:google-cloud-dataflow-java:googleCloudPlatformRunnerV2IntegrationTest'.
> There were failing tests. See the report at: file://<https://ci-beam.apache.org/job/beam_PostCommit_Java_DataflowV2/ws/src/runners/google-cloud-dataflow-java/build/reports/tests/googleCloudPlatformRunnerV2IntegrationTest/index.html>
* Try:
> Run with --stacktrace option to get the stack trace.
> Run with --info or --debug option to get more log output.
* Get more help at https://help.gradle.org
Deprecated Gradle features were used in this build, making it incompatible with Gradle 8.0.
You can use '--warning-mode all' to show the individual deprecation warnings and determine if they come from your own scripts or plugins.
See https://docs.gradle.org/7.6.2/userguide/command_line_interface.html#sec:command_line_warnings
Execution optimizations have been disabled for 1 invalid unit(s) of work during this build to ensure correctness.
Please consult deprecation warnings for more details.
BUILD FAILED in 3h 28m 14s
156 actionable tasks: 98 executed, 54 from cache, 4 up-to-date
Publishing build scan...
https://ge.apache.org/s/j7y47ah6enfsi
Build step 'Invoke Gradle script' changed build result to FAILURE
Build step 'Invoke Gradle script' marked build as failure
---------------------------------------------------------------------
To unsubscribe, e-mail: builds-unsubscribe@beam.apache.org
For additional commands, e-mail: builds-help@beam.apache.org