You are viewing a plain text version of this content. The canonical link for it is here.
Posted to builds@cassandra.apache.org by Apache Jenkins Server <je...@builds.apache.org> on 2026/04/04 09:46:33 UTC

Build complete: Cassandra-trunk #2444 [UNSTABLE] 88e3fcfe8b436b2adf8f686d2e86e5bb9a94b50b

-------------------------------------------------------------------------------
  Build Cassandra-trunk #2444 Still Unstable
  URL: https://ci-cassandra.apache.org/job/Cassandra-trunk/2444/
  -------------------------------------------------------------------------------
  Changes:
  [Michael Semb Wever] Increment version to 6.0-alpha2


  -------------------------------------------------------------------------------
  Failed Tests:
  43 tests failed.
FAILED:  dtest-latest.auth_test.TestAuthRoles.Tests / dtest-latest jdk11 7/64 / test_grant_revoke_are_idempotent
FAILED:  dtest-latest.auth_test.TestAuthRoles.Tests / dtest-latest jdk17 7/64 / test_grant_revoke_are_idempotent
FAILED:  dtest-latest.materialized_views_test.TestMaterializedViews.Tests / dtest-latest jdk11 38/64 / test_gcgs_validation
FAILED:  dtest-novnode.rebuild_test.TestRebuild.Tests / dtest-novnode jdk21 25/64 / test_resumable_rebuild
FAILED:  dtest-novnode.replace_address_test.TestReplaceAddress.Tests / dtest-novnode jdk11 31/64 / test_fail_without_replace
FAILED:  dtest-upgrade.upgrade_tests.cql_tests.TestCQLNodes3RF3_Upgrade_indev_4_0_x_To_indev_trunk.Tests / dtest-upgrade jdk11 9/160 / test_end_of_component_as_end_key
FAILED:  dtest-upgrade.upgrade_tests.cql_tests.TestCQLNodes3RF3_Upgrade_indev_4_0_x_To_indev_trunk.Tests / dtest-upgrade jdk11 32/160 / test_user_types
FAILED:  junit.framework.TestSuite.Tests / test-cdc jdk17 7/20 / org.apache.cassandra.index.accord.RouteIndexTest-cdc_jdk17_x86_64
FAILED:  org.apache.cassandra.db.compaction.CompactionTaskTest.Tests / test-cdc jdk21 10/20 / testFullyExpiredSSTablesAreNotReleasedPrematurely-cdc_jdk21_x86_64
FAILED:  org.apache.cassandra.db.compaction.CompactionsBytemanTest.Tests / test-cdc jdk17 3/20 / testSSTableNotEnoughDiskSpaceForCompactionGetsDropped-cdc_jdk17_x86_64
FAILED:  org.apache.cassandra.distributed.test.accord.AccordHostReplacementTest.Tests / jvm-dtest jdk11 12/16 / hostReplace-_jdk11_x86_64
FAILED:  org.apache.cassandra.distributed.test.cql3.MixedReadsAccordInteropMultiNodeTableWalkTest.Tests / jvm-dtest jdk11 13/16 / test-_jdk11_x86_64
FAILED:  org.apache.cassandra.index.accord.RouteIndexTest.Tests / test-system-keyspace-directory jdk17 7/20 / test-system_keyspace_directory_jdk17_x86_64
FAILED:  org.apache.cassandra.repair.autorepair.AutoRepairParameterizedTest.Tests / test jdk21 4/20 / testRepairShufflesKeyspacesAndTables[repairType=PREVIEW_REPAIRED]-cassandra.testtag_IS_UNDEFINED
FAILED:  org.apache.cassandra.simulator.test.EpochStressTest.Tests / simulator-dtest jdk11 1/2 / manyEpochsAndAccordConverges-_jdk11_x86_64
FAILED:  dtest-novnode.rebuild_test.TestRebuild.Tests / dtest-novnode jdk11 25/64 / test_resumable_rebuild
FAILED:  org.apache.cassandra.distributed.test.accord.MigrationFromAccordWriteRaceTest.Tests / jvm-dtest jdk21 5/16 / testSplitAndRetryNonSerialLoggedBatchTwoTablesTwoPkeyHintedViaBatchLogRoutingFailure-_jdk21_x86_64
FAILED:  org.apache.cassandra.simulator.test.TrivialSimulationTest.Tests / simulator-dtest jdk11 2/2 / trivialTest-_jdk11_x86_64
FAILED:  org.apache.cassandra.distributed.test.accord.MigrationFromAccordWriteRaceTest.Tests / jvm-dtest jdk17 5/16 / testSplitAndRetryNonSerialLoggedBatchTwoTablesTwoPkeyHintedViaBatchLogRoutingFailure-_jdk17_x86_64
FAILED:  org.apache.cassandra.distributed.test.cql3.FullAccordInteropMultiNodeTableWalkTest.Tests / jvm-dtest jdk11 11/16 / test-_jdk11_x86_64
FAILED:  org.apache.cassandra.distributed.test.cql3.FullAccordInteropMultiNodeTableWalkTest.Tests / jvm-dtest jdk21 11/16 / test-_jdk21_x86_64
FAILED:  org.apache.cassandra.distributed.test.cql3.FullAccordInteropMultiNodeTableWalkTest.Tests / jvm-dtest jdk17 11/16 / test-_jdk17_x86_64
FAILED:  junit.framework.TestSuite.Tests / jvm-dtest jdk21 5/16 / org.apache.cassandra.distributed.test.accord.MigrationFromAccordWriteRaceTest-_jdk21_x86_64
FAILED:  org.apache.cassandra.simulator.test.HarrySimulatorTest.Tests / simulator-dtest jdk11 2/2 / test-cassandra.testtag_IS_UNDEFINED
FAILED:  junit.framework.TestSuite.Tests / jvm-dtest jdk17 5/16 / org.apache.cassandra.distributed.test.accord.MigrationFromAccordWriteRaceTest-_jdk17_x86_64
FAILED:  org.apache.cassandra.fuzz.topology.AccordBootstrapTest.Tests / jvm-dtest jdk11 12/16 / terminated successfully-cassandra.testtag_IS_UNDEFINED
FAILED:  org.apache.cassandra.fuzz.topology.AccordBootstrapTest.Tests / jvm-dtest jdk17 12/16 / terminated successfully-cassandra.testtag_IS_UNDEFINED
FAILED:  org.apache.cassandra.fuzz.topology.AccordBootstrapTest.Tests / jvm-dtest jdk21 12/16 / terminated successfully-cassandra.testtag_IS_UNDEFINED
FAILED:  org.apache.cassandra.simulator.test.ShortPaxosSimulationTest.Tests / simulator-dtest jdk11 2/2 / simulationTest-cassandra.testtag_IS_UNDEFINED
FAILED:  org.apache.cassandra.index.accord.RouteIndexTest.Tests / test-cdc jdk21 7/20 / test-cassandra.testtag_IS_UNDEFINED
FAILED:  org.apache.cassandra.index.accord.RouteIndexTest.Tests / test-latest jdk11 7/20 / test-cassandra.testtag_IS_UNDEFINED
FAILED:  org.apache.cassandra.index.accord.RouteIndexTest.Tests / test jdk11 7/20 / test-cassandra.testtag_IS_UNDEFINED
FAILED:  org.apache.cassandra.index.accord.RouteIndexTest.Tests / test-oa jdk11 7/20 / test-cassandra.testtag_IS_UNDEFINED
FAILED:  org.apache.cassandra.index.accord.RouteIndexTest.Tests / test-oa jdk17 7/20 / test-cassandra.testtag_IS_UNDEFINED
FAILED:  org.apache.cassandra.index.accord.RouteIndexTest.Tests / test jdk21 7/20 / test-cassandra.testtag_IS_UNDEFINED
FAILED:  org.apache.cassandra.index.accord.RouteIndexTest.Tests / test-latest jdk17 7/20 / test-cassandra.testtag_IS_UNDEFINED
FAILED:  org.apache.cassandra.index.accord.RouteIndexTest.Tests / test-cdc jdk11 7/20 / test-cassandra.testtag_IS_UNDEFINED
FAILED:  org.apache.cassandra.index.accord.RouteIndexTest.Tests / test jdk17 7/20 / test-cassandra.testtag_IS_UNDEFINED
FAILED:  org.apache.cassandra.index.accord.RouteIndexTest.Tests / test-system-keyspace-directory jdk21 7/20 / test-cassandra.testtag_IS_UNDEFINED
FAILED:  org.apache.cassandra.index.accord.RouteIndexTest.Tests / test-oa jdk21 7/20 / test-cassandra.testtag_IS_UNDEFINED
FAILED:  org.apache.cassandra.index.accord.RouteIndexTest.Tests / test-compression jdk21 7/20 / test-cassandra.testtag_IS_UNDEFINED
FAILED:  org.apache.cassandra.index.accord.RouteIndexTest.Tests / test-latest jdk21 7/20 / test-cassandra.testtag_IS_UNDEFINED
FAILED:  org.apache.cassandra.distributed.upgrade.ClusterMetadataUpgradeHarryTest.Tests / jvm-dtest-upgrade jdk11 3/6 / simpleUpgradeTest-cassandra.testtag_IS_UNDEFINED

  -------------------------------------------------------------------------------
  For complete test report and logs see https://nightlies.apache.org/cassandra/Cassandra-trunk/2444/