You are viewing a plain text version of this content. The canonical link for it is here.
Posted to builds@beam.apache.org by Apache Jenkins Server <je...@builds.apache.org> on 2023/02/02 12:22:34 UTC

Build failed in Jenkins: beam_PostCommit_XVR_Samza #2231

See <https://ci-beam.apache.org/job/beam_PostCommit_XVR_Samza/2231/display/redirect?page=changes>

Changes:

[noreply] [Spark Runner] Add new experiment that provides concurrent bounded


------------------------------------------
[...truncated 1.07 MB...]
INFO     apache_beam.utils.subprocess_server:subprocess_server.py:239 Using pre-built snapshot at <https://ci-beam.apache.org/job/beam_PostCommit_XVR_Samza/ws/src/sdks/java/extensions/sql/expansion-service/build/libs/beam-sdks-java-extensions-sql-expansion-service-2.46.0-SNAPSHOT.jar>
INFO     root:external.py:854 Starting a JAR-based expansion service from JAR <https://ci-beam.apache.org/job/beam_PostCommit_XVR_Samza/ws/src/sdks/java/extensions/sql/expansion-service/build/libs/beam-sdks-java-extensions-sql-expansion-service-2.46.0-SNAPSHOT.jar> 
INFO     apache_beam.utils.subprocess_server:subprocess_server.py:116 Starting service with ['java' '-jar' '<https://ci-beam.apache.org/job/beam_PostCommit_XVR_Samza/ws/src/sdks/java/extensions/sql/expansion-service/build/libs/beam-sdks-java-extensions-sql-expansion-service-2.46.0-SNAPSHOT.jar'> '46767' '--filesToStage=<https://ci-beam.apache.org/job/beam_PostCommit_XVR_Samza/ws/src/sdks/java/extensions/sql/expansion-service/build/libs/beam-sdks-java-extensions-sql-expansion-service-2.46.0-SNAPSHOT.jar']>
INFO     apache_beam.utils.subprocess_server:subprocess_server.py:126 Starting expansion service at localhost:46767
INFO     apache_beam.utils.subprocess_server:subprocess_server.py:126 Feb 02, 2023 12:20:58 PM org.apache.beam.sdk.expansion.service.ExpansionService loadRegisteredTransforms
INFO     apache_beam.utils.subprocess_server:subprocess_server.py:126 INFO: Registering external transforms: [beam:external:java:sql:v1, beam:transform:org.apache.beam:pubsub_read:v1, beam:transform:org.apache.beam:pubsub_write:v1, beam:transform:org.apache.beam:pubsublite_write:v1, beam:transform:org.apache.beam:pubsublite_read:v1, beam:transform:org.apache.beam:spanner_insert:v1, beam:transform:org.apache.beam:spanner_update:v1, beam:transform:org.apache.beam:spanner_replace:v1, beam:transform:org.apache.beam:spanner_insert_or_update:v1, beam:transform:org.apache.beam:spanner_delete:v1, beam:transform:org.apache.beam:spanner_read:v1, beam:transform:org.apache.beam:kafka_read_with_metadata:v1, beam:transform:org.apache.beam:kafka_read_without_metadata:v1, beam:transform:org.apache.beam:kafka_write:v1, beam:external:java:generate_sequence:v1]
INFO     apache_beam.utils.subprocess_server:subprocess_server.py:126 
INFO     apache_beam.utils.subprocess_server:subprocess_server.py:126 Registered transforms:
INFO     apache_beam.utils.subprocess_server:subprocess_server.py:126 	beam:external:java:sql:v1: org.apache.beam.sdk.expansion.service.ExpansionService$ExternalTransformRegistrarLoader$1@38425407
INFO     apache_beam.utils.subprocess_server:subprocess_server.py:126 	beam:transform:org.apache.beam:pubsub_read:v1: org.apache.beam.sdk.expansion.service.ExpansionService$ExternalTransformRegistrarLoader$1@43bc63a3
INFO     apache_beam.utils.subprocess_server:subprocess_server.py:126 	beam:transform:org.apache.beam:pubsub_write:v1: org.apache.beam.sdk.expansion.service.ExpansionService$ExternalTransformRegistrarLoader$1@702657cc
INFO     apache_beam.utils.subprocess_server:subprocess_server.py:126 	beam:transform:org.apache.beam:pubsublite_write:v1: org.apache.beam.sdk.expansion.service.ExpansionService$ExternalTransformRegistrarLoader$1@6a6cb05c
INFO     apache_beam.utils.subprocess_server:subprocess_server.py:126 	beam:transform:org.apache.beam:pubsublite_read:v1: org.apache.beam.sdk.expansion.service.ExpansionService$ExternalTransformRegistrarLoader$1@40a4337a
INFO     apache_beam.utils.subprocess_server:subprocess_server.py:126 	beam:transform:org.apache.beam:spanner_insert:v1: org.apache.beam.sdk.expansion.service.ExpansionService$ExternalTransformRegistrarLoader$1@6025e1b6
INFO     apache_beam.utils.subprocess_server:subprocess_server.py:126 	beam:transform:org.apache.beam:spanner_update:v1: org.apache.beam.sdk.expansion.service.ExpansionService$ExternalTransformRegistrarLoader$1@22ff4249
INFO     apache_beam.utils.subprocess_server:subprocess_server.py:126 	beam:transform:org.apache.beam:spanner_replace:v1: org.apache.beam.sdk.expansion.service.ExpansionService$ExternalTransformRegistrarLoader$1@2d1ef81a
INFO     apache_beam.utils.subprocess_server:subprocess_server.py:126 	beam:transform:org.apache.beam:spanner_insert_or_update:v1: org.apache.beam.sdk.expansion.service.ExpansionService$ExternalTransformRegistrarLoader$1@4c402120
INFO     apache_beam.utils.subprocess_server:subprocess_server.py:126 	beam:transform:org.apache.beam:spanner_delete:v1: org.apache.beam.sdk.expansion.service.ExpansionService$ExternalTransformRegistrarLoader$1@327514f
INFO     apache_beam.utils.subprocess_server:subprocess_server.py:126 	beam:transform:org.apache.beam:spanner_read:v1: org.apache.beam.sdk.expansion.service.ExpansionService$ExternalTransformRegistrarLoader$1@5b12b668
INFO     apache_beam.utils.subprocess_server:subprocess_server.py:126 	beam:transform:org.apache.beam:kafka_read_with_metadata:v1: org.apache.beam.sdk.expansion.service.ExpansionService$ExternalTransformRegistrarLoader$1@1165b38
INFO     apache_beam.utils.subprocess_server:subprocess_server.py:126 	beam:transform:org.apache.beam:kafka_read_without_metadata:v1: org.apache.beam.sdk.expansion.service.ExpansionService$ExternalTransformRegistrarLoader$1@4c12331b
INFO     apache_beam.utils.subprocess_server:subprocess_server.py:126 	beam:transform:org.apache.beam:kafka_write:v1: org.apache.beam.sdk.expansion.service.ExpansionService$ExternalTransformRegistrarLoader$1@7586beff
INFO     apache_beam.utils.subprocess_server:subprocess_server.py:126 	beam:external:java:generate_sequence:v1: org.apache.beam.sdk.expansion.service.ExpansionService$ExternalTransformRegistrarLoader$1@3b69e7d1
INFO     apache_beam.utils.subprocess_server:subprocess_server.py:126 
INFO     apache_beam.utils.subprocess_server:subprocess_server.py:126 Registered SchemaTransformProviders:
INFO     apache_beam.utils.subprocess_server:subprocess_server.py:126 	beam:schematransform:org.apache.beam:kafka_read:v1
INFO     apache_beam.utils.subprocess_server:subprocess_server.py:126 	beam:schematransform:org.apache.beam:kafka_write:v1
INFO     apache_beam.utils.subprocess_server:subprocess_server.py:126 	beam:schematransform:org.apache.beam:bigquery_storage_write:v1
INFO     apache_beam.utils.subprocess_server:subprocess_server.py:126 	beam:schematransform:org.apache.beam:pubsub_read:v1
INFO     apache_beam.utils.subprocess_server:subprocess_server.py:126 	beam:schematransform:org.apache.beam:pubsub_write:v1
INFO     apache_beam.utils.subprocess_server:subprocess_server.py:126 	beam:schematransform:org.apache.beam:pubsublite_write:v1
INFO     apache_beam.utils.subprocess_server:subprocess_server.py:126 	beam:schematransform:org.apache.beam:spanner_write:v1
INFO     apache_beam.utils.subprocess_server:subprocess_server.py:126 	beam:schematransform:org.apache.beam:pubsublite_read:v1
INFO     apache_beam.utils.subprocess_server:subprocess_server.py:126 	beam:schematransform:org.apache.beam:bigquery_storage_read:v1
INFO     apache_beam.utils.subprocess_server:subprocess_server.py:126 Feb 02, 2023 12:20:59 PM org.apache.beam.sdk.expansion.service.ExpansionService expand
INFO     apache_beam.utils.subprocess_server:subprocess_server.py:126 INFO: Expanding 'SqlTransform(beam:external:java:sql:v1)' with URN 'beam:external:java:sql:v1'
INFO     apache_beam.utils.subprocess_server:subprocess_server.py:126 Feb 02, 2023 12:20:59 PM org.apache.beam.sdk.expansion.service.ExpansionService$ExternalTransformRegistrarLoader payloadToConfig
INFO     apache_beam.utils.subprocess_server:subprocess_server.py:126 WARNING: Configuration class 'org.apache.beam.sdk.extensions.sql.expansion.ExternalSqlTransformRegistrar$Configuration' has no schema registered. Attempting to construct with setter approach.
INFO     apache_beam.utils.subprocess_server:subprocess_server.py:126 Feb 02, 2023 12:21:00 PM org.apache.beam.sdk.expansion.service.ExpansionService$ExternalTransformRegistrarLoader payloadToConfig
INFO     apache_beam.utils.subprocess_server:subprocess_server.py:126 WARNING: Configuration class 'org.apache.beam.sdk.extensions.sql.expansion.ExternalSqlTransformRegistrar$Configuration' has no schema registered. Attempting to construct with setter approach.
INFO     apache_beam.utils.subprocess_server:subprocess_server.py:126 Feb 02, 2023 12:21:01 PM org.apache.beam.sdk.extensions.sql.impl.CalciteQueryPlanner convertToBeamRel
INFO     apache_beam.utils.subprocess_server:subprocess_server.py:126 INFO: SQL:
INFO     apache_beam.utils.subprocess_server:subprocess_server.py:126 SELECT `simple`.`id` AS `id`, `enrich`.`metadata` AS `metadata`
INFO     apache_beam.utils.subprocess_server:subprocess_server.py:126 FROM `beam`.`simple` AS `simple`
INFO     apache_beam.utils.subprocess_server:subprocess_server.py:126 INNER JOIN `beam`.`enrich` AS `enrich` ON `simple`.`id` = `enrich`.`id`
INFO     apache_beam.utils.subprocess_server:subprocess_server.py:126 Feb 02, 2023 12:21:02 PM org.apache.beam.sdk.extensions.sql.impl.CalciteQueryPlanner convertToBeamRel
INFO     apache_beam.utils.subprocess_server:subprocess_server.py:126 INFO: SQLPlan>
INFO     apache_beam.utils.subprocess_server:subprocess_server.py:126 LogicalProject(id=[$0], metadata=[$4])
INFO     apache_beam.utils.subprocess_server:subprocess_server.py:126   LogicalJoin(condition=[=($0, $3)], joinType=[inner])
INFO     apache_beam.utils.subprocess_server:subprocess_server.py:126     BeamIOSourceRel(table=[[beam, simple]])
INFO     apache_beam.utils.subprocess_server:subprocess_server.py:126     BeamIOSourceRel(table=[[beam, enrich]])
INFO     apache_beam.utils.subprocess_server:subprocess_server.py:126 
INFO     apache_beam.utils.subprocess_server:subprocess_server.py:126 Feb 02, 2023 12:21:02 PM org.apache.beam.sdk.extensions.sql.impl.CalciteQueryPlanner convertToBeamRel
INFO     apache_beam.utils.subprocess_server:subprocess_server.py:126 INFO: BEAMPlan>
INFO     apache_beam.utils.subprocess_server:subprocess_server.py:126 BeamCalcRel(expr#0..4=[{inputs}], id=[$t0], metadata=[$t4])
INFO     apache_beam.utils.subprocess_server:subprocess_server.py:126   BeamCoGBKJoinRel(condition=[=($0, $3)], joinType=[inner])
INFO     apache_beam.utils.subprocess_server:subprocess_server.py:126     BeamIOSourceRel(table=[[beam, simple]])
INFO     apache_beam.utils.subprocess_server:subprocess_server.py:126     BeamIOSourceRel(table=[[beam, enrich]])
INFO     apache_beam.utils.subprocess_server:subprocess_server.py:126 
INFO     root:environments.py:376 Default Python SDK image for environment is apache/beam_python3.7_sdk:2.46.0.dev
INFO     root:environments.py:299 No image given, using default Python SDK image
INFO     root:environments.py:376 Default Python SDK image for environment is apache/beam_python3.7_sdk:2.46.0.dev
INFO     root:environments.py:304 Python SDK container image set to "apache/beam_python3.7_sdk:2.46.0.dev" for Docker environment
INFO     apache_beam.runners.portability.fn_api_runner.translations:translations.py:710 ==================== <function pack_combiners at 0x7fb993fc6440> ====================
INFO     apache_beam.runners.portability.fn_api_runner.translations:translations.py:710 ==================== <function lift_combiners at 0x7fb993fc64d0> ====================
INFO     apache_beam.runners.portability.fn_api_runner.translations:translations.py:710 ==================== <function sort_stages at 0x7fb993fc6c20> ====================
INFO     apache_beam.runners.portability.portable_runner:portable_runner.py:583 Job state changed to STOPPED
INFO     apache_beam.runners.portability.portable_runner:portable_runner.py:583 Job state changed to STARTING
INFO     apache_beam.runners.portability.portable_runner:portable_runner.py:583 Job state changed to RUNNING
INFO     apache_beam.runners.portability.portable_runner:portable_runner.py:583 Job state changed to DONE
PASSED                                                                   [ 77%]
apache_beam/transforms/sql_test.py::SqlTransformTest::test_windowing_before_sql 
-------------------------------- live log call ---------------------------------
INFO     apache_beam.utils.subprocess_server:subprocess_server.py:239 Using pre-built snapshot at <https://ci-beam.apache.org/job/beam_PostCommit_XVR_Samza/ws/src/sdks/java/extensions/sql/expansion-service/build/libs/beam-sdks-java-extensions-sql-expansion-service-2.46.0-SNAPSHOT.jar>
INFO     root:external.py:854 Starting a JAR-based expansion service from JAR <https://ci-beam.apache.org/job/beam_PostCommit_XVR_Samza/ws/src/sdks/java/extensions/sql/expansion-service/build/libs/beam-sdks-java-extensions-sql-expansion-service-2.46.0-SNAPSHOT.jar> 
INFO     apache_beam.utils.subprocess_server:subprocess_server.py:116 Starting service with ['java' '-jar' '<https://ci-beam.apache.org/job/beam_PostCommit_XVR_Samza/ws/src/sdks/java/extensions/sql/expansion-service/build/libs/beam-sdks-java-extensions-sql-expansion-service-2.46.0-SNAPSHOT.jar'> '40423' '--filesToStage=<https://ci-beam.apache.org/job/beam_PostCommit_XVR_Samza/ws/src/sdks/java/extensions/sql/expansion-service/build/libs/beam-sdks-java-extensions-sql-expansion-service-2.46.0-SNAPSHOT.jar']>
INFO     apache_beam.utils.subprocess_server:subprocess_server.py:126 Starting expansion service at localhost:40423
INFO     apache_beam.utils.subprocess_server:subprocess_server.py:126 Feb 02, 2023 12:21:28 PM org.apache.beam.sdk.expansion.service.ExpansionService loadRegisteredTransforms
INFO     apache_beam.utils.subprocess_server:subprocess_server.py:126 INFO: Registering external transforms: [beam:external:java:sql:v1, beam:transform:org.apache.beam:pubsub_read:v1, beam:transform:org.apache.beam:pubsub_write:v1, beam:transform:org.apache.beam:pubsublite_write:v1, beam:transform:org.apache.beam:pubsublite_read:v1, beam:transform:org.apache.beam:spanner_insert:v1, beam:transform:org.apache.beam:spanner_update:v1, beam:transform:org.apache.beam:spanner_replace:v1, beam:transform:org.apache.beam:spanner_insert_or_update:v1, beam:transform:org.apache.beam:spanner_delete:v1, beam:transform:org.apache.beam:spanner_read:v1, beam:transform:org.apache.beam:kafka_read_with_metadata:v1, beam:transform:org.apache.beam:kafka_read_without_metadata:v1, beam:transform:org.apache.beam:kafka_write:v1, beam:external:java:generate_sequence:v1]
INFO     apache_beam.utils.subprocess_server:subprocess_server.py:126 
INFO     apache_beam.utils.subprocess_server:subprocess_server.py:126 Registered transforms:
INFO     apache_beam.utils.subprocess_server:subprocess_server.py:126 	beam:external:java:sql:v1: org.apache.beam.sdk.expansion.service.ExpansionService$ExternalTransformRegistrarLoader$1@38425407
INFO     apache_beam.utils.subprocess_server:subprocess_server.py:126 	beam:transform:org.apache.beam:pubsub_read:v1: org.apache.beam.sdk.expansion.service.ExpansionService$ExternalTransformRegistrarLoader$1@43bc63a3
INFO     apache_beam.utils.subprocess_server:subprocess_server.py:126 	beam:transform:org.apache.beam:pubsub_write:v1: org.apache.beam.sdk.expansion.service.ExpansionService$ExternalTransformRegistrarLoader$1@702657cc
INFO     apache_beam.utils.subprocess_server:subprocess_server.py:126 	beam:transform:org.apache.beam:pubsublite_write:v1: org.apache.beam.sdk.expansion.service.ExpansionService$ExternalTransformRegistrarLoader$1@6a6cb05c
INFO     apache_beam.utils.subprocess_server:subprocess_server.py:126 	beam:transform:org.apache.beam:pubsublite_read:v1: org.apache.beam.sdk.expansion.service.ExpansionService$ExternalTransformRegistrarLoader$1@40a4337a
INFO     apache_beam.utils.subprocess_server:subprocess_server.py:126 	beam:transform:org.apache.beam:spanner_insert:v1: org.apache.beam.sdk.expansion.service.ExpansionService$ExternalTransformRegistrarLoader$1@6025e1b6
INFO     apache_beam.utils.subprocess_server:subprocess_server.py:126 	beam:transform:org.apache.beam:spanner_update:v1: org.apache.beam.sdk.expansion.service.ExpansionService$ExternalTransformRegistrarLoader$1@22ff4249
INFO     apache_beam.utils.subprocess_server:subprocess_server.py:126 	beam:transform:org.apache.beam:spanner_replace:v1: org.apache.beam.sdk.expansion.service.ExpansionService$ExternalTransformRegistrarLoader$1@2d1ef81a
INFO     apache_beam.utils.subprocess_server:subprocess_server.py:126 	beam:transform:org.apache.beam:spanner_insert_or_update:v1: org.apache.beam.sdk.expansion.service.ExpansionService$ExternalTransformRegistrarLoader$1@4c402120
INFO     apache_beam.utils.subprocess_server:subprocess_server.py:126 	beam:transform:org.apache.beam:spanner_delete:v1: org.apache.beam.sdk.expansion.service.ExpansionService$ExternalTransformRegistrarLoader$1@327514f
INFO     apache_beam.utils.subprocess_server:subprocess_server.py:126 	beam:transform:org.apache.beam:spanner_read:v1: org.apache.beam.sdk.expansion.service.ExpansionService$ExternalTransformRegistrarLoader$1@5b12b668
INFO     apache_beam.utils.subprocess_server:subprocess_server.py:126 	beam:transform:org.apache.beam:kafka_read_with_metadata:v1: org.apache.beam.sdk.expansion.service.ExpansionService$ExternalTransformRegistrarLoader$1@1165b38
INFO     apache_beam.utils.subprocess_server:subprocess_server.py:126 	beam:transform:org.apache.beam:kafka_read_without_metadata:v1: org.apache.beam.sdk.expansion.service.ExpansionService$ExternalTransformRegistrarLoader$1@4c12331b
INFO     apache_beam.utils.subprocess_server:subprocess_server.py:126 	beam:transform:org.apache.beam:kafka_write:v1: org.apache.beam.sdk.expansion.service.ExpansionService$ExternalTransformRegistrarLoader$1@7586beff
INFO     apache_beam.utils.subprocess_server:subprocess_server.py:126 	beam:external:java:generate_sequence:v1: org.apache.beam.sdk.expansion.service.ExpansionService$ExternalTransformRegistrarLoader$1@3b69e7d1
INFO     apache_beam.utils.subprocess_server:subprocess_server.py:126 
INFO     apache_beam.utils.subprocess_server:subprocess_server.py:126 Registered SchemaTransformProviders:
INFO     apache_beam.utils.subprocess_server:subprocess_server.py:126 	beam:schematransform:org.apache.beam:kafka_read:v1
INFO     apache_beam.utils.subprocess_server:subprocess_server.py:126 	beam:schematransform:org.apache.beam:kafka_write:v1
INFO     apache_beam.utils.subprocess_server:subprocess_server.py:126 	beam:schematransform:org.apache.beam:bigquery_storage_write:v1
INFO     apache_beam.utils.subprocess_server:subprocess_server.py:126 	beam:schematransform:org.apache.beam:pubsub_read:v1
INFO     apache_beam.utils.subprocess_server:subprocess_server.py:126 	beam:schematransform:org.apache.beam:pubsub_write:v1
INFO     apache_beam.utils.subprocess_server:subprocess_server.py:126 	beam:schematransform:org.apache.beam:pubsublite_write:v1
INFO     apache_beam.utils.subprocess_server:subprocess_server.py:126 	beam:schematransform:org.apache.beam:spanner_write:v1
INFO     apache_beam.utils.subprocess_server:subprocess_server.py:126 	beam:schematransform:org.apache.beam:pubsublite_read:v1
INFO     apache_beam.utils.subprocess_server:subprocess_server.py:126 	beam:schematransform:org.apache.beam:bigquery_storage_read:v1
INFO     apache_beam.utils.subprocess_server:subprocess_server.py:126 Feb 02, 2023 12:21:29 PM org.apache.beam.sdk.expansion.service.ExpansionService expand
INFO     apache_beam.utils.subprocess_server:subprocess_server.py:126 INFO: Expanding 'SqlTransform(beam:external:java:sql:v1)' with URN 'beam:external:java:sql:v1'
INFO     apache_beam.utils.subprocess_server:subprocess_server.py:126 Feb 02, 2023 12:21:29 PM org.apache.beam.sdk.expansion.service.ExpansionService$ExternalTransformRegistrarLoader payloadToConfig
INFO     apache_beam.utils.subprocess_server:subprocess_server.py:126 WARNING: Configuration class 'org.apache.beam.sdk.extensions.sql.expansion.ExternalSqlTransformRegistrar$Configuration' has no schema registered. Attempting to construct with setter approach.
INFO     apache_beam.utils.subprocess_server:subprocess_server.py:126 Feb 02, 2023 12:21:30 PM org.apache.beam.sdk.expansion.service.ExpansionService$ExternalTransformRegistrarLoader payloadToConfig
INFO     apache_beam.utils.subprocess_server:subprocess_server.py:126 WARNING: Configuration class 'org.apache.beam.sdk.extensions.sql.expansion.ExternalSqlTransformRegistrar$Configuration' has no schema registered. Attempting to construct with setter approach.
INFO     apache_beam.utils.subprocess_server:subprocess_server.py:126 Feb 02, 2023 12:21:31 PM org.apache.beam.sdk.extensions.sql.impl.CalciteQueryPlanner convertToBeamRel
INFO     apache_beam.utils.subprocess_server:subprocess_server.py:126 INFO: SQL:
INFO     apache_beam.utils.subprocess_server:subprocess_server.py:126 SELECT COUNT(*) AS `count`
INFO     apache_beam.utils.subprocess_server:subprocess_server.py:126 FROM `beam`.`PCOLLECTION` AS `PCOLLECTION`
INFO     apache_beam.utils.subprocess_server:subprocess_server.py:126 Feb 02, 2023 12:21:31 PM org.apache.beam.sdk.extensions.sql.impl.CalciteQueryPlanner convertToBeamRel
INFO     apache_beam.utils.subprocess_server:subprocess_server.py:126 INFO: SQLPlan>
INFO     apache_beam.utils.subprocess_server:subprocess_server.py:126 LogicalAggregate(group=[{}], count=[COUNT()])
INFO     apache_beam.utils.subprocess_server:subprocess_server.py:126   BeamIOSourceRel(table=[[beam, PCOLLECTION]])
INFO     apache_beam.utils.subprocess_server:subprocess_server.py:126 
INFO     apache_beam.utils.subprocess_server:subprocess_server.py:126 Feb 02, 2023 12:21:32 PM org.apache.beam.sdk.extensions.sql.impl.CalciteQueryPlanner convertToBeamRel
INFO     apache_beam.utils.subprocess_server:subprocess_server.py:126 INFO: BEAMPlan>
INFO     apache_beam.utils.subprocess_server:subprocess_server.py:126 BeamAggregationRel(group=[{}], count=[COUNT()])
INFO     apache_beam.utils.subprocess_server:subprocess_server.py:126   BeamIOSourceRel(table=[[beam, PCOLLECTION]])
INFO     apache_beam.utils.subprocess_server:subprocess_server.py:126 
INFO     root:environments.py:376 Default Python SDK image for environment is apache/beam_python3.7_sdk:2.46.0.dev
INFO     root:environments.py:299 No image given, using default Python SDK image
INFO     root:environments.py:376 Default Python SDK image for environment is apache/beam_python3.7_sdk:2.46.0.dev
INFO     root:environments.py:304 Python SDK container image set to "apache/beam_python3.7_sdk:2.46.0.dev" for Docker environment
INFO     apache_beam.runners.portability.fn_api_runner.translations:translations.py:710 ==================== <function pack_combiners at 0x7fb993fc6440> ====================
INFO     apache_beam.runners.portability.fn_api_runner.translations:translations.py:710 ==================== <function lift_combiners at 0x7fb993fc64d0> ====================
INFO     apache_beam.runners.portability.fn_api_runner.translations:translations.py:710 ==================== <function sort_stages at 0x7fb993fc6c20> ====================
INFO     apache_beam.runners.portability.portable_runner:portable_runner.py:583 Job state changed to STOPPED
INFO     apache_beam.runners.portability.portable_runner:portable_runner.py:583 Job state changed to STARTING
INFO     apache_beam.runners.portability.portable_runner:portable_runner.py:583 Job state changed to RUNNING
INFO     apache_beam.runners.portability.portable_runner:portable_runner.py:583 Job state changed to DONE
PASSED                                                                   [ 88%]
apache_beam/transforms/sql_test.py::SqlTransformTest::test_zetasql_generate_data 
-------------------------------- live log call ---------------------------------
INFO     apache_beam.utils.subprocess_server:subprocess_server.py:239 Using pre-built snapshot at <https://ci-beam.apache.org/job/beam_PostCommit_XVR_Samza/ws/src/sdks/java/extensions/sql/expansion-service/build/libs/beam-sdks-java-extensions-sql-expansion-service-2.46.0-SNAPSHOT.jar>
INFO     root:external.py:854 Starting a JAR-based expansion service from JAR <https://ci-beam.apache.org/job/beam_PostCommit_XVR_Samza/ws/src/sdks/java/extensions/sql/expansion-service/build/libs/beam-sdks-java-extensions-sql-expansion-service-2.46.0-SNAPSHOT.jar> 
INFO     apache_beam.utils.subprocess_server:subprocess_server.py:116 Starting service with ['java' '-jar' '<https://ci-beam.apache.org/job/beam_PostCommit_XVR_Samza/ws/src/sdks/java/extensions/sql/expansion-service/build/libs/beam-sdks-java-extensions-sql-expansion-service-2.46.0-SNAPSHOT.jar'> '44977' '--filesToStage=<https://ci-beam.apache.org/job/beam_PostCommit_XVR_Samza/ws/src/sdks/java/extensions/sql/expansion-service/build/libs/beam-sdks-java-extensions-sql-expansion-service-2.46.0-SNAPSHOT.jar']>
INFO     apache_beam.utils.subprocess_server:subprocess_server.py:126 Starting expansion service at localhost:44977
INFO     apache_beam.utils.subprocess_server:subprocess_server.py:126 Feb 02, 2023 12:21:57 PM org.apache.beam.sdk.expansion.service.ExpansionService loadRegisteredTransforms
INFO     apache_beam.utils.subprocess_server:subprocess_server.py:126 INFO: Registering external transforms: [beam:external:java:sql:v1, beam:transform:org.apache.beam:pubsub_read:v1, beam:transform:org.apache.beam:pubsub_write:v1, beam:transform:org.apache.beam:pubsublite_write:v1, beam:transform:org.apache.beam:pubsublite_read:v1, beam:transform:org.apache.beam:spanner_insert:v1, beam:transform:org.apache.beam:spanner_update:v1, beam:transform:org.apache.beam:spanner_replace:v1, beam:transform:org.apache.beam:spanner_insert_or_update:v1, beam:transform:org.apache.beam:spanner_delete:v1, beam:transform:org.apache.beam:spanner_read:v1, beam:transform:org.apache.beam:kafka_read_with_metadata:v1, beam:transform:org.apache.beam:kafka_read_without_metadata:v1, beam:transform:org.apache.beam:kafka_write:v1, beam:external:java:generate_sequence:v1]
INFO     apache_beam.utils.subprocess_server:subprocess_server.py:126 
INFO     apache_beam.utils.subprocess_server:subprocess_server.py:126 Registered transforms:
INFO     apache_beam.utils.subprocess_server:subprocess_server.py:126 	beam:external:java:sql:v1: org.apache.beam.sdk.expansion.service.ExpansionService$ExternalTransformRegistrarLoader$1@38425407
INFO     apache_beam.utils.subprocess_server:subprocess_server.py:126 	beam:transform:org.apache.beam:pubsub_read:v1: org.apache.beam.sdk.expansion.service.ExpansionService$ExternalTransformRegistrarLoader$1@43bc63a3
INFO     apache_beam.utils.subprocess_server:subprocess_server.py:126 	beam:transform:org.apache.beam:pubsub_write:v1: org.apache.beam.sdk.expansion.service.ExpansionService$ExternalTransformRegistrarLoader$1@702657cc
INFO     apache_beam.utils.subprocess_server:subprocess_server.py:126 	beam:transform:org.apache.beam:pubsublite_write:v1: org.apache.beam.sdk.expansion.service.ExpansionService$ExternalTransformRegistrarLoader$1@6a6cb05c
INFO     apache_beam.utils.subprocess_server:subprocess_server.py:126 	beam:transform:org.apache.beam:pubsublite_read:v1: org.apache.beam.sdk.expansion.service.ExpansionService$ExternalTransformRegistrarLoader$1@40a4337a
INFO     apache_beam.utils.subprocess_server:subprocess_server.py:126 	beam:transform:org.apache.beam:spanner_insert:v1: org.apache.beam.sdk.expansion.service.ExpansionService$ExternalTransformRegistrarLoader$1@6025e1b6
INFO     apache_beam.utils.subprocess_server:subprocess_server.py:126 	beam:transform:org.apache.beam:spanner_update:v1: org.apache.beam.sdk.expansion.service.ExpansionService$ExternalTransformRegistrarLoader$1@22ff4249
INFO     apache_beam.utils.subprocess_server:subprocess_server.py:126 	beam:transform:org.apache.beam:spanner_replace:v1: org.apache.beam.sdk.expansion.service.ExpansionService$ExternalTransformRegistrarLoader$1@2d1ef81a
INFO     apache_beam.utils.subprocess_server:subprocess_server.py:126 	beam:transform:org.apache.beam:spanner_insert_or_update:v1: org.apache.beam.sdk.expansion.service.ExpansionService$ExternalTransformRegistrarLoader$1@4c402120
INFO     apache_beam.utils.subprocess_server:subprocess_server.py:126 	beam:transform:org.apache.beam:spanner_delete:v1: org.apache.beam.sdk.expansion.service.ExpansionService$ExternalTransformRegistrarLoader$1@327514f
INFO     apache_beam.utils.subprocess_server:subprocess_server.py:126 	beam:transform:org.apache.beam:spanner_read:v1: org.apache.beam.sdk.expansion.service.ExpansionService$ExternalTransformRegistrarLoader$1@5b12b668
INFO     apache_beam.utils.subprocess_server:subprocess_server.py:126 	beam:transform:org.apache.beam:kafka_read_with_metadata:v1: org.apache.beam.sdk.expansion.service.ExpansionService$ExternalTransformRegistrarLoader$1@1165b38
INFO     apache_beam.utils.subprocess_server:subprocess_server.py:126 	beam:transform:org.apache.beam:kafka_read_without_metadata:v1: org.apache.beam.sdk.expansion.service.ExpansionService$ExternalTransformRegistrarLoader$1@4c12331b
INFO     apache_beam.utils.subprocess_server:subprocess_server.py:126 	beam:transform:org.apache.beam:kafka_write:v1: org.apache.beam.sdk.expansion.service.ExpansionService$ExternalTransformRegistrarLoader$1@7586beff
INFO     apache_beam.utils.subprocess_server:subprocess_server.py:126 	beam:external:java:generate_sequence:v1: org.apache.beam.sdk.expansion.service.ExpansionService$ExternalTransformRegistrarLoader$1@3b69e7d1
INFO     apache_beam.utils.subprocess_server:subprocess_server.py:126 
INFO     apache_beam.utils.subprocess_server:subprocess_server.py:126 Registered SchemaTransformProviders:
INFO     apache_beam.utils.subprocess_server:subprocess_server.py:126 	beam:schematransform:org.apache.beam:kafka_read:v1
INFO     apache_beam.utils.subprocess_server:subprocess_server.py:126 	beam:schematransform:org.apache.beam:kafka_write:v1
INFO     apache_beam.utils.subprocess_server:subprocess_server.py:126 	beam:schematransform:org.apache.beam:bigquery_storage_write:v1
INFO     apache_beam.utils.subprocess_server:subprocess_server.py:126 	beam:schematransform:org.apache.beam:pubsub_read:v1
INFO     apache_beam.utils.subprocess_server:subprocess_server.py:126 	beam:schematransform:org.apache.beam:pubsub_write:v1
INFO     apache_beam.utils.subprocess_server:subprocess_server.py:126 	beam:schematransform:org.apache.beam:pubsublite_write:v1
INFO     apache_beam.utils.subprocess_server:subprocess_server.py:126 	beam:schematransform:org.apache.beam:spanner_write:v1
INFO     apache_beam.utils.subprocess_server:subprocess_server.py:126 	beam:schematransform:org.apache.beam:pubsublite_read:v1
INFO     apache_beam.utils.subprocess_server:subprocess_server.py:126 	beam:schematransform:org.apache.beam:bigquery_storage_read:v1
INFO     apache_beam.utils.subprocess_server:subprocess_server.py:126 Feb 02, 2023 12:21:59 PM org.apache.beam.sdk.expansion.service.ExpansionService expand
INFO     apache_beam.utils.subprocess_server:subprocess_server.py:126 INFO: Expanding 'SqlTransform(beam:external:java:sql:v1)' with URN 'beam:external:java:sql:v1'
INFO     apache_beam.utils.subprocess_server:subprocess_server.py:126 Feb 02, 2023 12:21:59 PM org.apache.beam.sdk.expansion.service.ExpansionService$ExternalTransformRegistrarLoader payloadToConfig
INFO     apache_beam.utils.subprocess_server:subprocess_server.py:126 WARNING: Configuration class 'org.apache.beam.sdk.extensions.sql.expansion.ExternalSqlTransformRegistrar$Configuration' has no schema registered. Attempting to construct with setter approach.
INFO     apache_beam.utils.subprocess_server:subprocess_server.py:126 Feb 02, 2023 12:22:00 PM org.apache.beam.sdk.expansion.service.ExpansionService$ExternalTransformRegistrarLoader payloadToConfig
INFO     apache_beam.utils.subprocess_server:subprocess_server.py:126 WARNING: Configuration class 'org.apache.beam.sdk.extensions.sql.expansion.ExternalSqlTransformRegistrar$Configuration' has no schema registered. Attempting to construct with setter approach.
INFO     apache_beam.utils.subprocess_server:subprocess_server.py:126 Feb 02, 2023 12:22:01 PM com.google.zetasql.io.grpc.NameResolverRegistry getDefaultRegistry
INFO     apache_beam.utils.subprocess_server:subprocess_server.py:126 WARNING: No NameResolverProviders found via ServiceLoader, including for DNS. This is probably due to a broken build. If using ProGuard, check your configuration
INFO     apache_beam.utils.subprocess_server:subprocess_server.py:126 Feb 02, 2023 12:22:03 PM org.apache.beam.sdk.extensions.sql.zetasql.ZetaSQLQueryPlanner convertToBeamRelInternal
INFO     apache_beam.utils.subprocess_server:subprocess_server.py:126 INFO: BEAMPlan>
INFO     apache_beam.utils.subprocess_server:subprocess_server.py:126 BeamZetaSqlCalcRel(expr#0=[{inputs}], expr#1=[1:BIGINT], expr#2=['foo':VARCHAR], expr#3=[3.1400000000000001243E0:DOUBLE], int=[$t1], str=[$t2], flt=[$t3])
INFO     apache_beam.utils.subprocess_server:subprocess_server.py:126   BeamValuesRel(tuples=[[{ 0 }]])
INFO     apache_beam.utils.subprocess_server:subprocess_server.py:126 
INFO     root:environments.py:376 Default Python SDK image for environment is apache/beam_python3.7_sdk:2.46.0.dev
INFO     root:environments.py:299 No image given, using default Python SDK image
INFO     root:environments.py:376 Default Python SDK image for environment is apache/beam_python3.7_sdk:2.46.0.dev
INFO     root:environments.py:304 Python SDK container image set to "apache/beam_python3.7_sdk:2.46.0.dev" for Docker environment
INFO     apache_beam.runners.portability.fn_api_runner.translations:translations.py:710 ==================== <function pack_combiners at 0x7fb993fc6440> ====================
INFO     apache_beam.runners.portability.fn_api_runner.translations:translations.py:710 ==================== <function lift_combiners at 0x7fb993fc64d0> ====================
INFO     apache_beam.runners.portability.fn_api_runner.translations:translations.py:710 ==================== <function sort_stages at 0x7fb993fc6c20> ====================
INFO     apache_beam.runners.portability.portable_runner:portable_runner.py:583 Job state changed to STOPPED
INFO     apache_beam.runners.portability.portable_runner:portable_runner.py:583 Job state changed to STARTING
INFO     apache_beam.runners.portability.portable_runner:portable_runner.py:583 Job state changed to RUNNING
INFO     apache_beam.runners.portability.portable_runner:portable_runner.py:583 Job state changed to DONE
PASSED                                                                   [100%]

=============================== warnings summary ===============================
../../build/gradleenv/1922375555/lib/python3.7/site-packages/hdfs/config.py:15
  <https://ci-beam.apache.org/job/beam_PostCommit_XVR_Samza/ws/src/build/gradleenv/1922375555/lib/python3.7/site-packages/hdfs/config.py>:15: DeprecationWarning: the imp module is deprecated in favour of importlib; see the module's documentation for alternative uses
    from imp import load_source

-- Docs: https://docs.pytest.org/en/stable/how-to/capture-warnings.html
- generated xml file: <https://ci-beam.apache.org/job/beam_PostCommit_XVR_Samza/ws/src/sdks/python/pytest_xlangSqlValidateRunner.xml> -
===== 9 passed, 6 skipped, 6803 deselected, 1 warning in 267.83s (0:04:27) =====

> Task :runners:samza:job-server:samzaJobServerCleanup
Stopping job server pid: 3779544.

> Task :runners:samza:job-server:validatesCrossLanguageRunnerCleanup
Stopping expansion service pid: 3787752.
Stopping expansion service pid: 3787753.

FAILURE: Build failed with an exception.

* Where:
Build file '<https://ci-beam.apache.org/job/beam_PostCommit_XVR_Samza/ws/src/sdks/go/test/build.gradle'> line: 193

* What went wrong:
Execution failed for task ':runners:samza:job-server:validatesCrossLanguageRunnerGoUsingJava'.
> Process 'command 'sh'' finished with non-zero exit value 1

* Try:
> Run with --stacktrace option to get the stack trace.
> Run with --info or --debug option to get more log output.

* Get more help at https://help.gradle.org

Deprecated Gradle features were used in this build, making it incompatible with Gradle 8.0.

You can use '--warning-mode all' to show the individual deprecation warnings and determine if they come from your own scripts or plugins.

See https://docs.gradle.org/7.5.1/userguide/command_line_interface.html#sec:command_line_warnings

Execution optimizations have been disabled for 1 invalid unit(s) of work during this build to ensure correctness.
Please consult deprecation warnings for more details.

BUILD FAILED in 40m 1s
261 actionable tasks: 178 executed, 71 from cache, 12 up-to-date

Publishing build scan...
https://gradle.com/s/5h2odyy7gmb6s

Build step 'Invoke Gradle script' changed build result to FAILURE
Build step 'Invoke Gradle script' marked build as failure

---------------------------------------------------------------------
To unsubscribe, e-mail: builds-unsubscribe@beam.apache.org
For additional commands, e-mail: builds-help@beam.apache.org


Jenkins build is back to normal : beam_PostCommit_XVR_Samza #2236

Posted by Apache Jenkins Server <je...@builds.apache.org>.
See <https://ci-beam.apache.org/job/beam_PostCommit_XVR_Samza/2236/display/redirect?page=changes>


---------------------------------------------------------------------
To unsubscribe, e-mail: builds-unsubscribe@beam.apache.org
For additional commands, e-mail: builds-help@beam.apache.org


Build failed in Jenkins: beam_PostCommit_XVR_Samza #2235

Posted by Apache Jenkins Server <je...@builds.apache.org>.
See <https://ci-beam.apache.org/job/beam_PostCommit_XVR_Samza/2235/display/redirect?page=changes>

Changes:

[noreply] [Spark Dataset runner] Fix collection encoder bug that may lead to


------------------------------------------
[...truncated 956.07 KB...]
        urn: "beam:coder:kv:v1"
      >
      component_coder_ids: "wtsKamdjghVarIntCoder"
      component_coder_ids: "wtsKamdjghIterableCoder"
    >
  >
  coders: <
    key: "wtsKamdjghNullableCoder"
    value: <
      spec: <
        urn: "beam:coder:nullable:v1"
      >
      component_coder_ids: "wtsKamdjghByteArrayCoder"
    >
  >
  coders: <
    key: "wtsKamdjghSerializableCoder"
    value: <
      spec: <
        urn: "beam:coders:javasdk:0.1"
        payload: "\202SNAPPY\000\000\000\000\001\000\000\000\001\000\000\000\312\214\002\360^\254\355\000\005sr\000,org.apache.beam.sdk.coders.SerializableCoder\010\364 \216\305ynl\002\000\001L\000\004typet\000\021Ljava/lang/Class;xr\000&ofV\000\024Custom\005P8j\260\010\235\013;\035\013\002\000\000xr\000 j\213\000\005/\034C\335\325\211\256\274~\370\001/\020pvr\000;N1\000Pio.BoundedReadFromUnb\t\021`Source$Shardd\236\240U\205\000j\363\002\000\000xp"
      >
    >
  >
  coders: <
    key: "wtsKamdjghSnappyCoder"
    value: <
      spec: <
        urn: "beam:coders:javasdk:0.1"
        payload: "\202SNAPPY\000\000\000\000\001\000\000\000\001\000\000\001.\307\003\360@\254\355\000\005sr\000&org.apache.beam.sdk.coders.SnappyCoder1\033\243\356\177\362\366,\002\000\001L\000\ninner\005\030 t\000\"Lorg/a\005B\000/\001B\020/sdk/\tB\000/\005$\020;xr\000*ng\000 tructured\005/8s\277\022\016\325\3246\021\002\000\000xr\000 j9\000\005/\034C\335\325\211\256\274~\370\001/\020psr\000,j1\000,Serializable\005= \010\364 \216\305ynl\002\001\327\\\004typet\000\021Ljava/lang/Class\001\300n'\001\024Custom\005PPj\260\010\235\013;\035\013\002\000\000xq\000~\000\003vr\000$N\221\000\\io.BoundedSource!`v\023\177\370QA\0019\010r\000\035Z3\000\t,0\020\213\372\020Y\214\347\323\002\000\000xp"
      >
    >
  >
  coders: <
    key: "wtsKamdjghTimestampedValueCoder"
    value: <
      spec: <
        urn: "beam:coders:javasdk:0.1"
        payload: "\202SNAPPY\000\000\000\000\001\000\000\000\001\000\000\001?\315\003\270\254\355\000\005sr\000Aorg.apache.beam.sdk.values.TimestampedV\001\022\000$>\021\000LCoder\364\376\202p\274iX-\002\000\001L\000\nv\001)\005\030\034t\000\"Lorg/\t]\000/\001],/sdk/coders/\005$\020;xr\000*N\202\000\t%(.Structured\005/8s\277\022\016\325\3246\021\002\000\000xr\000 j9\000\005/\034C\335\325\211\256\274~\370\001/\020psr\000,j1\000(Serializabl\t\277\034\010\364 \216\305ynl\005\327\\\004typet\000\021Ljava/lang/Class\001\300\000&jV\000\024Custom\005\215Pj\260\010\235\013;\035\013\002\000\000xq\000~\000\003vr\000;N;\000Pio.BoundedReadFromUnb\t\021`Source$Shardd\236\240U\205\000j\363\002\000\000xp"
      >
    >
  >
  coders: <
    key: "wtsKamdjghValueWithRecordIdCoder"
    value: <
      spec: <
        urn: "beam:coders:javasdk:0.1"
        payload: "\202SNAPPY\000\000\000\000\001\000\000\000\001\000\000\001\213\311\005\320\254\355\000\005sr\000Corg.apache.beam.sdk.values.ValueWithRecordId$B\022\000LCoder{\343\376bQ\014\204>\002\000\002L\000\007i\t\025\034t\000+Lorg/\t\\\000/\001\\\024/sdk/c\0012(s/ByteArray\005B\014;L\000\n\005u\005\016\010t\000\"n;\000\005$\020;xr\000*N\274\000\t`(.Structured\005/8s\277\022\016\325\3246\021\002\000\000xr\000 j9\000\005/\034C\335\325\211\256\274~\370\001/\020psr\000)j1\0006\312\000\034\351\277\005|\263\3746\333\001:\010r\000&j8\000\024Atomic\005o\034\307\354\265\314\205tPF\0015 q\000~\000\003sr\000-N;\000$io.kafka.K\001\006\000R%\227\005B<I\320\251Y\032\341{#\002\000\001L\000\007kv\005\025\010t\000$nH\001\000K\t&\000;\025s\000\"Ns\000-P\r- j\000\275\271\035\243\3126\002!\353\010\010ke)\277\001\264\000\0022\303\001\005\022\025Y\000(jY\000\030Nullabl)\372\034E\333\0336>\220\247\007\005\307]\022.O\000\001\014,\006sq\000~\000\016q\000~\000\020"
      >
    >
  >
  coders: <
    key: "wtsKamdjghVarIntCoder"
    value: <
      spec: <
        urn: "beam:coders:javasdk:0.1"
        payload: "\202SNAPPY\000\000\000\000\001\000\000\000\001\000\000\000\210\330\001\350\254\355\000\005sr\000&org.apache.beam.sdk.coders.VarIntCoder\300K2\332\251KVh\002\000\000xrr5\000\024Atomic\0055 \307\354\265\314\205tPF\002\0055\000*jj\000$Structured\0059\034s\277\022\016\325\3246\021\t9\000 j9\000\005/0C\335\325\211\256\274~\370\002\000\000xp"
      >
    >
  >
  coders: <
    key: "wtsKamdjghVoidCoder"
    value: <
      spec: <
        urn: "beam:coders:javasdk:0.1"
        payload: "\202SNAPPY\000\000\000\000\001\000\000\000\001\000\000\000\210\326\001\350\254\355\000\005sr\000$org.apache.beam.sdk.coders.VoidCoder\271\277U\233\350\r\257U\002\000\000xr\000&j3\000\024Atomic\0055 \307\354\265\314\205tPF\002\0055\000*j5\000$Structured\0059\034s\277\022\016\325\3246\021\t9\000 j9\000\005/0C\335\325\211\256\274~\370\002\000\000xp"
      >
    >
  >
  environments: <
    key: "go"
    value: <
      urn: "beam:env:docker:v1"
      payload: "\n\026apache/beam_go_sdk:dev"
      capabilities: "beam:protocol:progress_reporting:v1"
      capabilities: "beam:protocol:multi_core_bundle_processing:v1"
      capabilities: "beam:transform:sdf_truncate_sized_restrictions:v1"
      capabilities: "beam:protocol:worker_status:v1"
      capabilities: "beam:protocol:monitoring_info_short_ids:v1"
      capabilities: "beam:version:sdk_base:go:apache/beam_go_sdk:2.46.0.dev"
      capabilities: "beam:coder:bytes:v1"
      capabilities: "beam:coder:bool:v1"
      capabilities: "beam:coder:varint:v1"
      capabilities: "beam:coder:double:v1"
      capabilities: "beam:coder:string_utf8:v1"
      capabilities: "beam:coder:length_prefix:v1"
      capabilities: "beam:coder:kv:v1"
      capabilities: "beam:coder:iterable:v1"
      capabilities: "beam:coder:state_backed_iterable:v1"
      capabilities: "beam:coder:windowed_value:v1"
      capabilities: "beam:coder:global_window:v1"
      capabilities: "beam:coder:interval_window:v1"
      capabilities: "beam:coder:row:v1"
      capabilities: "beam:coder:nullable:v1"
      dependencies: <
        type_urn: "beam:artifact:type:file:v1"
        role_urn: "beam:artifact:role:go_worker_binary:v1"
      >
    >
  >
  environments: <
    key: "wtsKamdjghbeam:env:docker:v1"
    value: <
      urn: "beam:env:docker:v1"
      payload: "\n apache/beam_java8_sdk:2.46.0.dev"
      capabilities: "beam:coder:bytes:v1"
      capabilities: "beam:coder:bool:v1"
      capabilities: "beam:coder:varint:v1"
      capabilities: "beam:coder:string_utf8:v1"
      capabilities: "beam:coder:iterable:v1"
      capabilities: "beam:coder:timer:v1"
      capabilities: "beam:coder:kv:v1"
      capabilities: "beam:coder:length_prefix:v1"
      capabilities: "beam:coder:global_window:v1"
      capabilities: "beam:coder:interval_window:v1"
      capabilities: "beam:coder:custom_window:v1"
      capabilities: "beam:coder:windowed_value:v1"
      capabilities: "beam:coder:double:v1"
      capabilities: "beam:coder:row:v1"
      capabilities: "beam:coder:param_windowed_value:v1"
      capabilities: "beam:coder:state_backed_iterable:v1"
      capabilities: "beam:coder:sharded_key:v1"
      capabilities: "beam:coder:nullable:v1"
      capabilities: "beam:protocol:multi_core_bundle_processing:v1"
      capabilities: "beam:protocol:progress_reporting:v1"
      capabilities: "beam:protocol:harness_monitoring_infos:v1"
      capabilities: "beam:protocol:control_request_elements_embedding:v1"
      capabilities: "beam:protocol:state_caching:v1"
      capabilities: "beam:version:sdk_base:apache/beam_java8_sdk:2.46.0.dev"
      capabilities: "beam:transform:sdf_truncate_sized_restrictions:v1"
      capabilities: "beam:transform:to_string:v1"
      dependencies: <
        type_urn: "beam:artifact:type:file:v1"
        type_payload: "\nL/tmp/artifacts/icedtea-sound-5xFkOD7aUmX8Jiw7lPqhn75zkNGCyUOfOuqi2rClWKM.jar\022@e71164383eda5265fc262c3b94faa19fbe7390d182c9439f3aeaa2dab0a558a3"
        role_urn: "beam:artifact:role:staging_to:v1"
        role_payload: "\n=icedtea-sound-5xFkOD7aUmX8Jiw7lPqhn75zkNGCyUOfOuqi2rClWKM.jar"
      >
      dependencies: <
        type_urn: "beam:artifact:type:file:v1"
        type_payload: "\nF/tmp/artifacts/jaccess-Rlp7GfuSFOBCBGdO8af2XxrTz5LqaQqwSMAXumdbHN0.jar\022@465a7b19fb9214e04204674ef1a7f65f1ad3cf92ea690ab048c017ba675b1cdd"
        role_urn: "beam:artifact:role:staging_to:v1"
        role_payload: "\n7jaccess-Rlp7GfuSFOBCBGdO8af2XxrTz5LqaQqwSMAXumdbHN0.jar"
      >
      dependencies: <
        type_urn: "beam:artifact:type:file:v1"
        type_payload: "\nI/tmp/artifacts/localedata-Nuzln2shadVmT-PppqaNc7GHBbUyMUb9pXsJTjRiAzs.jar\022@36ece59f6b2169d5664fe3e9a6a68d73b18705b5323146fda57b094e3462033b"
        role_urn: "beam:artifact:role:staging_to:v1"
        role_payload: "\n:localedata-Nuzln2shadVmT-PppqaNc7GHBbUyMUb9pXsJTjRiAzs.jar"
      >
      dependencies: <
        type_urn: "beam:artifact:type:file:v1"
        type_payload: "\nF/tmp/artifacts/nashorn-1iQRhJvU2nRCSB4ucg6f4b69TGiwE1yq0_LGG2MU5N0.jar\022@d62411849bd4da7442481e2e720e9fe1bebd4c68b0135caad3f2c61b6314e4dd"
        role_urn: "beam:artifact:role:staging_to:v1"
        role_payload: "\n7nashorn-1iQRhJvU2nRCSB4ucg6f4b69TGiwE1yq0_LGG2MU5N0.jar"
      >
      dependencies: <
        type_urn: "beam:artifact:type:file:v1"
        type_payload: "\nG/tmp/artifacts/cldrdata-MTK3mMuUzlWYlYkweGQNzI7dFpuLG0_8F8oxT0khQDc.jar\022@3132b798cb94ce559895893078640dcc8edd169b8b1b4ffc17ca314f49214037"
        role_urn: "beam:artifact:role:staging_to:v1"
        role_payload: "\n8cldrdata-MTK3mMuUzlWYlYkweGQNzI7dFpuLG0_8F8oxT0khQDc.jar"
      >
      dependencies: <
        type_urn: "beam:artifact:type:file:v1"
        type_payload: "\nD/tmp/artifacts/dnsns-YTF3f6B-OG4FmXLRf2ckHBi4VJnspBZTyIQCz-6Spwk.jar\022@6131777fa07e386e059972d17f67241c18b85499eca41653c88402cfee92a709"
        role_urn: "beam:artifact:role:staging_to:v1"
        role_payload: "\n5dnsns-YTF3f6B-OG4FmXLRf2ckHBi4VJnspBZTyIQCz-6Spwk.jar"
      >
      dependencies: <
        type_urn: "beam:artifact:type:file:v1"
        type_payload: "\nr/tmp/artifacts/beam-sdks-java-io-expansion-service-2.46.0-SNAPSHOT-51Tm_YY_8ewy9PPWtYGPN5bbVZO-P8v4NpGBbXwHkyk.jar\022@e754e6fd863ff1ec32f4f3d6b5818f3796db5593be3fcbf83691816d7c079329"
        role_urn: "beam:artifact:role:staging_to:v1"
        role_payload: "\ncbeam-sdks-java-io-expansion-service-2.46.0-SNAPSHOT-51Tm_YY_8ewy9PPWtYGPN5bbVZO-P8v4NpGBbXwHkyk.jar"
      >
    >
  >
>
root_transform_ids: "e4"
root_transform_ids: "e5"
root_transform_ids: "s1"
root_transform_ids: "s3"
requirements: "beam:requirement:pardo:splittable_dofn:v1"
2023/02/03 12:02:34 Cross-compiling <https://ci-beam.apache.org/job/beam_PostCommit_XVR_Samza/ws/src/sdks/go/test/integration/io/xlang/kafka/kafka_test.go> as /tmp/worker-2-1675425754392759650
2023/02/03 12:02:36 Prepared job with id: go-testkafkaio_basicreadwrite-199_8a7e606b-35f9-4217-b3a3-8699591b7f4d and staging token: go-testkafkaio_basicreadwrite-199_8a7e606b-35f9-4217-b3a3-8699591b7f4d
2023/02/03 12:02:36 Staged binary artifact with token: 
2023/02/03 12:02:36 Submitted job: go0testkafkaio0basicreadwrite0199-jenkins-0203120236-daf40d81_e351fa26-b395-45e2-b549-aa437e3514b4
2023/02/03 12:02:36 Job state: STOPPED
2023/02/03 12:02:36 Job state: STARTING
2023/02/03 12:02:36 Job state: RUNNING
2023/02/03 12:02:46 Job state: DONE
--- PASS: TestKafkaIO_BasicReadWrite (28.45s)
PASS
ok  	github.com/apache/beam/sdks/v2/go/test/integration/io/xlang/kafka	34.495s
FAIL

> Task :runners:samza:job-server:validatesCrossLanguageRunnerGoUsingJava FAILED
> Task :runners:samza:job-server:validatesCrossLanguageRunnerJavaUsingPython
INFO:root:Default Python SDK image for environment is apache/beam_python3.8_sdk:2.44.0
INFO:root:No image given, using default Python SDK image
INFO:root:Default Python SDK image for environment is apache/beam_python3.8_sdk:2.44.0
INFO:root:Python SDK container image set to "apache/beam_python3.8_sdk:2.44.0" for Docker environment
INFO:__main__:Listening for expansion requests at 40559
INFO:root:Missing pipeline option (runner). Executing pipeline using the default runner: DirectRunner.
INFO:__main__:Shutting down expansion service.
INFO:apache_beam.runners.portability.stager:Executing command: ['/home/jenkins/.apache_beam/cache/venvs/py-3.8-beam-2.44.0-743bdccef67087512a7a190820e727aab7bdcb14/bin/python', '-m', 'pip', 'download', '--dest', '/tmp/dataflow-requirements-cache', '-r', '/tmp/tmp2d40x94_/tmp_requirements.txt', '--exists-action', 'i', '--no-deps', '--implementation', 'cp', '--abi', 'cp38', '--platform', 'manylinux2014_x86_64']
INFO:root:Default Python SDK image for environment is apache/beam_python3.8_sdk:2.44.0
INFO:root:No image given, using default Python SDK image
INFO:root:Default Python SDK image for environment is apache/beam_python3.8_sdk:2.44.0
INFO:root:Python SDK container image set to "apache/beam_python3.8_sdk:2.44.0" for Docker environment
INFO:__main__:Listening for expansion requests at 36345
INFO:root:Missing pipeline option (runner). Executing pipeline using the default runner: DirectRunner.
INFO:__main__:Shutting down expansion service.

> Task :runners:samza:job-server:validatesCrossLanguageRunnerPythonUsingJava
> Task :runners:samza:job-server:validatesCrossLanguageRunnerPythonUsingSql
> Task :runners:samza:job-server:samzaJobServerCleanup
> Task :runners:samza:job-server:validatesCrossLanguageRunnerCleanup

FAILURE: Build failed with an exception.

* Where:
Build file '<https://ci-beam.apache.org/job/beam_PostCommit_XVR_Samza/ws/src/sdks/go/test/build.gradle'> line: 193

* What went wrong:
Execution failed for task ':runners:samza:job-server:validatesCrossLanguageRunnerGoUsingJava'.
> Process 'command 'sh'' finished with non-zero exit value 1

* Try:
> Run with --stacktrace option to get the stack trace.
> Run with --info or --debug option to get more log output.

* Get more help at https://help.gradle.org

Deprecated Gradle features were used in this build, making it incompatible with Gradle 8.0.

You can use '--warning-mode all' to show the individual deprecation warnings and determine if they come from your own scripts or plugins.

See https://docs.gradle.org/7.5.1/userguide/command_line_interface.html#sec:command_line_warnings

Execution optimizations have been disabled for 1 invalid unit(s) of work during this build to ensure correctness.
Please consult deprecation warnings for more details.

BUILD FAILED in 44m 38s
261 actionable tasks: 172 executed, 77 from cache, 12 up-to-date

Publishing build scan...
https://gradle.com/s/soaojvkn7ksoc

Build step 'Invoke Gradle script' changed build result to FAILURE
Build step 'Invoke Gradle script' marked build as failure

---------------------------------------------------------------------
To unsubscribe, e-mail: builds-unsubscribe@beam.apache.org
For additional commands, e-mail: builds-help@beam.apache.org


Build failed in Jenkins: beam_PostCommit_XVR_Samza #2234

Posted by Apache Jenkins Server <je...@builds.apache.org>.
See <https://ci-beam.apache.org/job/beam_PostCommit_XVR_Samza/2234/display/redirect?page=changes>

Changes:

[noreply] [CdapIO] Implement windowed write (#25206)


------------------------------------------
[...truncated 1.53 MB...]
INFO     apache_beam.utils.subprocess_server:subprocess_server.py:239 Using pre-built snapshot at <https://ci-beam.apache.org/job/beam_PostCommit_XVR_Samza/ws/src/sdks/java/extensions/sql/expansion-service/build/libs/beam-sdks-java-extensions-sql-expansion-service-2.46.0-SNAPSHOT.jar>
INFO     root:external.py:854 Starting a JAR-based expansion service from JAR <https://ci-beam.apache.org/job/beam_PostCommit_XVR_Samza/ws/src/sdks/java/extensions/sql/expansion-service/build/libs/beam-sdks-java-extensions-sql-expansion-service-2.46.0-SNAPSHOT.jar> 
INFO     apache_beam.utils.subprocess_server:subprocess_server.py:116 Starting service with ['java' '-jar' '<https://ci-beam.apache.org/job/beam_PostCommit_XVR_Samza/ws/src/sdks/java/extensions/sql/expansion-service/build/libs/beam-sdks-java-extensions-sql-expansion-service-2.46.0-SNAPSHOT.jar'> '48657' '--filesToStage=<https://ci-beam.apache.org/job/beam_PostCommit_XVR_Samza/ws/src/sdks/java/extensions/sql/expansion-service/build/libs/beam-sdks-java-extensions-sql-expansion-service-2.46.0-SNAPSHOT.jar']>
INFO     apache_beam.utils.subprocess_server:subprocess_server.py:126 Starting expansion service at localhost:48657
INFO     apache_beam.utils.subprocess_server:subprocess_server.py:126 Feb 03, 2023 6:18:49 AM org.apache.beam.sdk.expansion.service.ExpansionService loadRegisteredTransforms
INFO     apache_beam.utils.subprocess_server:subprocess_server.py:126 INFO: Registering external transforms: [beam:external:java:sql:v1, beam:transform:org.apache.beam:pubsub_read:v1, beam:transform:org.apache.beam:pubsub_write:v1, beam:transform:org.apache.beam:pubsublite_write:v1, beam:transform:org.apache.beam:pubsublite_read:v1, beam:transform:org.apache.beam:spanner_insert:v1, beam:transform:org.apache.beam:spanner_update:v1, beam:transform:org.apache.beam:spanner_replace:v1, beam:transform:org.apache.beam:spanner_insert_or_update:v1, beam:transform:org.apache.beam:spanner_delete:v1, beam:transform:org.apache.beam:spanner_read:v1, beam:transform:org.apache.beam:kafka_read_with_metadata:v1, beam:transform:org.apache.beam:kafka_read_without_metadata:v1, beam:transform:org.apache.beam:kafka_write:v1, beam:external:java:generate_sequence:v1]
INFO     apache_beam.utils.subprocess_server:subprocess_server.py:126 
INFO     apache_beam.utils.subprocess_server:subprocess_server.py:126 Registered transforms:
INFO     apache_beam.utils.subprocess_server:subprocess_server.py:126 	beam:external:java:sql:v1: org.apache.beam.sdk.expansion.service.ExpansionService$ExternalTransformRegistrarLoader$1@38425407
INFO     apache_beam.utils.subprocess_server:subprocess_server.py:126 	beam:transform:org.apache.beam:pubsub_read:v1: org.apache.beam.sdk.expansion.service.ExpansionService$ExternalTransformRegistrarLoader$1@43bc63a3
INFO     apache_beam.utils.subprocess_server:subprocess_server.py:126 	beam:transform:org.apache.beam:pubsub_write:v1: org.apache.beam.sdk.expansion.service.ExpansionService$ExternalTransformRegistrarLoader$1@702657cc
INFO     apache_beam.utils.subprocess_server:subprocess_server.py:126 	beam:transform:org.apache.beam:pubsublite_write:v1: org.apache.beam.sdk.expansion.service.ExpansionService$ExternalTransformRegistrarLoader$1@6a6cb05c
INFO     apache_beam.utils.subprocess_server:subprocess_server.py:126 	beam:transform:org.apache.beam:pubsublite_read:v1: org.apache.beam.sdk.expansion.service.ExpansionService$ExternalTransformRegistrarLoader$1@40a4337a
INFO     apache_beam.utils.subprocess_server:subprocess_server.py:126 	beam:transform:org.apache.beam:spanner_insert:v1: org.apache.beam.sdk.expansion.service.ExpansionService$ExternalTransformRegistrarLoader$1@6025e1b6
INFO     apache_beam.utils.subprocess_server:subprocess_server.py:126 	beam:transform:org.apache.beam:spanner_update:v1: org.apache.beam.sdk.expansion.service.ExpansionService$ExternalTransformRegistrarLoader$1@22ff4249
INFO     apache_beam.utils.subprocess_server:subprocess_server.py:126 	beam:transform:org.apache.beam:spanner_replace:v1: org.apache.beam.sdk.expansion.service.ExpansionService$ExternalTransformRegistrarLoader$1@2d1ef81a
INFO     apache_beam.utils.subprocess_server:subprocess_server.py:126 	beam:transform:org.apache.beam:spanner_insert_or_update:v1: org.apache.beam.sdk.expansion.service.ExpansionService$ExternalTransformRegistrarLoader$1@4c402120
INFO     apache_beam.utils.subprocess_server:subprocess_server.py:126 	beam:transform:org.apache.beam:spanner_delete:v1: org.apache.beam.sdk.expansion.service.ExpansionService$ExternalTransformRegistrarLoader$1@327514f
INFO     apache_beam.utils.subprocess_server:subprocess_server.py:126 	beam:transform:org.apache.beam:spanner_read:v1: org.apache.beam.sdk.expansion.service.ExpansionService$ExternalTransformRegistrarLoader$1@5b12b668
INFO     apache_beam.utils.subprocess_server:subprocess_server.py:126 	beam:transform:org.apache.beam:kafka_read_with_metadata:v1: org.apache.beam.sdk.expansion.service.ExpansionService$ExternalTransformRegistrarLoader$1@1165b38
INFO     apache_beam.utils.subprocess_server:subprocess_server.py:126 	beam:transform:org.apache.beam:kafka_read_without_metadata:v1: org.apache.beam.sdk.expansion.service.ExpansionService$ExternalTransformRegistrarLoader$1@4c12331b
INFO     apache_beam.utils.subprocess_server:subprocess_server.py:126 	beam:transform:org.apache.beam:kafka_write:v1: org.apache.beam.sdk.expansion.service.ExpansionService$ExternalTransformRegistrarLoader$1@7586beff
INFO     apache_beam.utils.subprocess_server:subprocess_server.py:126 	beam:external:java:generate_sequence:v1: org.apache.beam.sdk.expansion.service.ExpansionService$ExternalTransformRegistrarLoader$1@3b69e7d1
INFO     apache_beam.utils.subprocess_server:subprocess_server.py:126 
INFO     apache_beam.utils.subprocess_server:subprocess_server.py:126 Registered SchemaTransformProviders:
INFO     apache_beam.utils.subprocess_server:subprocess_server.py:126 	beam:schematransform:org.apache.beam:kafka_read:v1
INFO     apache_beam.utils.subprocess_server:subprocess_server.py:126 	beam:schematransform:org.apache.beam:kafka_write:v1
INFO     apache_beam.utils.subprocess_server:subprocess_server.py:126 	beam:schematransform:org.apache.beam:bigquery_storage_write:v1
INFO     apache_beam.utils.subprocess_server:subprocess_server.py:126 	beam:schematransform:org.apache.beam:pubsub_read:v1
INFO     apache_beam.utils.subprocess_server:subprocess_server.py:126 	beam:schematransform:org.apache.beam:pubsub_write:v1
INFO     apache_beam.utils.subprocess_server:subprocess_server.py:126 	beam:schematransform:org.apache.beam:pubsublite_write:v1
INFO     apache_beam.utils.subprocess_server:subprocess_server.py:126 	beam:schematransform:org.apache.beam:spanner_write:v1
INFO     apache_beam.utils.subprocess_server:subprocess_server.py:126 	beam:schematransform:org.apache.beam:pubsublite_read:v1
INFO     apache_beam.utils.subprocess_server:subprocess_server.py:126 	beam:schematransform:org.apache.beam:bigquery_storage_read:v1
INFO     apache_beam.utils.subprocess_server:subprocess_server.py:126 Feb 03, 2023 6:18:50 AM org.apache.beam.sdk.expansion.service.ExpansionService expand
INFO     apache_beam.utils.subprocess_server:subprocess_server.py:126 INFO: Expanding 'SqlTransform(beam:external:java:sql:v1)' with URN 'beam:external:java:sql:v1'
INFO     apache_beam.utils.subprocess_server:subprocess_server.py:126 Feb 03, 2023 6:18:50 AM org.apache.beam.sdk.expansion.service.ExpansionService$ExternalTransformRegistrarLoader payloadToConfig
INFO     apache_beam.utils.subprocess_server:subprocess_server.py:126 WARNING: Configuration class 'org.apache.beam.sdk.extensions.sql.expansion.ExternalSqlTransformRegistrar$Configuration' has no schema registered. Attempting to construct with setter approach.
INFO     apache_beam.utils.subprocess_server:subprocess_server.py:126 Feb 03, 2023 6:18:51 AM org.apache.beam.sdk.expansion.service.ExpansionService$ExternalTransformRegistrarLoader payloadToConfig
INFO     apache_beam.utils.subprocess_server:subprocess_server.py:126 WARNING: Configuration class 'org.apache.beam.sdk.extensions.sql.expansion.ExternalSqlTransformRegistrar$Configuration' has no schema registered. Attempting to construct with setter approach.
INFO     apache_beam.utils.subprocess_server:subprocess_server.py:126 Feb 03, 2023 6:18:52 AM org.apache.beam.sdk.extensions.sql.impl.CalciteQueryPlanner convertToBeamRel
INFO     apache_beam.utils.subprocess_server:subprocess_server.py:126 INFO: SQL:
INFO     apache_beam.utils.subprocess_server:subprocess_server.py:126 SELECT `simple`.`id` AS `id`, `enrich`.`metadata` AS `metadata`
INFO     apache_beam.utils.subprocess_server:subprocess_server.py:126 FROM `beam`.`simple` AS `simple`
INFO     apache_beam.utils.subprocess_server:subprocess_server.py:126 INNER JOIN `beam`.`enrich` AS `enrich` ON `simple`.`id` = `enrich`.`id`
INFO     apache_beam.utils.subprocess_server:subprocess_server.py:126 Feb 03, 2023 6:18:53 AM org.apache.beam.sdk.extensions.sql.impl.CalciteQueryPlanner convertToBeamRel
INFO     apache_beam.utils.subprocess_server:subprocess_server.py:126 INFO: SQLPlan>
INFO     apache_beam.utils.subprocess_server:subprocess_server.py:126 LogicalProject(id=[$0], metadata=[$4])
INFO     apache_beam.utils.subprocess_server:subprocess_server.py:126   LogicalJoin(condition=[=($0, $3)], joinType=[inner])
INFO     apache_beam.utils.subprocess_server:subprocess_server.py:126     BeamIOSourceRel(table=[[beam, simple]])
INFO     apache_beam.utils.subprocess_server:subprocess_server.py:126     BeamIOSourceRel(table=[[beam, enrich]])
INFO     apache_beam.utils.subprocess_server:subprocess_server.py:126 
INFO     apache_beam.utils.subprocess_server:subprocess_server.py:126 Feb 03, 2023 6:18:53 AM org.apache.beam.sdk.extensions.sql.impl.CalciteQueryPlanner convertToBeamRel
INFO     apache_beam.utils.subprocess_server:subprocess_server.py:126 INFO: BEAMPlan>
INFO     apache_beam.utils.subprocess_server:subprocess_server.py:126 BeamCalcRel(expr#0..4=[{inputs}], id=[$t0], metadata=[$t4])
INFO     apache_beam.utils.subprocess_server:subprocess_server.py:126   BeamCoGBKJoinRel(condition=[=($0, $3)], joinType=[inner])
INFO     apache_beam.utils.subprocess_server:subprocess_server.py:126     BeamIOSourceRel(table=[[beam, simple]])
INFO     apache_beam.utils.subprocess_server:subprocess_server.py:126     BeamIOSourceRel(table=[[beam, enrich]])
INFO     apache_beam.utils.subprocess_server:subprocess_server.py:126 
INFO     root:environments.py:376 Default Python SDK image for environment is apache/beam_python3.7_sdk:2.46.0.dev
INFO     root:environments.py:299 No image given, using default Python SDK image
INFO     root:environments.py:376 Default Python SDK image for environment is apache/beam_python3.7_sdk:2.46.0.dev
INFO     root:environments.py:304 Python SDK container image set to "apache/beam_python3.7_sdk:2.46.0.dev" for Docker environment
INFO     apache_beam.runners.portability.fn_api_runner.translations:translations.py:710 ==================== <function pack_combiners at 0x7fd229b3ff80> ====================
INFO     apache_beam.runners.portability.fn_api_runner.translations:translations.py:710 ==================== <function lift_combiners at 0x7fd229b40050> ====================
INFO     apache_beam.runners.portability.fn_api_runner.translations:translations.py:710 ==================== <function sort_stages at 0x7fd229b407a0> ====================
INFO     apache_beam.runners.portability.portable_runner:portable_runner.py:583 Job state changed to STOPPED
INFO     apache_beam.runners.portability.portable_runner:portable_runner.py:583 Job state changed to STARTING
INFO     apache_beam.runners.portability.portable_runner:portable_runner.py:583 Job state changed to RUNNING
INFO     apache_beam.runners.portability.portable_runner:portable_runner.py:583 Job state changed to DONE
PASSED                                                                   [ 77%]
apache_beam/transforms/sql_test.py::SqlTransformTest::test_windowing_before_sql 
-------------------------------- live log call ---------------------------------
INFO     apache_beam.utils.subprocess_server:subprocess_server.py:239 Using pre-built snapshot at <https://ci-beam.apache.org/job/beam_PostCommit_XVR_Samza/ws/src/sdks/java/extensions/sql/expansion-service/build/libs/beam-sdks-java-extensions-sql-expansion-service-2.46.0-SNAPSHOT.jar>
INFO     root:external.py:854 Starting a JAR-based expansion service from JAR <https://ci-beam.apache.org/job/beam_PostCommit_XVR_Samza/ws/src/sdks/java/extensions/sql/expansion-service/build/libs/beam-sdks-java-extensions-sql-expansion-service-2.46.0-SNAPSHOT.jar> 
INFO     apache_beam.utils.subprocess_server:subprocess_server.py:116 Starting service with ['java' '-jar' '<https://ci-beam.apache.org/job/beam_PostCommit_XVR_Samza/ws/src/sdks/java/extensions/sql/expansion-service/build/libs/beam-sdks-java-extensions-sql-expansion-service-2.46.0-SNAPSHOT.jar'> '59627' '--filesToStage=<https://ci-beam.apache.org/job/beam_PostCommit_XVR_Samza/ws/src/sdks/java/extensions/sql/expansion-service/build/libs/beam-sdks-java-extensions-sql-expansion-service-2.46.0-SNAPSHOT.jar']>
INFO     apache_beam.utils.subprocess_server:subprocess_server.py:126 Starting expansion service at localhost:59627
INFO     apache_beam.utils.subprocess_server:subprocess_server.py:126 Feb 03, 2023 6:19:30 AM org.apache.beam.sdk.expansion.service.ExpansionService loadRegisteredTransforms
INFO     apache_beam.utils.subprocess_server:subprocess_server.py:126 INFO: Registering external transforms: [beam:external:java:sql:v1, beam:transform:org.apache.beam:pubsub_read:v1, beam:transform:org.apache.beam:pubsub_write:v1, beam:transform:org.apache.beam:pubsublite_write:v1, beam:transform:org.apache.beam:pubsublite_read:v1, beam:transform:org.apache.beam:spanner_insert:v1, beam:transform:org.apache.beam:spanner_update:v1, beam:transform:org.apache.beam:spanner_replace:v1, beam:transform:org.apache.beam:spanner_insert_or_update:v1, beam:transform:org.apache.beam:spanner_delete:v1, beam:transform:org.apache.beam:spanner_read:v1, beam:transform:org.apache.beam:kafka_read_with_metadata:v1, beam:transform:org.apache.beam:kafka_read_without_metadata:v1, beam:transform:org.apache.beam:kafka_write:v1, beam:external:java:generate_sequence:v1]
INFO     apache_beam.utils.subprocess_server:subprocess_server.py:126 
INFO     apache_beam.utils.subprocess_server:subprocess_server.py:126 Registered transforms:
INFO     apache_beam.utils.subprocess_server:subprocess_server.py:126 	beam:external:java:sql:v1: org.apache.beam.sdk.expansion.service.ExpansionService$ExternalTransformRegistrarLoader$1@38425407
INFO     apache_beam.utils.subprocess_server:subprocess_server.py:126 	beam:transform:org.apache.beam:pubsub_read:v1: org.apache.beam.sdk.expansion.service.ExpansionService$ExternalTransformRegistrarLoader$1@43bc63a3
INFO     apache_beam.utils.subprocess_server:subprocess_server.py:126 	beam:transform:org.apache.beam:pubsub_write:v1: org.apache.beam.sdk.expansion.service.ExpansionService$ExternalTransformRegistrarLoader$1@702657cc
INFO     apache_beam.utils.subprocess_server:subprocess_server.py:126 	beam:transform:org.apache.beam:pubsublite_write:v1: org.apache.beam.sdk.expansion.service.ExpansionService$ExternalTransformRegistrarLoader$1@6a6cb05c
INFO     apache_beam.utils.subprocess_server:subprocess_server.py:126 	beam:transform:org.apache.beam:pubsublite_read:v1: org.apache.beam.sdk.expansion.service.ExpansionService$ExternalTransformRegistrarLoader$1@40a4337a
INFO     apache_beam.utils.subprocess_server:subprocess_server.py:126 	beam:transform:org.apache.beam:spanner_insert:v1: org.apache.beam.sdk.expansion.service.ExpansionService$ExternalTransformRegistrarLoader$1@6025e1b6
INFO     apache_beam.utils.subprocess_server:subprocess_server.py:126 	beam:transform:org.apache.beam:spanner_update:v1: org.apache.beam.sdk.expansion.service.ExpansionService$ExternalTransformRegistrarLoader$1@22ff4249
INFO     apache_beam.utils.subprocess_server:subprocess_server.py:126 	beam:transform:org.apache.beam:spanner_replace:v1: org.apache.beam.sdk.expansion.service.ExpansionService$ExternalTransformRegistrarLoader$1@2d1ef81a
INFO     apache_beam.utils.subprocess_server:subprocess_server.py:126 	beam:transform:org.apache.beam:spanner_insert_or_update:v1: org.apache.beam.sdk.expansion.service.ExpansionService$ExternalTransformRegistrarLoader$1@4c402120
INFO     apache_beam.utils.subprocess_server:subprocess_server.py:126 	beam:transform:org.apache.beam:spanner_delete:v1: org.apache.beam.sdk.expansion.service.ExpansionService$ExternalTransformRegistrarLoader$1@327514f
INFO     apache_beam.utils.subprocess_server:subprocess_server.py:126 	beam:transform:org.apache.beam:spanner_read:v1: org.apache.beam.sdk.expansion.service.ExpansionService$ExternalTransformRegistrarLoader$1@5b12b668
INFO     apache_beam.utils.subprocess_server:subprocess_server.py:126 	beam:transform:org.apache.beam:kafka_read_with_metadata:v1: org.apache.beam.sdk.expansion.service.ExpansionService$ExternalTransformRegistrarLoader$1@1165b38
INFO     apache_beam.utils.subprocess_server:subprocess_server.py:126 	beam:transform:org.apache.beam:kafka_read_without_metadata:v1: org.apache.beam.sdk.expansion.service.ExpansionService$ExternalTransformRegistrarLoader$1@4c12331b
INFO     apache_beam.utils.subprocess_server:subprocess_server.py:126 	beam:transform:org.apache.beam:kafka_write:v1: org.apache.beam.sdk.expansion.service.ExpansionService$ExternalTransformRegistrarLoader$1@7586beff
INFO     apache_beam.utils.subprocess_server:subprocess_server.py:126 	beam:external:java:generate_sequence:v1: org.apache.beam.sdk.expansion.service.ExpansionService$ExternalTransformRegistrarLoader$1@3b69e7d1
INFO     apache_beam.utils.subprocess_server:subprocess_server.py:126 
INFO     apache_beam.utils.subprocess_server:subprocess_server.py:126 Registered SchemaTransformProviders:
INFO     apache_beam.utils.subprocess_server:subprocess_server.py:126 	beam:schematransform:org.apache.beam:kafka_read:v1
INFO     apache_beam.utils.subprocess_server:subprocess_server.py:126 	beam:schematransform:org.apache.beam:kafka_write:v1
INFO     apache_beam.utils.subprocess_server:subprocess_server.py:126 	beam:schematransform:org.apache.beam:bigquery_storage_write:v1
INFO     apache_beam.utils.subprocess_server:subprocess_server.py:126 	beam:schematransform:org.apache.beam:pubsub_read:v1
INFO     apache_beam.utils.subprocess_server:subprocess_server.py:126 	beam:schematransform:org.apache.beam:pubsub_write:v1
INFO     apache_beam.utils.subprocess_server:subprocess_server.py:126 	beam:schematransform:org.apache.beam:pubsublite_write:v1
INFO     apache_beam.utils.subprocess_server:subprocess_server.py:126 	beam:schematransform:org.apache.beam:spanner_write:v1
INFO     apache_beam.utils.subprocess_server:subprocess_server.py:126 	beam:schematransform:org.apache.beam:pubsublite_read:v1
INFO     apache_beam.utils.subprocess_server:subprocess_server.py:126 	beam:schematransform:org.apache.beam:bigquery_storage_read:v1
INFO     apache_beam.utils.subprocess_server:subprocess_server.py:126 Feb 03, 2023 6:19:31 AM org.apache.beam.sdk.expansion.service.ExpansionService expand
INFO     apache_beam.utils.subprocess_server:subprocess_server.py:126 INFO: Expanding 'SqlTransform(beam:external:java:sql:v1)' with URN 'beam:external:java:sql:v1'
INFO     apache_beam.utils.subprocess_server:subprocess_server.py:126 Feb 03, 2023 6:19:31 AM org.apache.beam.sdk.expansion.service.ExpansionService$ExternalTransformRegistrarLoader payloadToConfig
INFO     apache_beam.utils.subprocess_server:subprocess_server.py:126 WARNING: Configuration class 'org.apache.beam.sdk.extensions.sql.expansion.ExternalSqlTransformRegistrar$Configuration' has no schema registered. Attempting to construct with setter approach.
INFO     apache_beam.utils.subprocess_server:subprocess_server.py:126 Feb 03, 2023 6:19:31 AM org.apache.beam.sdk.expansion.service.ExpansionService$ExternalTransformRegistrarLoader payloadToConfig
INFO     apache_beam.utils.subprocess_server:subprocess_server.py:126 WARNING: Configuration class 'org.apache.beam.sdk.extensions.sql.expansion.ExternalSqlTransformRegistrar$Configuration' has no schema registered. Attempting to construct with setter approach.
INFO     apache_beam.utils.subprocess_server:subprocess_server.py:126 Feb 03, 2023 6:19:33 AM org.apache.beam.sdk.extensions.sql.impl.CalciteQueryPlanner convertToBeamRel
INFO     apache_beam.utils.subprocess_server:subprocess_server.py:126 INFO: SQL:
INFO     apache_beam.utils.subprocess_server:subprocess_server.py:126 SELECT COUNT(*) AS `count`
INFO     apache_beam.utils.subprocess_server:subprocess_server.py:126 FROM `beam`.`PCOLLECTION` AS `PCOLLECTION`
INFO     apache_beam.utils.subprocess_server:subprocess_server.py:126 Feb 03, 2023 6:19:33 AM org.apache.beam.sdk.extensions.sql.impl.CalciteQueryPlanner convertToBeamRel
INFO     apache_beam.utils.subprocess_server:subprocess_server.py:126 INFO: SQLPlan>
INFO     apache_beam.utils.subprocess_server:subprocess_server.py:126 LogicalAggregate(group=[{}], count=[COUNT()])
INFO     apache_beam.utils.subprocess_server:subprocess_server.py:126   BeamIOSourceRel(table=[[beam, PCOLLECTION]])
INFO     apache_beam.utils.subprocess_server:subprocess_server.py:126 
INFO     apache_beam.utils.subprocess_server:subprocess_server.py:126 Feb 03, 2023 6:19:33 AM org.apache.beam.sdk.extensions.sql.impl.CalciteQueryPlanner convertToBeamRel
INFO     apache_beam.utils.subprocess_server:subprocess_server.py:126 INFO: BEAMPlan>
INFO     apache_beam.utils.subprocess_server:subprocess_server.py:126 BeamAggregationRel(group=[{}], count=[COUNT()])
INFO     apache_beam.utils.subprocess_server:subprocess_server.py:126   BeamIOSourceRel(table=[[beam, PCOLLECTION]])
INFO     apache_beam.utils.subprocess_server:subprocess_server.py:126 
INFO     root:environments.py:376 Default Python SDK image for environment is apache/beam_python3.7_sdk:2.46.0.dev
INFO     root:environments.py:299 No image given, using default Python SDK image
INFO     root:environments.py:376 Default Python SDK image for environment is apache/beam_python3.7_sdk:2.46.0.dev
INFO     root:environments.py:304 Python SDK container image set to "apache/beam_python3.7_sdk:2.46.0.dev" for Docker environment
INFO     apache_beam.runners.portability.fn_api_runner.translations:translations.py:710 ==================== <function pack_combiners at 0x7fd229b3ff80> ====================
INFO     apache_beam.runners.portability.fn_api_runner.translations:translations.py:710 ==================== <function lift_combiners at 0x7fd229b40050> ====================
INFO     apache_beam.runners.portability.fn_api_runner.translations:translations.py:710 ==================== <function sort_stages at 0x7fd229b407a0> ====================
INFO     apache_beam.runners.portability.portable_runner:portable_runner.py:583 Job state changed to STOPPED
INFO     apache_beam.runners.portability.portable_runner:portable_runner.py:583 Job state changed to STARTING
INFO     apache_beam.runners.portability.portable_runner:portable_runner.py:583 Job state changed to RUNNING
INFO     apache_beam.runners.portability.portable_runner:portable_runner.py:583 Job state changed to DONE
PASSED                                                                   [ 88%]
apache_beam/transforms/sql_test.py::SqlTransformTest::test_zetasql_generate_data 
-------------------------------- live log call ---------------------------------
INFO     apache_beam.utils.subprocess_server:subprocess_server.py:239 Using pre-built snapshot at <https://ci-beam.apache.org/job/beam_PostCommit_XVR_Samza/ws/src/sdks/java/extensions/sql/expansion-service/build/libs/beam-sdks-java-extensions-sql-expansion-service-2.46.0-SNAPSHOT.jar>
INFO     root:external.py:854 Starting a JAR-based expansion service from JAR <https://ci-beam.apache.org/job/beam_PostCommit_XVR_Samza/ws/src/sdks/java/extensions/sql/expansion-service/build/libs/beam-sdks-java-extensions-sql-expansion-service-2.46.0-SNAPSHOT.jar> 
INFO     apache_beam.utils.subprocess_server:subprocess_server.py:116 Starting service with ['java' '-jar' '<https://ci-beam.apache.org/job/beam_PostCommit_XVR_Samza/ws/src/sdks/java/extensions/sql/expansion-service/build/libs/beam-sdks-java-extensions-sql-expansion-service-2.46.0-SNAPSHOT.jar'> '41081' '--filesToStage=<https://ci-beam.apache.org/job/beam_PostCommit_XVR_Samza/ws/src/sdks/java/extensions/sql/expansion-service/build/libs/beam-sdks-java-extensions-sql-expansion-service-2.46.0-SNAPSHOT.jar']>
INFO     apache_beam.utils.subprocess_server:subprocess_server.py:126 Starting expansion service at localhost:41081
INFO     apache_beam.utils.subprocess_server:subprocess_server.py:126 Feb 03, 2023 6:19:56 AM org.apache.beam.sdk.expansion.service.ExpansionService loadRegisteredTransforms
INFO     apache_beam.utils.subprocess_server:subprocess_server.py:126 INFO: Registering external transforms: [beam:external:java:sql:v1, beam:transform:org.apache.beam:pubsub_read:v1, beam:transform:org.apache.beam:pubsub_write:v1, beam:transform:org.apache.beam:pubsublite_write:v1, beam:transform:org.apache.beam:pubsublite_read:v1, beam:transform:org.apache.beam:spanner_insert:v1, beam:transform:org.apache.beam:spanner_update:v1, beam:transform:org.apache.beam:spanner_replace:v1, beam:transform:org.apache.beam:spanner_insert_or_update:v1, beam:transform:org.apache.beam:spanner_delete:v1, beam:transform:org.apache.beam:spanner_read:v1, beam:transform:org.apache.beam:kafka_read_with_metadata:v1, beam:transform:org.apache.beam:kafka_read_without_metadata:v1, beam:transform:org.apache.beam:kafka_write:v1, beam:external:java:generate_sequence:v1]
INFO     apache_beam.utils.subprocess_server:subprocess_server.py:126 
INFO     apache_beam.utils.subprocess_server:subprocess_server.py:126 Registered transforms:
INFO     apache_beam.utils.subprocess_server:subprocess_server.py:126 	beam:external:java:sql:v1: org.apache.beam.sdk.expansion.service.ExpansionService$ExternalTransformRegistrarLoader$1@38425407
INFO     apache_beam.utils.subprocess_server:subprocess_server.py:126 	beam:transform:org.apache.beam:pubsub_read:v1: org.apache.beam.sdk.expansion.service.ExpansionService$ExternalTransformRegistrarLoader$1@43bc63a3
INFO     apache_beam.utils.subprocess_server:subprocess_server.py:126 	beam:transform:org.apache.beam:pubsub_write:v1: org.apache.beam.sdk.expansion.service.ExpansionService$ExternalTransformRegistrarLoader$1@702657cc
INFO     apache_beam.utils.subprocess_server:subprocess_server.py:126 	beam:transform:org.apache.beam:pubsublite_write:v1: org.apache.beam.sdk.expansion.service.ExpansionService$ExternalTransformRegistrarLoader$1@6a6cb05c
INFO     apache_beam.utils.subprocess_server:subprocess_server.py:126 	beam:transform:org.apache.beam:pubsublite_read:v1: org.apache.beam.sdk.expansion.service.ExpansionService$ExternalTransformRegistrarLoader$1@40a4337a
INFO     apache_beam.utils.subprocess_server:subprocess_server.py:126 	beam:transform:org.apache.beam:spanner_insert:v1: org.apache.beam.sdk.expansion.service.ExpansionService$ExternalTransformRegistrarLoader$1@6025e1b6
INFO     apache_beam.utils.subprocess_server:subprocess_server.py:126 	beam:transform:org.apache.beam:spanner_update:v1: org.apache.beam.sdk.expansion.service.ExpansionService$ExternalTransformRegistrarLoader$1@22ff4249
INFO     apache_beam.utils.subprocess_server:subprocess_server.py:126 	beam:transform:org.apache.beam:spanner_replace:v1: org.apache.beam.sdk.expansion.service.ExpansionService$ExternalTransformRegistrarLoader$1@2d1ef81a
INFO     apache_beam.utils.subprocess_server:subprocess_server.py:126 	beam:transform:org.apache.beam:spanner_insert_or_update:v1: org.apache.beam.sdk.expansion.service.ExpansionService$ExternalTransformRegistrarLoader$1@4c402120
INFO     apache_beam.utils.subprocess_server:subprocess_server.py:126 	beam:transform:org.apache.beam:spanner_delete:v1: org.apache.beam.sdk.expansion.service.ExpansionService$ExternalTransformRegistrarLoader$1@327514f
INFO     apache_beam.utils.subprocess_server:subprocess_server.py:126 	beam:transform:org.apache.beam:spanner_read:v1: org.apache.beam.sdk.expansion.service.ExpansionService$ExternalTransformRegistrarLoader$1@5b12b668
INFO     apache_beam.utils.subprocess_server:subprocess_server.py:126 	beam:transform:org.apache.beam:kafka_read_with_metadata:v1: org.apache.beam.sdk.expansion.service.ExpansionService$ExternalTransformRegistrarLoader$1@1165b38
INFO     apache_beam.utils.subprocess_server:subprocess_server.py:126 	beam:transform:org.apache.beam:kafka_read_without_metadata:v1: org.apache.beam.sdk.expansion.service.ExpansionService$ExternalTransformRegistrarLoader$1@4c12331b
INFO     apache_beam.utils.subprocess_server:subprocess_server.py:126 	beam:transform:org.apache.beam:kafka_write:v1: org.apache.beam.sdk.expansion.service.ExpansionService$ExternalTransformRegistrarLoader$1@7586beff
INFO     apache_beam.utils.subprocess_server:subprocess_server.py:126 	beam:external:java:generate_sequence:v1: org.apache.beam.sdk.expansion.service.ExpansionService$ExternalTransformRegistrarLoader$1@3b69e7d1
INFO     apache_beam.utils.subprocess_server:subprocess_server.py:126 
INFO     apache_beam.utils.subprocess_server:subprocess_server.py:126 Registered SchemaTransformProviders:
INFO     apache_beam.utils.subprocess_server:subprocess_server.py:126 	beam:schematransform:org.apache.beam:kafka_read:v1
INFO     apache_beam.utils.subprocess_server:subprocess_server.py:126 	beam:schematransform:org.apache.beam:kafka_write:v1
INFO     apache_beam.utils.subprocess_server:subprocess_server.py:126 	beam:schematransform:org.apache.beam:bigquery_storage_write:v1
INFO     apache_beam.utils.subprocess_server:subprocess_server.py:126 	beam:schematransform:org.apache.beam:pubsub_read:v1
INFO     apache_beam.utils.subprocess_server:subprocess_server.py:126 	beam:schematransform:org.apache.beam:pubsub_write:v1
INFO     apache_beam.utils.subprocess_server:subprocess_server.py:126 	beam:schematransform:org.apache.beam:pubsublite_write:v1
INFO     apache_beam.utils.subprocess_server:subprocess_server.py:126 	beam:schematransform:org.apache.beam:spanner_write:v1
INFO     apache_beam.utils.subprocess_server:subprocess_server.py:126 	beam:schematransform:org.apache.beam:pubsublite_read:v1
INFO     apache_beam.utils.subprocess_server:subprocess_server.py:126 	beam:schematransform:org.apache.beam:bigquery_storage_read:v1
INFO     apache_beam.utils.subprocess_server:subprocess_server.py:126 Feb 03, 2023 6:19:57 AM org.apache.beam.sdk.expansion.service.ExpansionService expand
INFO     apache_beam.utils.subprocess_server:subprocess_server.py:126 INFO: Expanding 'SqlTransform(beam:external:java:sql:v1)' with URN 'beam:external:java:sql:v1'
INFO     apache_beam.utils.subprocess_server:subprocess_server.py:126 Feb 03, 2023 6:19:57 AM org.apache.beam.sdk.expansion.service.ExpansionService$ExternalTransformRegistrarLoader payloadToConfig
INFO     apache_beam.utils.subprocess_server:subprocess_server.py:126 WARNING: Configuration class 'org.apache.beam.sdk.extensions.sql.expansion.ExternalSqlTransformRegistrar$Configuration' has no schema registered. Attempting to construct with setter approach.
INFO     apache_beam.utils.subprocess_server:subprocess_server.py:126 Feb 03, 2023 6:19:58 AM org.apache.beam.sdk.expansion.service.ExpansionService$ExternalTransformRegistrarLoader payloadToConfig
INFO     apache_beam.utils.subprocess_server:subprocess_server.py:126 WARNING: Configuration class 'org.apache.beam.sdk.extensions.sql.expansion.ExternalSqlTransformRegistrar$Configuration' has no schema registered. Attempting to construct with setter approach.
INFO     apache_beam.utils.subprocess_server:subprocess_server.py:126 Feb 03, 2023 6:20:00 AM com.google.zetasql.io.grpc.NameResolverRegistry getDefaultRegistry
INFO     apache_beam.utils.subprocess_server:subprocess_server.py:126 WARNING: No NameResolverProviders found via ServiceLoader, including for DNS. This is probably due to a broken build. If using ProGuard, check your configuration
INFO     apache_beam.utils.subprocess_server:subprocess_server.py:126 Feb 03, 2023 6:20:01 AM org.apache.beam.sdk.extensions.sql.zetasql.ZetaSQLQueryPlanner convertToBeamRelInternal
INFO     apache_beam.utils.subprocess_server:subprocess_server.py:126 INFO: BEAMPlan>
INFO     apache_beam.utils.subprocess_server:subprocess_server.py:126 BeamZetaSqlCalcRel(expr#0=[{inputs}], expr#1=[1:BIGINT], expr#2=['foo':VARCHAR], expr#3=[3.1400000000000001243E0:DOUBLE], int=[$t1], str=[$t2], flt=[$t3])
INFO     apache_beam.utils.subprocess_server:subprocess_server.py:126   BeamValuesRel(tuples=[[{ 0 }]])
INFO     apache_beam.utils.subprocess_server:subprocess_server.py:126 
INFO     root:environments.py:376 Default Python SDK image for environment is apache/beam_python3.7_sdk:2.46.0.dev
INFO     root:environments.py:299 No image given, using default Python SDK image
INFO     root:environments.py:376 Default Python SDK image for environment is apache/beam_python3.7_sdk:2.46.0.dev
INFO     root:environments.py:304 Python SDK container image set to "apache/beam_python3.7_sdk:2.46.0.dev" for Docker environment
INFO     apache_beam.runners.portability.fn_api_runner.translations:translations.py:710 ==================== <function pack_combiners at 0x7fd229b3ff80> ====================
INFO     apache_beam.runners.portability.fn_api_runner.translations:translations.py:710 ==================== <function lift_combiners at 0x7fd229b40050> ====================
INFO     apache_beam.runners.portability.fn_api_runner.translations:translations.py:710 ==================== <function sort_stages at 0x7fd229b407a0> ====================
INFO     apache_beam.runners.portability.portable_runner:portable_runner.py:583 Job state changed to STOPPED
INFO     apache_beam.runners.portability.portable_runner:portable_runner.py:583 Job state changed to STARTING
INFO     apache_beam.runners.portability.portable_runner:portable_runner.py:583 Job state changed to RUNNING
INFO     apache_beam.runners.portability.portable_runner:portable_runner.py:583 Job state changed to DONE
PASSED                                                                   [100%]

=============================== warnings summary ===============================
../../build/gradleenv/1922375555/lib/python3.7/site-packages/hdfs/config.py:15
  <https://ci-beam.apache.org/job/beam_PostCommit_XVR_Samza/ws/src/build/gradleenv/1922375555/lib/python3.7/site-packages/hdfs/config.py>:15: DeprecationWarning: the imp module is deprecated in favour of importlib; see the module's documentation for alternative uses
    from imp import load_source

-- Docs: https://docs.pytest.org/en/stable/how-to/capture-warnings.html
- generated xml file: <https://ci-beam.apache.org/job/beam_PostCommit_XVR_Samza/ws/src/sdks/python/pytest_xlangSqlValidateRunner.xml> -
===== 9 passed, 6 skipped, 6808 deselected, 1 warning in 311.14s (0:05:11) =====

> Task :runners:samza:job-server:samzaJobServerCleanup
Stopping job server pid: 2304917.

> Task :runners:samza:job-server:validatesCrossLanguageRunnerCleanup
Stopping expansion service pid: 2314091.
Stopping expansion service pid: 2314092.

FAILURE: Build failed with an exception.

* Where:
Build file '<https://ci-beam.apache.org/job/beam_PostCommit_XVR_Samza/ws/src/sdks/go/test/build.gradle'> line: 193

* What went wrong:
Execution failed for task ':runners:samza:job-server:validatesCrossLanguageRunnerGoUsingJava'.
> Process 'command 'sh'' finished with non-zero exit value 1

* Try:
> Run with --stacktrace option to get the stack trace.
> Run with --info or --debug option to get more log output.

* Get more help at https://help.gradle.org

Deprecated Gradle features were used in this build, making it incompatible with Gradle 8.0.

You can use '--warning-mode all' to show the individual deprecation warnings and determine if they come from your own scripts or plugins.

See https://docs.gradle.org/7.5.1/userguide/command_line_interface.html#sec:command_line_warnings

Execution optimizations have been disabled for 1 invalid unit(s) of work during this build to ensure correctness.
Please consult deprecation warnings for more details.

BUILD FAILED in 38m 16s
261 actionable tasks: 172 executed, 77 from cache, 12 up-to-date

Publishing build scan...
https://gradle.com/s/ptvwmae574x7w

Build step 'Invoke Gradle script' changed build result to FAILURE
Build step 'Invoke Gradle script' marked build as failure

---------------------------------------------------------------------
To unsubscribe, e-mail: builds-unsubscribe@beam.apache.org
For additional commands, e-mail: builds-help@beam.apache.org


Build failed in Jenkins: beam_PostCommit_XVR_Samza #2233

Posted by Apache Jenkins Server <je...@builds.apache.org>.
See <https://ci-beam.apache.org/job/beam_PostCommit_XVR_Samza/2233/display/redirect?page=changes>

Changes:

[noreply] Move changes to correct release in CHANGES.md (#25288)

[noreply] Pass instead of raising an error (#25287)

[noreply] [WebSite] Add new Python quickstart (#24804)


------------------------------------------
[...truncated 1.41 MB...]
        urn: "beam:coder:kv:v1"
      >
      component_coder_ids: "zguPhmehoZVarIntCoder"
      component_coder_ids: "zguPhmehoZIterableCoder"
    >
  >
  coders: <
    key: "zguPhmehoZNullableCoder"
    value: <
      spec: <
        urn: "beam:coder:nullable:v1"
      >
      component_coder_ids: "zguPhmehoZByteArrayCoder"
    >
  >
  coders: <
    key: "zguPhmehoZSerializableCoder"
    value: <
      spec: <
        urn: "beam:coders:javasdk:0.1"
        payload: "\202SNAPPY\000\000\000\000\001\000\000\000\001\000\000\000\312\214\002\360^\254\355\000\005sr\000,org.apache.beam.sdk.coders.SerializableCoder\010\364 \216\305ynl\002\000\001L\000\004typet\000\021Ljava/lang/Class;xr\000&ofV\000\024Custom\005P8j\260\010\235\013;\035\013\002\000\000xr\000 j\213\000\005/\034C\335\325\211\256\274~\370\001/\020pvr\000;N1\000Pio.BoundedReadFromUnb\t\021`Source$Shardd\236\240U\205\000j\363\002\000\000xp"
      >
    >
  >
  coders: <
    key: "zguPhmehoZSnappyCoder"
    value: <
      spec: <
        urn: "beam:coders:javasdk:0.1"
        payload: "\202SNAPPY\000\000\000\000\001\000\000\000\001\000\000\001.\307\003\360@\254\355\000\005sr\000&org.apache.beam.sdk.coders.SnappyCoder1\033\243\356\177\362\366,\002\000\001L\000\ninner\005\030 t\000\"Lorg/a\005B\000/\001B\020/sdk/\tB\000/\005$\020;xr\000*ng\000 tructured\005/8s\277\022\016\325\3246\021\002\000\000xr\000 j9\000\005/\034C\335\325\211\256\274~\370\001/\020psr\000,j1\000,Serializable\005= \010\364 \216\305ynl\002\001\327\\\004typet\000\021Ljava/lang/Class\001\300n'\001\024Custom\005PPj\260\010\235\013;\035\013\002\000\000xq\000~\000\003vr\000$N\221\000\\io.BoundedSource!`v\023\177\370QA\0019\010r\000\035Z3\000\t,0\020\213\372\020Y\214\347\323\002\000\000xp"
      >
    >
  >
  coders: <
    key: "zguPhmehoZTimestampedValueCoder"
    value: <
      spec: <
        urn: "beam:coders:javasdk:0.1"
        payload: "\202SNAPPY\000\000\000\000\001\000\000\000\001\000\000\001?\315\003\270\254\355\000\005sr\000Aorg.apache.beam.sdk.values.TimestampedV\001\022\000$>\021\000LCoder\364\376\202p\274iX-\002\000\001L\000\nv\001)\005\030\034t\000\"Lorg/\t]\000/\001],/sdk/coders/\005$\020;xr\000*N\202\000\t%(.Structured\005/8s\277\022\016\325\3246\021\002\000\000xr\000 j9\000\005/\034C\335\325\211\256\274~\370\001/\020psr\000,j1\000(Serializabl\t\277\034\010\364 \216\305ynl\005\327\\\004typet\000\021Ljava/lang/Class\001\300\000&jV\000\024Custom\005\215Pj\260\010\235\013;\035\013\002\000\000xq\000~\000\003vr\000;N;\000Pio.BoundedReadFromUnb\t\021`Source$Shardd\236\240U\205\000j\363\002\000\000xp"
      >
    >
  >
  coders: <
    key: "zguPhmehoZValueWithRecordIdCoder"
    value: <
      spec: <
        urn: "beam:coders:javasdk:0.1"
        payload: "\202SNAPPY\000\000\000\000\001\000\000\000\001\000\000\001\213\311\005\320\254\355\000\005sr\000Corg.apache.beam.sdk.values.ValueWithRecordId$B\022\000LCoder{\343\376bQ\014\204>\002\000\002L\000\007i\t\025\034t\000+Lorg/\t\\\000/\001\\\024/sdk/c\0012(s/ByteArray\005B\014;L\000\n\005u\005\016\010t\000\"n;\000\005$\020;xr\000*N\274\000\t`(.Structured\005/8s\277\022\016\325\3246\021\002\000\000xr\000 j9\000\005/\034C\335\325\211\256\274~\370\001/\020psr\000)j1\0006\312\000\034\351\277\005|\263\3746\333\001:\010r\000&j8\000\024Atomic\005o\034\307\354\265\314\205tPF\0015 q\000~\000\003sr\000-N;\000$io.kafka.K\001\006\000R%\227\005B<I\320\251Y\032\341{#\002\000\001L\000\007kv\005\025\010t\000$nH\001\000K\t&\000;\025s\000\"Ns\000-P\r- j\000\275\271\035\243\3126\002!\353\010\010ke)\277\001\264\000\0022\303\001\005\022\025Y\000(jY\000\030Nullabl)\372\034E\333\0336>\220\247\007\005\307]\022.O\000\001\014,\006sq\000~\000\016q\000~\000\020"
      >
    >
  >
  coders: <
    key: "zguPhmehoZVarIntCoder"
    value: <
      spec: <
        urn: "beam:coders:javasdk:0.1"
        payload: "\202SNAPPY\000\000\000\000\001\000\000\000\001\000\000\000\210\330\001\350\254\355\000\005sr\000&org.apache.beam.sdk.coders.VarIntCoder\300K2\332\251KVh\002\000\000xrr5\000\024Atomic\0055 \307\354\265\314\205tPF\002\0055\000*jj\000$Structured\0059\034s\277\022\016\325\3246\021\t9\000 j9\000\005/0C\335\325\211\256\274~\370\002\000\000xp"
      >
    >
  >
  coders: <
    key: "zguPhmehoZVoidCoder"
    value: <
      spec: <
        urn: "beam:coders:javasdk:0.1"
        payload: "\202SNAPPY\000\000\000\000\001\000\000\000\001\000\000\000\210\326\001\350\254\355\000\005sr\000$org.apache.beam.sdk.coders.VoidCoder\271\277U\233\350\r\257U\002\000\000xr\000&j3\000\024Atomic\0055 \307\354\265\314\205tPF\002\0055\000*j5\000$Structured\0059\034s\277\022\016\325\3246\021\t9\000 j9\000\005/0C\335\325\211\256\274~\370\002\000\000xp"
      >
    >
  >
  environments: <
    key: "go"
    value: <
      urn: "beam:env:docker:v1"
      payload: "\n\026apache/beam_go_sdk:dev"
      capabilities: "beam:protocol:progress_reporting:v1"
      capabilities: "beam:protocol:multi_core_bundle_processing:v1"
      capabilities: "beam:transform:sdf_truncate_sized_restrictions:v1"
      capabilities: "beam:protocol:worker_status:v1"
      capabilities: "beam:protocol:monitoring_info_short_ids:v1"
      capabilities: "beam:version:sdk_base:go:apache/beam_go_sdk:2.46.0.dev"
      capabilities: "beam:coder:bytes:v1"
      capabilities: "beam:coder:bool:v1"
      capabilities: "beam:coder:varint:v1"
      capabilities: "beam:coder:double:v1"
      capabilities: "beam:coder:string_utf8:v1"
      capabilities: "beam:coder:length_prefix:v1"
      capabilities: "beam:coder:kv:v1"
      capabilities: "beam:coder:iterable:v1"
      capabilities: "beam:coder:state_backed_iterable:v1"
      capabilities: "beam:coder:windowed_value:v1"
      capabilities: "beam:coder:global_window:v1"
      capabilities: "beam:coder:interval_window:v1"
      capabilities: "beam:coder:row:v1"
      capabilities: "beam:coder:nullable:v1"
      dependencies: <
        type_urn: "beam:artifact:type:file:v1"
        role_urn: "beam:artifact:role:go_worker_binary:v1"
      >
    >
  >
  environments: <
    key: "zguPhmehoZbeam:env:docker:v1"
    value: <
      urn: "beam:env:docker:v1"
      payload: "\n apache/beam_java8_sdk:2.46.0.dev"
      capabilities: "beam:coder:bytes:v1"
      capabilities: "beam:coder:bool:v1"
      capabilities: "beam:coder:varint:v1"
      capabilities: "beam:coder:string_utf8:v1"
      capabilities: "beam:coder:iterable:v1"
      capabilities: "beam:coder:timer:v1"
      capabilities: "beam:coder:kv:v1"
      capabilities: "beam:coder:length_prefix:v1"
      capabilities: "beam:coder:global_window:v1"
      capabilities: "beam:coder:interval_window:v1"
      capabilities: "beam:coder:custom_window:v1"
      capabilities: "beam:coder:windowed_value:v1"
      capabilities: "beam:coder:double:v1"
      capabilities: "beam:coder:row:v1"
      capabilities: "beam:coder:param_windowed_value:v1"
      capabilities: "beam:coder:state_backed_iterable:v1"
      capabilities: "beam:coder:sharded_key:v1"
      capabilities: "beam:coder:nullable:v1"
      capabilities: "beam:protocol:multi_core_bundle_processing:v1"
      capabilities: "beam:protocol:progress_reporting:v1"
      capabilities: "beam:protocol:harness_monitoring_infos:v1"
      capabilities: "beam:protocol:control_request_elements_embedding:v1"
      capabilities: "beam:protocol:state_caching:v1"
      capabilities: "beam:version:sdk_base:apache/beam_java8_sdk:2.46.0.dev"
      capabilities: "beam:transform:sdf_truncate_sized_restrictions:v1"
      capabilities: "beam:transform:to_string:v1"
      dependencies: <
        type_urn: "beam:artifact:type:file:v1"
        type_payload: "\nL/tmp/artifacts/icedtea-sound-5xFkOD7aUmX8Jiw7lPqhn75zkNGCyUOfOuqi2rClWKM.jar\022@e71164383eda5265fc262c3b94faa19fbe7390d182c9439f3aeaa2dab0a558a3"
        role_urn: "beam:artifact:role:staging_to:v1"
        role_payload: "\n=icedtea-sound-5xFkOD7aUmX8Jiw7lPqhn75zkNGCyUOfOuqi2rClWKM.jar"
      >
      dependencies: <
        type_urn: "beam:artifact:type:file:v1"
        type_payload: "\nF/tmp/artifacts/jaccess-Rlp7GfuSFOBCBGdO8af2XxrTz5LqaQqwSMAXumdbHN0.jar\022@465a7b19fb9214e04204674ef1a7f65f1ad3cf92ea690ab048c017ba675b1cdd"
        role_urn: "beam:artifact:role:staging_to:v1"
        role_payload: "\n7jaccess-Rlp7GfuSFOBCBGdO8af2XxrTz5LqaQqwSMAXumdbHN0.jar"
      >
      dependencies: <
        type_urn: "beam:artifact:type:file:v1"
        type_payload: "\nI/tmp/artifacts/localedata-Nuzln2shadVmT-PppqaNc7GHBbUyMUb9pXsJTjRiAzs.jar\022@36ece59f6b2169d5664fe3e9a6a68d73b18705b5323146fda57b094e3462033b"
        role_urn: "beam:artifact:role:staging_to:v1"
        role_payload: "\n:localedata-Nuzln2shadVmT-PppqaNc7GHBbUyMUb9pXsJTjRiAzs.jar"
      >
      dependencies: <
        type_urn: "beam:artifact:type:file:v1"
        type_payload: "\nF/tmp/artifacts/nashorn-1iQRhJvU2nRCSB4ucg6f4b69TGiwE1yq0_LGG2MU5N0.jar\022@d62411849bd4da7442481e2e720e9fe1bebd4c68b0135caad3f2c61b6314e4dd"
        role_urn: "beam:artifact:role:staging_to:v1"
        role_payload: "\n7nashorn-1iQRhJvU2nRCSB4ucg6f4b69TGiwE1yq0_LGG2MU5N0.jar"
      >
      dependencies: <
        type_urn: "beam:artifact:type:file:v1"
        type_payload: "\nG/tmp/artifacts/cldrdata-MTK3mMuUzlWYlYkweGQNzI7dFpuLG0_8F8oxT0khQDc.jar\022@3132b798cb94ce559895893078640dcc8edd169b8b1b4ffc17ca314f49214037"
        role_urn: "beam:artifact:role:staging_to:v1"
        role_payload: "\n8cldrdata-MTK3mMuUzlWYlYkweGQNzI7dFpuLG0_8F8oxT0khQDc.jar"
      >
      dependencies: <
        type_urn: "beam:artifact:type:file:v1"
        type_payload: "\nD/tmp/artifacts/dnsns-YTF3f6B-OG4FmXLRf2ckHBi4VJnspBZTyIQCz-6Spwk.jar\022@6131777fa07e386e059972d17f67241c18b85499eca41653c88402cfee92a709"
        role_urn: "beam:artifact:role:staging_to:v1"
        role_payload: "\n5dnsns-YTF3f6B-OG4FmXLRf2ckHBi4VJnspBZTyIQCz-6Spwk.jar"
      >
      dependencies: <
        type_urn: "beam:artifact:type:file:v1"
        type_payload: "\nr/tmp/artifacts/beam-sdks-java-io-expansion-service-2.46.0-SNAPSHOT-51Tm_YY_8ewy9PPWtYGPN5bbVZO-P8v4NpGBbXwHkyk.jar\022@e754e6fd863ff1ec32f4f3d6b5818f3796db5593be3fcbf83691816d7c079329"
        role_urn: "beam:artifact:role:staging_to:v1"
        role_payload: "\ncbeam-sdks-java-io-expansion-service-2.46.0-SNAPSHOT-51Tm_YY_8ewy9PPWtYGPN5bbVZO-P8v4NpGBbXwHkyk.jar"
      >
    >
  >
>
root_transform_ids: "s1"
root_transform_ids: "e4"
root_transform_ids: "e5"
root_transform_ids: "s3"
requirements: "beam:requirement:pardo:splittable_dofn:v1"
2023/02/03 00:01:33 Cross-compiling <https://ci-beam.apache.org/job/beam_PostCommit_XVR_Samza/ws/src/sdks/go/test/integration/io/xlang/kafka/kafka_test.go> as /tmp/worker-2-1675382493403736755
2023/02/03 00:01:35 Prepared job with id: go-testkafkaio_basicreadwrite-177_ba075641-7c2d-4dfe-94a7-917a195a77f2 and staging token: go-testkafkaio_basicreadwrite-177_ba075641-7c2d-4dfe-94a7-917a195a77f2
2023/02/03 00:01:35 Staged binary artifact with token: 
2023/02/03 00:01:35 Submitted job: go0testkafkaio0basicreadwrite0177-jenkins-0203000135-a953966a_ba243a2b-bcdc-4d85-8f27-cc82623d1596
2023/02/03 00:01:35 Job state: STOPPED
2023/02/03 00:01:35 Job state: STARTING
2023/02/03 00:01:35 Job state: RUNNING
2023/02/03 00:01:54 Job state: DONE
--- PASS: TestKafkaIO_BasicReadWrite (43.03s)
PASS
ok  	github.com/apache/beam/sdks/v2/go/test/integration/io/xlang/kafka	49.094s
FAIL

> Task :runners:samza:job-server:validatesCrossLanguageRunnerGoUsingJava FAILED
> Task :runners:samza:job-server:validatesCrossLanguageRunnerJavaUsingPython
INFO:root:Default Python SDK image for environment is apache/beam_python3.8_sdk:2.44.0
INFO:root:No image given, using default Python SDK image
INFO:root:Default Python SDK image for environment is apache/beam_python3.8_sdk:2.44.0
INFO:root:Python SDK container image set to "apache/beam_python3.8_sdk:2.44.0" for Docker environment
INFO:__main__:Listening for expansion requests at 43925
INFO:root:Missing pipeline option (runner). Executing pipeline using the default runner: DirectRunner.
INFO:__main__:Shutting down expansion service.
INFO:apache_beam.runners.portability.stager:Executing command: ['/home/jenkins/.apache_beam/cache/venvs/py-3.8-beam-2.44.0-743bdccef67087512a7a190820e727aab7bdcb14/bin/python', '-m', 'pip', 'download', '--dest', '/tmp/dataflow-requirements-cache', '-r', '/tmp/tmp7bzdql5n/tmp_requirements.txt', '--exists-action', 'i', '--no-deps', '--implementation', 'cp', '--abi', 'cp38', '--platform', 'manylinux2014_x86_64']
INFO:root:Default Python SDK image for environment is apache/beam_python3.8_sdk:2.44.0
INFO:root:No image given, using default Python SDK image
INFO:root:Default Python SDK image for environment is apache/beam_python3.8_sdk:2.44.0
INFO:root:Python SDK container image set to "apache/beam_python3.8_sdk:2.44.0" for Docker environment
INFO:__main__:Listening for expansion requests at 40945
INFO:root:Missing pipeline option (runner). Executing pipeline using the default runner: DirectRunner.
INFO:__main__:Shutting down expansion service.

> Task :runners:samza:job-server:validatesCrossLanguageRunnerPythonUsingJava
> Task :runners:samza:job-server:validatesCrossLanguageRunnerPythonUsingSql
> Task :runners:samza:job-server:samzaJobServerCleanup
> Task :runners:samza:job-server:validatesCrossLanguageRunnerCleanup

FAILURE: Build failed with an exception.

* Where:
Build file '<https://ci-beam.apache.org/job/beam_PostCommit_XVR_Samza/ws/src/sdks/go/test/build.gradle'> line: 193

* What went wrong:
Execution failed for task ':runners:samza:job-server:validatesCrossLanguageRunnerGoUsingJava'.
> Process 'command 'sh'' finished with non-zero exit value 1

* Try:
> Run with --stacktrace option to get the stack trace.
> Run with --info or --debug option to get more log output.

* Get more help at https://help.gradle.org

Deprecated Gradle features were used in this build, making it incompatible with Gradle 8.0.

You can use '--warning-mode all' to show the individual deprecation warnings and determine if they come from your own scripts or plugins.

See https://docs.gradle.org/7.5.1/userguide/command_line_interface.html#sec:command_line_warnings

Execution optimizations have been disabled for 1 invalid unit(s) of work during this build to ensure correctness.
Please consult deprecation warnings for more details.

BUILD FAILED in 38m 14s
261 actionable tasks: 184 executed, 65 from cache, 12 up-to-date

Publishing build scan...
https://gradle.com/s/7xghexathmqk6

Build step 'Invoke Gradle script' changed build result to FAILURE
Build step 'Invoke Gradle script' marked build as failure

---------------------------------------------------------------------
To unsubscribe, e-mail: builds-unsubscribe@beam.apache.org
For additional commands, e-mail: builds-help@beam.apache.org


Build failed in Jenkins: beam_PostCommit_XVR_Samza #2232

Posted by Apache Jenkins Server <je...@builds.apache.org>.
See <https://ci-beam.apache.org/job/beam_PostCommit_XVR_Samza/2232/display/redirect?page=changes>

Changes:

[noreply] Add sideinputs to the RunInference Transform (#25200)


------------------------------------------
[...truncated 1.53 MB...]
INFO     apache_beam.utils.subprocess_server:subprocess_server.py:239 Using pre-built snapshot at <https://ci-beam.apache.org/job/beam_PostCommit_XVR_Samza/ws/src/sdks/java/extensions/sql/expansion-service/build/libs/beam-sdks-java-extensions-sql-expansion-service-2.46.0-SNAPSHOT.jar>
INFO     root:external.py:854 Starting a JAR-based expansion service from JAR <https://ci-beam.apache.org/job/beam_PostCommit_XVR_Samza/ws/src/sdks/java/extensions/sql/expansion-service/build/libs/beam-sdks-java-extensions-sql-expansion-service-2.46.0-SNAPSHOT.jar> 
INFO     apache_beam.utils.subprocess_server:subprocess_server.py:116 Starting service with ['java' '-jar' '<https://ci-beam.apache.org/job/beam_PostCommit_XVR_Samza/ws/src/sdks/java/extensions/sql/expansion-service/build/libs/beam-sdks-java-extensions-sql-expansion-service-2.46.0-SNAPSHOT.jar'> '38967' '--filesToStage=<https://ci-beam.apache.org/job/beam_PostCommit_XVR_Samza/ws/src/sdks/java/extensions/sql/expansion-service/build/libs/beam-sdks-java-extensions-sql-expansion-service-2.46.0-SNAPSHOT.jar']>
INFO     apache_beam.utils.subprocess_server:subprocess_server.py:126 Starting expansion service at localhost:38967
INFO     apache_beam.utils.subprocess_server:subprocess_server.py:126 Feb 02, 2023 6:21:04 PM org.apache.beam.sdk.expansion.service.ExpansionService loadRegisteredTransforms
INFO     apache_beam.utils.subprocess_server:subprocess_server.py:126 INFO: Registering external transforms: [beam:external:java:sql:v1, beam:transform:org.apache.beam:pubsub_read:v1, beam:transform:org.apache.beam:pubsub_write:v1, beam:transform:org.apache.beam:pubsublite_write:v1, beam:transform:org.apache.beam:pubsublite_read:v1, beam:transform:org.apache.beam:spanner_insert:v1, beam:transform:org.apache.beam:spanner_update:v1, beam:transform:org.apache.beam:spanner_replace:v1, beam:transform:org.apache.beam:spanner_insert_or_update:v1, beam:transform:org.apache.beam:spanner_delete:v1, beam:transform:org.apache.beam:spanner_read:v1, beam:transform:org.apache.beam:kafka_read_with_metadata:v1, beam:transform:org.apache.beam:kafka_read_without_metadata:v1, beam:transform:org.apache.beam:kafka_write:v1, beam:external:java:generate_sequence:v1]
INFO     apache_beam.utils.subprocess_server:subprocess_server.py:126 
INFO     apache_beam.utils.subprocess_server:subprocess_server.py:126 Registered transforms:
INFO     apache_beam.utils.subprocess_server:subprocess_server.py:126 	beam:external:java:sql:v1: org.apache.beam.sdk.expansion.service.ExpansionService$ExternalTransformRegistrarLoader$1@38425407
INFO     apache_beam.utils.subprocess_server:subprocess_server.py:126 	beam:transform:org.apache.beam:pubsub_read:v1: org.apache.beam.sdk.expansion.service.ExpansionService$ExternalTransformRegistrarLoader$1@43bc63a3
INFO     apache_beam.utils.subprocess_server:subprocess_server.py:126 	beam:transform:org.apache.beam:pubsub_write:v1: org.apache.beam.sdk.expansion.service.ExpansionService$ExternalTransformRegistrarLoader$1@702657cc
INFO     apache_beam.utils.subprocess_server:subprocess_server.py:126 	beam:transform:org.apache.beam:pubsublite_write:v1: org.apache.beam.sdk.expansion.service.ExpansionService$ExternalTransformRegistrarLoader$1@6a6cb05c
INFO     apache_beam.utils.subprocess_server:subprocess_server.py:126 	beam:transform:org.apache.beam:pubsublite_read:v1: org.apache.beam.sdk.expansion.service.ExpansionService$ExternalTransformRegistrarLoader$1@40a4337a
INFO     apache_beam.utils.subprocess_server:subprocess_server.py:126 	beam:transform:org.apache.beam:spanner_insert:v1: org.apache.beam.sdk.expansion.service.ExpansionService$ExternalTransformRegistrarLoader$1@6025e1b6
INFO     apache_beam.utils.subprocess_server:subprocess_server.py:126 	beam:transform:org.apache.beam:spanner_update:v1: org.apache.beam.sdk.expansion.service.ExpansionService$ExternalTransformRegistrarLoader$1@22ff4249
INFO     apache_beam.utils.subprocess_server:subprocess_server.py:126 	beam:transform:org.apache.beam:spanner_replace:v1: org.apache.beam.sdk.expansion.service.ExpansionService$ExternalTransformRegistrarLoader$1@2d1ef81a
INFO     apache_beam.utils.subprocess_server:subprocess_server.py:126 	beam:transform:org.apache.beam:spanner_insert_or_update:v1: org.apache.beam.sdk.expansion.service.ExpansionService$ExternalTransformRegistrarLoader$1@4c402120
INFO     apache_beam.utils.subprocess_server:subprocess_server.py:126 	beam:transform:org.apache.beam:spanner_delete:v1: org.apache.beam.sdk.expansion.service.ExpansionService$ExternalTransformRegistrarLoader$1@327514f
INFO     apache_beam.utils.subprocess_server:subprocess_server.py:126 	beam:transform:org.apache.beam:spanner_read:v1: org.apache.beam.sdk.expansion.service.ExpansionService$ExternalTransformRegistrarLoader$1@5b12b668
INFO     apache_beam.utils.subprocess_server:subprocess_server.py:126 	beam:transform:org.apache.beam:kafka_read_with_metadata:v1: org.apache.beam.sdk.expansion.service.ExpansionService$ExternalTransformRegistrarLoader$1@1165b38
INFO     apache_beam.utils.subprocess_server:subprocess_server.py:126 	beam:transform:org.apache.beam:kafka_read_without_metadata:v1: org.apache.beam.sdk.expansion.service.ExpansionService$ExternalTransformRegistrarLoader$1@4c12331b
INFO     apache_beam.utils.subprocess_server:subprocess_server.py:126 	beam:transform:org.apache.beam:kafka_write:v1: org.apache.beam.sdk.expansion.service.ExpansionService$ExternalTransformRegistrarLoader$1@7586beff
INFO     apache_beam.utils.subprocess_server:subprocess_server.py:126 	beam:external:java:generate_sequence:v1: org.apache.beam.sdk.expansion.service.ExpansionService$ExternalTransformRegistrarLoader$1@3b69e7d1
INFO     apache_beam.utils.subprocess_server:subprocess_server.py:126 
INFO     apache_beam.utils.subprocess_server:subprocess_server.py:126 Registered SchemaTransformProviders:
INFO     apache_beam.utils.subprocess_server:subprocess_server.py:126 	beam:schematransform:org.apache.beam:kafka_read:v1
INFO     apache_beam.utils.subprocess_server:subprocess_server.py:126 	beam:schematransform:org.apache.beam:kafka_write:v1
INFO     apache_beam.utils.subprocess_server:subprocess_server.py:126 	beam:schematransform:org.apache.beam:bigquery_storage_write:v1
INFO     apache_beam.utils.subprocess_server:subprocess_server.py:126 	beam:schematransform:org.apache.beam:pubsub_read:v1
INFO     apache_beam.utils.subprocess_server:subprocess_server.py:126 	beam:schematransform:org.apache.beam:pubsub_write:v1
INFO     apache_beam.utils.subprocess_server:subprocess_server.py:126 	beam:schematransform:org.apache.beam:pubsublite_write:v1
INFO     apache_beam.utils.subprocess_server:subprocess_server.py:126 	beam:schematransform:org.apache.beam:spanner_write:v1
INFO     apache_beam.utils.subprocess_server:subprocess_server.py:126 	beam:schematransform:org.apache.beam:pubsublite_read:v1
INFO     apache_beam.utils.subprocess_server:subprocess_server.py:126 	beam:schematransform:org.apache.beam:bigquery_storage_read:v1
INFO     apache_beam.utils.subprocess_server:subprocess_server.py:126 Feb 02, 2023 6:21:05 PM org.apache.beam.sdk.expansion.service.ExpansionService expand
INFO     apache_beam.utils.subprocess_server:subprocess_server.py:126 INFO: Expanding 'SqlTransform(beam:external:java:sql:v1)' with URN 'beam:external:java:sql:v1'
INFO     apache_beam.utils.subprocess_server:subprocess_server.py:126 Feb 02, 2023 6:21:05 PM org.apache.beam.sdk.expansion.service.ExpansionService$ExternalTransformRegistrarLoader payloadToConfig
INFO     apache_beam.utils.subprocess_server:subprocess_server.py:126 WARNING: Configuration class 'org.apache.beam.sdk.extensions.sql.expansion.ExternalSqlTransformRegistrar$Configuration' has no schema registered. Attempting to construct with setter approach.
INFO     apache_beam.utils.subprocess_server:subprocess_server.py:126 Feb 02, 2023 6:21:06 PM org.apache.beam.sdk.expansion.service.ExpansionService$ExternalTransformRegistrarLoader payloadToConfig
INFO     apache_beam.utils.subprocess_server:subprocess_server.py:126 WARNING: Configuration class 'org.apache.beam.sdk.extensions.sql.expansion.ExternalSqlTransformRegistrar$Configuration' has no schema registered. Attempting to construct with setter approach.
INFO     apache_beam.utils.subprocess_server:subprocess_server.py:126 Feb 02, 2023 6:21:07 PM org.apache.beam.sdk.extensions.sql.impl.CalciteQueryPlanner convertToBeamRel
INFO     apache_beam.utils.subprocess_server:subprocess_server.py:126 INFO: SQL:
INFO     apache_beam.utils.subprocess_server:subprocess_server.py:126 SELECT `simple`.`id` AS `id`, `enrich`.`metadata` AS `metadata`
INFO     apache_beam.utils.subprocess_server:subprocess_server.py:126 FROM `beam`.`simple` AS `simple`
INFO     apache_beam.utils.subprocess_server:subprocess_server.py:126 INNER JOIN `beam`.`enrich` AS `enrich` ON `simple`.`id` = `enrich`.`id`
INFO     apache_beam.utils.subprocess_server:subprocess_server.py:126 Feb 02, 2023 6:21:07 PM org.apache.beam.sdk.extensions.sql.impl.CalciteQueryPlanner convertToBeamRel
INFO     apache_beam.utils.subprocess_server:subprocess_server.py:126 INFO: SQLPlan>
INFO     apache_beam.utils.subprocess_server:subprocess_server.py:126 LogicalProject(id=[$0], metadata=[$4])
INFO     apache_beam.utils.subprocess_server:subprocess_server.py:126   LogicalJoin(condition=[=($0, $3)], joinType=[inner])
INFO     apache_beam.utils.subprocess_server:subprocess_server.py:126     BeamIOSourceRel(table=[[beam, simple]])
INFO     apache_beam.utils.subprocess_server:subprocess_server.py:126     BeamIOSourceRel(table=[[beam, enrich]])
INFO     apache_beam.utils.subprocess_server:subprocess_server.py:126 
INFO     apache_beam.utils.subprocess_server:subprocess_server.py:126 Feb 02, 2023 6:21:08 PM org.apache.beam.sdk.extensions.sql.impl.CalciteQueryPlanner convertToBeamRel
INFO     apache_beam.utils.subprocess_server:subprocess_server.py:126 INFO: BEAMPlan>
INFO     apache_beam.utils.subprocess_server:subprocess_server.py:126 BeamCalcRel(expr#0..4=[{inputs}], id=[$t0], metadata=[$t4])
INFO     apache_beam.utils.subprocess_server:subprocess_server.py:126   BeamCoGBKJoinRel(condition=[=($0, $3)], joinType=[inner])
INFO     apache_beam.utils.subprocess_server:subprocess_server.py:126     BeamIOSourceRel(table=[[beam, simple]])
INFO     apache_beam.utils.subprocess_server:subprocess_server.py:126     BeamIOSourceRel(table=[[beam, enrich]])
INFO     apache_beam.utils.subprocess_server:subprocess_server.py:126 
INFO     root:environments.py:376 Default Python SDK image for environment is apache/beam_python3.7_sdk:2.46.0.dev
INFO     root:environments.py:299 No image given, using default Python SDK image
INFO     root:environments.py:376 Default Python SDK image for environment is apache/beam_python3.7_sdk:2.46.0.dev
INFO     root:environments.py:304 Python SDK container image set to "apache/beam_python3.7_sdk:2.46.0.dev" for Docker environment
INFO     apache_beam.runners.portability.fn_api_runner.translations:translations.py:710 ==================== <function pack_combiners at 0x7f243aab0440> ====================
INFO     apache_beam.runners.portability.fn_api_runner.translations:translations.py:710 ==================== <function lift_combiners at 0x7f243aab04d0> ====================
INFO     apache_beam.runners.portability.fn_api_runner.translations:translations.py:710 ==================== <function sort_stages at 0x7f243aab0c20> ====================
INFO     apache_beam.runners.portability.portable_runner:portable_runner.py:583 Job state changed to STOPPED
INFO     apache_beam.runners.portability.portable_runner:portable_runner.py:583 Job state changed to STARTING
INFO     apache_beam.runners.portability.portable_runner:portable_runner.py:583 Job state changed to RUNNING
INFO     apache_beam.runners.portability.portable_runner:portable_runner.py:583 Job state changed to DONE
PASSED                                                                   [ 77%]
apache_beam/transforms/sql_test.py::SqlTransformTest::test_windowing_before_sql 
-------------------------------- live log call ---------------------------------
INFO     apache_beam.utils.subprocess_server:subprocess_server.py:239 Using pre-built snapshot at <https://ci-beam.apache.org/job/beam_PostCommit_XVR_Samza/ws/src/sdks/java/extensions/sql/expansion-service/build/libs/beam-sdks-java-extensions-sql-expansion-service-2.46.0-SNAPSHOT.jar>
INFO     root:external.py:854 Starting a JAR-based expansion service from JAR <https://ci-beam.apache.org/job/beam_PostCommit_XVR_Samza/ws/src/sdks/java/extensions/sql/expansion-service/build/libs/beam-sdks-java-extensions-sql-expansion-service-2.46.0-SNAPSHOT.jar> 
INFO     apache_beam.utils.subprocess_server:subprocess_server.py:116 Starting service with ['java' '-jar' '<https://ci-beam.apache.org/job/beam_PostCommit_XVR_Samza/ws/src/sdks/java/extensions/sql/expansion-service/build/libs/beam-sdks-java-extensions-sql-expansion-service-2.46.0-SNAPSHOT.jar'> '58211' '--filesToStage=<https://ci-beam.apache.org/job/beam_PostCommit_XVR_Samza/ws/src/sdks/java/extensions/sql/expansion-service/build/libs/beam-sdks-java-extensions-sql-expansion-service-2.46.0-SNAPSHOT.jar']>
INFO     apache_beam.utils.subprocess_server:subprocess_server.py:126 Starting expansion service at localhost:58211
INFO     apache_beam.utils.subprocess_server:subprocess_server.py:126 Feb 02, 2023 6:21:35 PM org.apache.beam.sdk.expansion.service.ExpansionService loadRegisteredTransforms
INFO     apache_beam.utils.subprocess_server:subprocess_server.py:126 INFO: Registering external transforms: [beam:external:java:sql:v1, beam:transform:org.apache.beam:pubsub_read:v1, beam:transform:org.apache.beam:pubsub_write:v1, beam:transform:org.apache.beam:pubsublite_write:v1, beam:transform:org.apache.beam:pubsublite_read:v1, beam:transform:org.apache.beam:spanner_insert:v1, beam:transform:org.apache.beam:spanner_update:v1, beam:transform:org.apache.beam:spanner_replace:v1, beam:transform:org.apache.beam:spanner_insert_or_update:v1, beam:transform:org.apache.beam:spanner_delete:v1, beam:transform:org.apache.beam:spanner_read:v1, beam:transform:org.apache.beam:kafka_read_with_metadata:v1, beam:transform:org.apache.beam:kafka_read_without_metadata:v1, beam:transform:org.apache.beam:kafka_write:v1, beam:external:java:generate_sequence:v1]
INFO     apache_beam.utils.subprocess_server:subprocess_server.py:126 
INFO     apache_beam.utils.subprocess_server:subprocess_server.py:126 Registered transforms:
INFO     apache_beam.utils.subprocess_server:subprocess_server.py:126 	beam:external:java:sql:v1: org.apache.beam.sdk.expansion.service.ExpansionService$ExternalTransformRegistrarLoader$1@38425407
INFO     apache_beam.utils.subprocess_server:subprocess_server.py:126 	beam:transform:org.apache.beam:pubsub_read:v1: org.apache.beam.sdk.expansion.service.ExpansionService$ExternalTransformRegistrarLoader$1@43bc63a3
INFO     apache_beam.utils.subprocess_server:subprocess_server.py:126 	beam:transform:org.apache.beam:pubsub_write:v1: org.apache.beam.sdk.expansion.service.ExpansionService$ExternalTransformRegistrarLoader$1@702657cc
INFO     apache_beam.utils.subprocess_server:subprocess_server.py:126 	beam:transform:org.apache.beam:pubsublite_write:v1: org.apache.beam.sdk.expansion.service.ExpansionService$ExternalTransformRegistrarLoader$1@6a6cb05c
INFO     apache_beam.utils.subprocess_server:subprocess_server.py:126 	beam:transform:org.apache.beam:pubsublite_read:v1: org.apache.beam.sdk.expansion.service.ExpansionService$ExternalTransformRegistrarLoader$1@40a4337a
INFO     apache_beam.utils.subprocess_server:subprocess_server.py:126 	beam:transform:org.apache.beam:spanner_insert:v1: org.apache.beam.sdk.expansion.service.ExpansionService$ExternalTransformRegistrarLoader$1@6025e1b6
INFO     apache_beam.utils.subprocess_server:subprocess_server.py:126 	beam:transform:org.apache.beam:spanner_update:v1: org.apache.beam.sdk.expansion.service.ExpansionService$ExternalTransformRegistrarLoader$1@22ff4249
INFO     apache_beam.utils.subprocess_server:subprocess_server.py:126 	beam:transform:org.apache.beam:spanner_replace:v1: org.apache.beam.sdk.expansion.service.ExpansionService$ExternalTransformRegistrarLoader$1@2d1ef81a
INFO     apache_beam.utils.subprocess_server:subprocess_server.py:126 	beam:transform:org.apache.beam:spanner_insert_or_update:v1: org.apache.beam.sdk.expansion.service.ExpansionService$ExternalTransformRegistrarLoader$1@4c402120
INFO     apache_beam.utils.subprocess_server:subprocess_server.py:126 	beam:transform:org.apache.beam:spanner_delete:v1: org.apache.beam.sdk.expansion.service.ExpansionService$ExternalTransformRegistrarLoader$1@327514f
INFO     apache_beam.utils.subprocess_server:subprocess_server.py:126 	beam:transform:org.apache.beam:spanner_read:v1: org.apache.beam.sdk.expansion.service.ExpansionService$ExternalTransformRegistrarLoader$1@5b12b668
INFO     apache_beam.utils.subprocess_server:subprocess_server.py:126 	beam:transform:org.apache.beam:kafka_read_with_metadata:v1: org.apache.beam.sdk.expansion.service.ExpansionService$ExternalTransformRegistrarLoader$1@1165b38
INFO     apache_beam.utils.subprocess_server:subprocess_server.py:126 	beam:transform:org.apache.beam:kafka_read_without_metadata:v1: org.apache.beam.sdk.expansion.service.ExpansionService$ExternalTransformRegistrarLoader$1@4c12331b
INFO     apache_beam.utils.subprocess_server:subprocess_server.py:126 	beam:transform:org.apache.beam:kafka_write:v1: org.apache.beam.sdk.expansion.service.ExpansionService$ExternalTransformRegistrarLoader$1@7586beff
INFO     apache_beam.utils.subprocess_server:subprocess_server.py:126 	beam:external:java:generate_sequence:v1: org.apache.beam.sdk.expansion.service.ExpansionService$ExternalTransformRegistrarLoader$1@3b69e7d1
INFO     apache_beam.utils.subprocess_server:subprocess_server.py:126 
INFO     apache_beam.utils.subprocess_server:subprocess_server.py:126 Registered SchemaTransformProviders:
INFO     apache_beam.utils.subprocess_server:subprocess_server.py:126 	beam:schematransform:org.apache.beam:kafka_read:v1
INFO     apache_beam.utils.subprocess_server:subprocess_server.py:126 	beam:schematransform:org.apache.beam:kafka_write:v1
INFO     apache_beam.utils.subprocess_server:subprocess_server.py:126 	beam:schematransform:org.apache.beam:bigquery_storage_write:v1
INFO     apache_beam.utils.subprocess_server:subprocess_server.py:126 	beam:schematransform:org.apache.beam:pubsub_read:v1
INFO     apache_beam.utils.subprocess_server:subprocess_server.py:126 	beam:schematransform:org.apache.beam:pubsub_write:v1
INFO     apache_beam.utils.subprocess_server:subprocess_server.py:126 	beam:schematransform:org.apache.beam:pubsublite_write:v1
INFO     apache_beam.utils.subprocess_server:subprocess_server.py:126 	beam:schematransform:org.apache.beam:spanner_write:v1
INFO     apache_beam.utils.subprocess_server:subprocess_server.py:126 	beam:schematransform:org.apache.beam:pubsublite_read:v1
INFO     apache_beam.utils.subprocess_server:subprocess_server.py:126 	beam:schematransform:org.apache.beam:bigquery_storage_read:v1
INFO     apache_beam.utils.subprocess_server:subprocess_server.py:126 Feb 02, 2023 6:21:36 PM org.apache.beam.sdk.expansion.service.ExpansionService expand
INFO     apache_beam.utils.subprocess_server:subprocess_server.py:126 INFO: Expanding 'SqlTransform(beam:external:java:sql:v1)' with URN 'beam:external:java:sql:v1'
INFO     apache_beam.utils.subprocess_server:subprocess_server.py:126 Feb 02, 2023 6:21:36 PM org.apache.beam.sdk.expansion.service.ExpansionService$ExternalTransformRegistrarLoader payloadToConfig
INFO     apache_beam.utils.subprocess_server:subprocess_server.py:126 WARNING: Configuration class 'org.apache.beam.sdk.extensions.sql.expansion.ExternalSqlTransformRegistrar$Configuration' has no schema registered. Attempting to construct with setter approach.
INFO     apache_beam.utils.subprocess_server:subprocess_server.py:126 Feb 02, 2023 6:21:36 PM org.apache.beam.sdk.expansion.service.ExpansionService$ExternalTransformRegistrarLoader payloadToConfig
INFO     apache_beam.utils.subprocess_server:subprocess_server.py:126 WARNING: Configuration class 'org.apache.beam.sdk.extensions.sql.expansion.ExternalSqlTransformRegistrar$Configuration' has no schema registered. Attempting to construct with setter approach.
INFO     apache_beam.utils.subprocess_server:subprocess_server.py:126 Feb 02, 2023 6:21:38 PM org.apache.beam.sdk.extensions.sql.impl.CalciteQueryPlanner convertToBeamRel
INFO     apache_beam.utils.subprocess_server:subprocess_server.py:126 INFO: SQL:
INFO     apache_beam.utils.subprocess_server:subprocess_server.py:126 SELECT COUNT(*) AS `count`
INFO     apache_beam.utils.subprocess_server:subprocess_server.py:126 FROM `beam`.`PCOLLECTION` AS `PCOLLECTION`
INFO     apache_beam.utils.subprocess_server:subprocess_server.py:126 Feb 02, 2023 6:21:38 PM org.apache.beam.sdk.extensions.sql.impl.CalciteQueryPlanner convertToBeamRel
INFO     apache_beam.utils.subprocess_server:subprocess_server.py:126 INFO: SQLPlan>
INFO     apache_beam.utils.subprocess_server:subprocess_server.py:126 LogicalAggregate(group=[{}], count=[COUNT()])
INFO     apache_beam.utils.subprocess_server:subprocess_server.py:126   BeamIOSourceRel(table=[[beam, PCOLLECTION]])
INFO     apache_beam.utils.subprocess_server:subprocess_server.py:126 
INFO     apache_beam.utils.subprocess_server:subprocess_server.py:126 Feb 02, 2023 6:21:38 PM org.apache.beam.sdk.extensions.sql.impl.CalciteQueryPlanner convertToBeamRel
INFO     apache_beam.utils.subprocess_server:subprocess_server.py:126 INFO: BEAMPlan>
INFO     apache_beam.utils.subprocess_server:subprocess_server.py:126 BeamAggregationRel(group=[{}], count=[COUNT()])
INFO     apache_beam.utils.subprocess_server:subprocess_server.py:126   BeamIOSourceRel(table=[[beam, PCOLLECTION]])
INFO     apache_beam.utils.subprocess_server:subprocess_server.py:126 
INFO     root:environments.py:376 Default Python SDK image for environment is apache/beam_python3.7_sdk:2.46.0.dev
INFO     root:environments.py:299 No image given, using default Python SDK image
INFO     root:environments.py:376 Default Python SDK image for environment is apache/beam_python3.7_sdk:2.46.0.dev
INFO     root:environments.py:304 Python SDK container image set to "apache/beam_python3.7_sdk:2.46.0.dev" for Docker environment
INFO     apache_beam.runners.portability.fn_api_runner.translations:translations.py:710 ==================== <function pack_combiners at 0x7f243aab0440> ====================
INFO     apache_beam.runners.portability.fn_api_runner.translations:translations.py:710 ==================== <function lift_combiners at 0x7f243aab04d0> ====================
INFO     apache_beam.runners.portability.fn_api_runner.translations:translations.py:710 ==================== <function sort_stages at 0x7f243aab0c20> ====================
INFO     apache_beam.runners.portability.portable_runner:portable_runner.py:583 Job state changed to STOPPED
INFO     apache_beam.runners.portability.portable_runner:portable_runner.py:583 Job state changed to STARTING
INFO     apache_beam.runners.portability.portable_runner:portable_runner.py:583 Job state changed to RUNNING
INFO     apache_beam.runners.portability.portable_runner:portable_runner.py:583 Job state changed to DONE
PASSED                                                                   [ 88%]
apache_beam/transforms/sql_test.py::SqlTransformTest::test_zetasql_generate_data 
-------------------------------- live log call ---------------------------------
INFO     apache_beam.utils.subprocess_server:subprocess_server.py:239 Using pre-built snapshot at <https://ci-beam.apache.org/job/beam_PostCommit_XVR_Samza/ws/src/sdks/java/extensions/sql/expansion-service/build/libs/beam-sdks-java-extensions-sql-expansion-service-2.46.0-SNAPSHOT.jar>
INFO     root:external.py:854 Starting a JAR-based expansion service from JAR <https://ci-beam.apache.org/job/beam_PostCommit_XVR_Samza/ws/src/sdks/java/extensions/sql/expansion-service/build/libs/beam-sdks-java-extensions-sql-expansion-service-2.46.0-SNAPSHOT.jar> 
INFO     apache_beam.utils.subprocess_server:subprocess_server.py:116 Starting service with ['java' '-jar' '<https://ci-beam.apache.org/job/beam_PostCommit_XVR_Samza/ws/src/sdks/java/extensions/sql/expansion-service/build/libs/beam-sdks-java-extensions-sql-expansion-service-2.46.0-SNAPSHOT.jar'> '49197' '--filesToStage=<https://ci-beam.apache.org/job/beam_PostCommit_XVR_Samza/ws/src/sdks/java/extensions/sql/expansion-service/build/libs/beam-sdks-java-extensions-sql-expansion-service-2.46.0-SNAPSHOT.jar']>
INFO     apache_beam.utils.subprocess_server:subprocess_server.py:126 Starting expansion service at localhost:49197
INFO     apache_beam.utils.subprocess_server:subprocess_server.py:126 Feb 02, 2023 6:22:03 PM org.apache.beam.sdk.expansion.service.ExpansionService loadRegisteredTransforms
INFO     apache_beam.utils.subprocess_server:subprocess_server.py:126 INFO: Registering external transforms: [beam:external:java:sql:v1, beam:transform:org.apache.beam:pubsub_read:v1, beam:transform:org.apache.beam:pubsub_write:v1, beam:transform:org.apache.beam:pubsublite_write:v1, beam:transform:org.apache.beam:pubsublite_read:v1, beam:transform:org.apache.beam:spanner_insert:v1, beam:transform:org.apache.beam:spanner_update:v1, beam:transform:org.apache.beam:spanner_replace:v1, beam:transform:org.apache.beam:spanner_insert_or_update:v1, beam:transform:org.apache.beam:spanner_delete:v1, beam:transform:org.apache.beam:spanner_read:v1, beam:transform:org.apache.beam:kafka_read_with_metadata:v1, beam:transform:org.apache.beam:kafka_read_without_metadata:v1, beam:transform:org.apache.beam:kafka_write:v1, beam:external:java:generate_sequence:v1]
INFO     apache_beam.utils.subprocess_server:subprocess_server.py:126 
INFO     apache_beam.utils.subprocess_server:subprocess_server.py:126 Registered transforms:
INFO     apache_beam.utils.subprocess_server:subprocess_server.py:126 	beam:external:java:sql:v1: org.apache.beam.sdk.expansion.service.ExpansionService$ExternalTransformRegistrarLoader$1@38425407
INFO     apache_beam.utils.subprocess_server:subprocess_server.py:126 	beam:transform:org.apache.beam:pubsub_read:v1: org.apache.beam.sdk.expansion.service.ExpansionService$ExternalTransformRegistrarLoader$1@43bc63a3
INFO     apache_beam.utils.subprocess_server:subprocess_server.py:126 	beam:transform:org.apache.beam:pubsub_write:v1: org.apache.beam.sdk.expansion.service.ExpansionService$ExternalTransformRegistrarLoader$1@702657cc
INFO     apache_beam.utils.subprocess_server:subprocess_server.py:126 	beam:transform:org.apache.beam:pubsublite_write:v1: org.apache.beam.sdk.expansion.service.ExpansionService$ExternalTransformRegistrarLoader$1@6a6cb05c
INFO     apache_beam.utils.subprocess_server:subprocess_server.py:126 	beam:transform:org.apache.beam:pubsublite_read:v1: org.apache.beam.sdk.expansion.service.ExpansionService$ExternalTransformRegistrarLoader$1@40a4337a
INFO     apache_beam.utils.subprocess_server:subprocess_server.py:126 	beam:transform:org.apache.beam:spanner_insert:v1: org.apache.beam.sdk.expansion.service.ExpansionService$ExternalTransformRegistrarLoader$1@6025e1b6
INFO     apache_beam.utils.subprocess_server:subprocess_server.py:126 	beam:transform:org.apache.beam:spanner_update:v1: org.apache.beam.sdk.expansion.service.ExpansionService$ExternalTransformRegistrarLoader$1@22ff4249
INFO     apache_beam.utils.subprocess_server:subprocess_server.py:126 	beam:transform:org.apache.beam:spanner_replace:v1: org.apache.beam.sdk.expansion.service.ExpansionService$ExternalTransformRegistrarLoader$1@2d1ef81a
INFO     apache_beam.utils.subprocess_server:subprocess_server.py:126 	beam:transform:org.apache.beam:spanner_insert_or_update:v1: org.apache.beam.sdk.expansion.service.ExpansionService$ExternalTransformRegistrarLoader$1@4c402120
INFO     apache_beam.utils.subprocess_server:subprocess_server.py:126 	beam:transform:org.apache.beam:spanner_delete:v1: org.apache.beam.sdk.expansion.service.ExpansionService$ExternalTransformRegistrarLoader$1@327514f
INFO     apache_beam.utils.subprocess_server:subprocess_server.py:126 	beam:transform:org.apache.beam:spanner_read:v1: org.apache.beam.sdk.expansion.service.ExpansionService$ExternalTransformRegistrarLoader$1@5b12b668
INFO     apache_beam.utils.subprocess_server:subprocess_server.py:126 	beam:transform:org.apache.beam:kafka_read_with_metadata:v1: org.apache.beam.sdk.expansion.service.ExpansionService$ExternalTransformRegistrarLoader$1@1165b38
INFO     apache_beam.utils.subprocess_server:subprocess_server.py:126 	beam:transform:org.apache.beam:kafka_read_without_metadata:v1: org.apache.beam.sdk.expansion.service.ExpansionService$ExternalTransformRegistrarLoader$1@4c12331b
INFO     apache_beam.utils.subprocess_server:subprocess_server.py:126 	beam:transform:org.apache.beam:kafka_write:v1: org.apache.beam.sdk.expansion.service.ExpansionService$ExternalTransformRegistrarLoader$1@7586beff
INFO     apache_beam.utils.subprocess_server:subprocess_server.py:126 	beam:external:java:generate_sequence:v1: org.apache.beam.sdk.expansion.service.ExpansionService$ExternalTransformRegistrarLoader$1@3b69e7d1
INFO     apache_beam.utils.subprocess_server:subprocess_server.py:126 
INFO     apache_beam.utils.subprocess_server:subprocess_server.py:126 Registered SchemaTransformProviders:
INFO     apache_beam.utils.subprocess_server:subprocess_server.py:126 	beam:schematransform:org.apache.beam:kafka_read:v1
INFO     apache_beam.utils.subprocess_server:subprocess_server.py:126 	beam:schematransform:org.apache.beam:kafka_write:v1
INFO     apache_beam.utils.subprocess_server:subprocess_server.py:126 	beam:schematransform:org.apache.beam:bigquery_storage_write:v1
INFO     apache_beam.utils.subprocess_server:subprocess_server.py:126 	beam:schematransform:org.apache.beam:pubsub_read:v1
INFO     apache_beam.utils.subprocess_server:subprocess_server.py:126 	beam:schematransform:org.apache.beam:pubsub_write:v1
INFO     apache_beam.utils.subprocess_server:subprocess_server.py:126 	beam:schematransform:org.apache.beam:pubsublite_write:v1
INFO     apache_beam.utils.subprocess_server:subprocess_server.py:126 	beam:schematransform:org.apache.beam:spanner_write:v1
INFO     apache_beam.utils.subprocess_server:subprocess_server.py:126 	beam:schematransform:org.apache.beam:pubsublite_read:v1
INFO     apache_beam.utils.subprocess_server:subprocess_server.py:126 	beam:schematransform:org.apache.beam:bigquery_storage_read:v1
INFO     apache_beam.utils.subprocess_server:subprocess_server.py:126 Feb 02, 2023 6:22:04 PM org.apache.beam.sdk.expansion.service.ExpansionService expand
INFO     apache_beam.utils.subprocess_server:subprocess_server.py:126 INFO: Expanding 'SqlTransform(beam:external:java:sql:v1)' with URN 'beam:external:java:sql:v1'
INFO     apache_beam.utils.subprocess_server:subprocess_server.py:126 Feb 02, 2023 6:22:04 PM org.apache.beam.sdk.expansion.service.ExpansionService$ExternalTransformRegistrarLoader payloadToConfig
INFO     apache_beam.utils.subprocess_server:subprocess_server.py:126 WARNING: Configuration class 'org.apache.beam.sdk.extensions.sql.expansion.ExternalSqlTransformRegistrar$Configuration' has no schema registered. Attempting to construct with setter approach.
INFO     apache_beam.utils.subprocess_server:subprocess_server.py:126 Feb 02, 2023 6:22:04 PM org.apache.beam.sdk.expansion.service.ExpansionService$ExternalTransformRegistrarLoader payloadToConfig
INFO     apache_beam.utils.subprocess_server:subprocess_server.py:126 WARNING: Configuration class 'org.apache.beam.sdk.extensions.sql.expansion.ExternalSqlTransformRegistrar$Configuration' has no schema registered. Attempting to construct with setter approach.
INFO     apache_beam.utils.subprocess_server:subprocess_server.py:126 Feb 02, 2023 6:22:06 PM com.google.zetasql.io.grpc.NameResolverRegistry getDefaultRegistry
INFO     apache_beam.utils.subprocess_server:subprocess_server.py:126 WARNING: No NameResolverProviders found via ServiceLoader, including for DNS. This is probably due to a broken build. If using ProGuard, check your configuration
INFO     apache_beam.utils.subprocess_server:subprocess_server.py:126 Feb 02, 2023 6:22:08 PM org.apache.beam.sdk.extensions.sql.zetasql.ZetaSQLQueryPlanner convertToBeamRelInternal
INFO     apache_beam.utils.subprocess_server:subprocess_server.py:126 INFO: BEAMPlan>
INFO     apache_beam.utils.subprocess_server:subprocess_server.py:126 BeamZetaSqlCalcRel(expr#0=[{inputs}], expr#1=[1:BIGINT], expr#2=['foo':VARCHAR], expr#3=[3.1400000000000001243E0:DOUBLE], int=[$t1], str=[$t2], flt=[$t3])
INFO     apache_beam.utils.subprocess_server:subprocess_server.py:126   BeamValuesRel(tuples=[[{ 0 }]])
INFO     apache_beam.utils.subprocess_server:subprocess_server.py:126 
INFO     root:environments.py:376 Default Python SDK image for environment is apache/beam_python3.7_sdk:2.46.0.dev
INFO     root:environments.py:299 No image given, using default Python SDK image
INFO     root:environments.py:376 Default Python SDK image for environment is apache/beam_python3.7_sdk:2.46.0.dev
INFO     root:environments.py:304 Python SDK container image set to "apache/beam_python3.7_sdk:2.46.0.dev" for Docker environment
INFO     apache_beam.runners.portability.fn_api_runner.translations:translations.py:710 ==================== <function pack_combiners at 0x7f243aab0440> ====================
INFO     apache_beam.runners.portability.fn_api_runner.translations:translations.py:710 ==================== <function lift_combiners at 0x7f243aab04d0> ====================
INFO     apache_beam.runners.portability.fn_api_runner.translations:translations.py:710 ==================== <function sort_stages at 0x7f243aab0c20> ====================
INFO     apache_beam.runners.portability.portable_runner:portable_runner.py:583 Job state changed to STOPPED
INFO     apache_beam.runners.portability.portable_runner:portable_runner.py:583 Job state changed to STARTING
INFO     apache_beam.runners.portability.portable_runner:portable_runner.py:583 Job state changed to RUNNING
INFO     apache_beam.runners.portability.portable_runner:portable_runner.py:583 Job state changed to DONE
PASSED                                                                   [100%]

=============================== warnings summary ===============================
../../build/gradleenv/1922375555/lib/python3.7/site-packages/hdfs/config.py:15
  <https://ci-beam.apache.org/job/beam_PostCommit_XVR_Samza/ws/src/build/gradleenv/1922375555/lib/python3.7/site-packages/hdfs/config.py>:15: DeprecationWarning: the imp module is deprecated in favour of importlib; see the module's documentation for alternative uses
    from imp import load_source

-- Docs: https://docs.pytest.org/en/stable/how-to/capture-warnings.html
- generated xml file: <https://ci-beam.apache.org/job/beam_PostCommit_XVR_Samza/ws/src/sdks/python/pytest_xlangSqlValidateRunner.xml> -
===== 9 passed, 6 skipped, 6808 deselected, 1 warning in 276.68s (0:04:36) =====

> Task :runners:samza:job-server:samzaJobServerCleanup
Stopping job server pid: 188271.

> Task :runners:samza:job-server:validatesCrossLanguageRunnerCleanup
Stopping expansion service pid: 197661.
Stopping expansion service pid: 197662.

FAILURE: Build failed with an exception.

* Where:
Build file '<https://ci-beam.apache.org/job/beam_PostCommit_XVR_Samza/ws/src/sdks/go/test/build.gradle'> line: 193

* What went wrong:
Execution failed for task ':runners:samza:job-server:validatesCrossLanguageRunnerGoUsingJava'.
> Process 'command 'sh'' finished with non-zero exit value 1

* Try:
> Run with --stacktrace option to get the stack trace.
> Run with --info or --debug option to get more log output.

* Get more help at https://help.gradle.org

Deprecated Gradle features were used in this build, making it incompatible with Gradle 8.0.

You can use '--warning-mode all' to show the individual deprecation warnings and determine if they come from your own scripts or plugins.

See https://docs.gradle.org/7.5.1/userguide/command_line_interface.html#sec:command_line_warnings

Execution optimizations have been disabled for 1 invalid unit(s) of work during this build to ensure correctness.
Please consult deprecation warnings for more details.

BUILD FAILED in 40m 8s
261 actionable tasks: 172 executed, 77 from cache, 12 up-to-date

Publishing build scan...
https://gradle.com/s/3kif6q4jtxxv4

Build step 'Invoke Gradle script' changed build result to FAILURE
Build step 'Invoke Gradle script' marked build as failure

---------------------------------------------------------------------
To unsubscribe, e-mail: builds-unsubscribe@beam.apache.org
For additional commands, e-mail: builds-help@beam.apache.org