You are viewing a plain text version of this content. The canonical link for it is here.
Posted to issues@bookkeeper.apache.org by Apache Jenkins Server <je...@builds.apache.org> on 2018/09/10 14:31:14 UTC

Build failed in Jenkins: bookkeeper_release_nightly_snapshot #120

See <https://builds.apache.org/job/bookkeeper_release_nightly_snapshot/120/display/redirect>

------------------------------------------
[...truncated 2.81 MB...]
Progress (1): 1.0 kB                    Uploaded: https://repository.apache.org/content/repositories/snapshots/org/apache/bookkeeper/stats/twitter-finagle-provider/4.9.0-SNAPSHOT/maven-metadata.xml (1.0 kB at 619 B/s)
Uploading: https://repository.apache.org/content/repositories/snapshots/org/apache/bookkeeper/stats/twitter-finagle-provider/maven-metadata.xml
Progress (1): 639 B                   Uploaded: https://repository.apache.org/content/repositories/snapshots/org/apache/bookkeeper/stats/twitter-finagle-provider/maven-metadata.xml (639 B at 368 B/s)
Uploading: https://repository.apache.org/content/repositories/snapshots/org/apache/bookkeeper/stats/twitter-finagle-provider/4.9.0-SNAPSHOT/twitter-finagle-provider-4.9.0-20180910.143050-26-sources.jar
Progress (1): 2.0/12 kBProgress (1): 4.1/12 kBProgress (1): 6.1/12 kBProgress (1): 8.2/12 kBProgress (1): 10/12 kB Progress (1): 12 kB                      Uploaded: https://repository.apache.org/content/repositories/snapshots/org/apache/bookkeeper/stats/twitter-finagle-provider/4.9.0-SNAPSHOT/twitter-finagle-provider-4.9.0-20180910.143050-26-sources.jar (12 kB at 7.0 kB/s)
Uploading: https://repository.apache.org/content/repositories/snapshots/org/apache/bookkeeper/stats/twitter-finagle-provider/4.9.0-SNAPSHOT/maven-metadata.xml
Progress (1): 1.0 kB                    Uploaded: https://repository.apache.org/content/repositories/snapshots/org/apache/bookkeeper/stats/twitter-finagle-provider/4.9.0-SNAPSHOT/maven-metadata.xml (1.0 kB at 692 B/s)
Uploading: https://repository.apache.org/content/repositories/snapshots/org/apache/bookkeeper/stats/twitter-finagle-provider/4.9.0-SNAPSHOT/twitter-finagle-provider-4.9.0-20180910.143050-26-sources.jar
Progress (1): 2.0/12 kBProgress (1): 4.1/12 kBProgress (1): 6.1/12 kBProgress (1): 8.2/12 kBProgress (1): 10/12 kB Progress (1): 12 kB                      Uploaded: https://repository.apache.org/content/repositories/snapshots/org/apache/bookkeeper/stats/twitter-finagle-provider/4.9.0-SNAPSHOT/twitter-finagle-provider-4.9.0-20180910.143050-26-sources.jar (12 kB at 10 kB/s)
Uploading: https://repository.apache.org/content/repositories/snapshots/org/apache/bookkeeper/stats/twitter-finagle-provider/4.9.0-SNAPSHOT/maven-metadata.xml
Progress (1): 1.0 kB                    Uploaded: https://repository.apache.org/content/repositories/snapshots/org/apache/bookkeeper/stats/twitter-finagle-provider/4.9.0-SNAPSHOT/maven-metadata.xml (1.0 kB at 732 B/s)
2018-09-10\T\14:31:02.995 [INFO] 
2018-09-10\T\14:31:02.995 [INFO] ------------------------------------------------------------------------
2018-09-10\T\14:31:02.995 [INFO] Building Apache BookKeeper :: Stats Providers :: Twitter Science Stats 4.9.0-SNAPSHOT
2018-09-10\T\14:31:02.995 [INFO] ------------------------------------------------------------------------
Downloading: http://maven.twttr.com/com/twitter/common/stats/0.0.64/stats-0.0.64.pom
Progress (1): 2.0 kBProgress (1): 2.5 kB                    Downloaded: http://maven.twttr.com/com/twitter/common/stats/0.0.64/stats-0.0.64.pom (2.5 kB at 8.7 kB/s)
Downloading: http://maven.twttr.com/com/twitter/common/stat-registry/0.0.10/stat-registry-0.0.10.pom
Progress (1): 908 B                   Downloaded: http://maven.twttr.com/com/twitter/common/stat-registry/0.0.10/stat-registry-0.0.10.pom (908 B at 7.6 kB/s)
Downloading: http://maven.twttr.com/com/twitter/common/stat/0.0.11/stat-0.0.11.pom
Progress (1): 688 B                   Downloaded: http://maven.twttr.com/com/twitter/common/stat/0.0.11/stat-0.0.11.pom (688 B at 5.6 kB/s)
Downloading: http://maven.twttr.com/com/twitter/common/stats-provider/0.0.36/stats-provider-0.0.36.pom
Progress (1): 1.4 kB                    Downloaded: http://maven.twttr.com/com/twitter/common/stats-provider/0.0.36/stats-provider-0.0.36.pom (1.4 kB at 12 kB/s)
Downloading: http://maven.twttr.com/com/twitter/common/application-action/0.0.44/application-action-0.0.44.pom
Progress (1): 1.6 kBProgress (1): 2.0 kB                    Downloaded: http://maven.twttr.com/com/twitter/common/application-action/0.0.44/application-action-0.0.44.pom (2.0 kB at 16 kB/s)
Downloading: http://maven.twttr.com/com/twitter/common/base/0.0.57/base-0.0.57.pom
Progress (1): 1.6 kBProgress (1): 1.8 kB                    Downloaded: http://maven.twttr.com/com/twitter/common/base/0.0.57/base-0.0.57.pom (1.8 kB at 14 kB/s)
Downloading: http://maven.twttr.com/com/twitter/common/quantity/0.0.44/quantity-0.0.44.pom
Progress (1): 1.4 kB                    Downloaded: http://maven.twttr.com/com/twitter/common/quantity/0.0.44/quantity-0.0.44.pom (1.4 kB at 12 kB/s)
Downloading: http://maven.twttr.com/com/twitter/common/collections/0.0.48/collections-0.0.48.pom
Progress (1): 1.4 kB                    Downloaded: http://maven.twttr.com/com/twitter/common/collections/0.0.48/collections-0.0.48.pom (1.4 kB at 12 kB/s)
Downloading: http://maven.twttr.com/com/twitter/common/util-system-mocks/0.0.43/util-system-mocks-0.0.43.pom
Progress (1): 1.3 kB                    Downloaded: http://maven.twttr.com/com/twitter/common/util-system-mocks/0.0.43/util-system-mocks-0.0.43.pom (1.3 kB at 11 kB/s)
Downloading: http://maven.twttr.com/com/twitter/common/net-util/0.0.49/net-util-0.0.49.pom
Progress (1): 1.7 kBProgress (1): 2.0 kB                    Downloaded: http://maven.twttr.com/com/twitter/common/net-util/0.0.49/net-util-0.0.49.pom (2.0 kB at 17 kB/s)
Downloading: http://maven.twttr.com/com/google/inject/guice/3.0/guice-3.0.pom
Downloading: https://repo.maven.apache.org/maven2/com/google/inject/guice/3.0/guice-3.0.pom
Progress (1): 2.8/7.3 kBProgress (1): 5.5/7.3 kBProgress (1): 7.3 kB                        Downloaded: https://repo.maven.apache.org/maven2/com/google/inject/guice/3.0/guice-3.0.pom (7.3 kB at 485 kB/s)
Downloading: http://maven.twttr.com/com/google/inject/guice-parent/3.0/guice-parent-3.0.pom
Downloading: https://repo.maven.apache.org/maven2/com/google/inject/guice-parent/3.0/guice-parent-3.0.pom
Progress (1): 2.8/13 kBProgress (1): 5.5/13 kBProgress (1): 8.3/13 kBProgress (1): 11/13 kB Progress (1): 13 kB                      Downloaded: https://repo.maven.apache.org/maven2/com/google/inject/guice-parent/3.0/guice-parent-3.0.pom (13 kB at 865 kB/s)
Downloading: http://maven.twttr.com/com/google/google/5/google-5.pom
Downloading: https://repo.maven.apache.org/maven2/com/google/google/5/google-5.pom
Progress (1): 2.5 kB                    Downloaded: https://repo.maven.apache.org/maven2/com/google/google/5/google-5.pom (2.5 kB at 205 kB/s)
Downloading: http://maven.twttr.com/com/twitter/common/util-sampler/0.0.33/util-sampler-0.0.33.pom
Progress (1): 1.5 kB                    Downloaded: http://maven.twttr.com/com/twitter/common/util-sampler/0.0.33/util-sampler-0.0.33.pom (1.5 kB at 7.0 kB/s)
Downloading: http://maven.twttr.com/com/twitter/common/net-http-handlers/0.0.39/net-http-handlers-0.0.39.pom
Progress (1): 1.9 kBProgress (1): 2.9 kB                    Downloaded: http://maven.twttr.com/com/twitter/common/net-http-handlers/0.0.39/net-http-handlers-0.0.39.pom (2.9 kB at 24 kB/s)
Downloading: http://maven.twttr.com/com/twitter/common/net-http-handlers-text/0.0.20/net-http-handlers-text-0.0.20.pom
Progress (1): 1.1 kBProgress (1): 1.6 kB                    Downloaded: http://maven.twttr.com/com/twitter/common/net-http-handlers-text/0.0.20/net-http-handlers-text-0.0.20.pom (1.6 kB at 13 kB/s)
Downloading: http://maven.twttr.com/com/twitter/common/net-http-handlers-string-template/0.0.26/net-http-handlers-string-template-0.0.26.pom
Progress (1): 1.7 kBProgress (1): 2.0 kB                    Downloaded: http://maven.twttr.com/com/twitter/common/net-http-handlers-string-template/0.0.26/net-http-handlers-string-template-0.0.26.pom (2.0 kB at 17 kB/s)
Downloading: http://maven.twttr.com/com/twitter/common/base/0.0.45/base-0.0.45.pom
Progress (1): 1.6 kB                    Downloaded: http://maven.twttr.com/com/twitter/common/base/0.0.45/base-0.0.45.pom (1.6 kB at 14 kB/s)
Downloading: http://maven.twttr.com/com/twitter/common/quantity/0.0.35/quantity-0.0.35.pom
Progress (1): 1.3 kB                    Downloaded: http://maven.twttr.com/com/twitter/common/quantity/0.0.35/quantity-0.0.35.pom (1.3 kB at 11 kB/s)
Downloading: http://maven.twttr.com/com/twitter/common/collections/0.0.39/collections-0.0.39.pom
Progress (1): 1.4 kB                    Downloaded: http://maven.twttr.com/com/twitter/common/collections/0.0.39/collections-0.0.39.pom (1.4 kB at 12 kB/s)
Downloading: http://maven.twttr.com/com/twitter/common/util-system-mocks/0.0.34/util-system-mocks-0.0.34.pom
Progress (1): 1.1 kB                    Downloaded: http://maven.twttr.com/com/twitter/common/util-system-mocks/0.0.34/util-system-mocks-0.0.34.pom (1.1 kB at 9.0 kB/s)
Downloading: http://maven.twttr.com/com/twitter/common/util-templating/0.0.2/util-templating-0.0.2.pom
Progress (1): 1.4 kB                    Downloaded: http://maven.twttr.com/com/twitter/common/util-templating/0.0.2/util-templating-0.0.2.pom (1.4 kB at 12 kB/s)
Downloading: http://maven.twttr.com/org/antlr/stringtemplate/3.2.1/stringtemplate-3.2.1.pom
Downloading: https://repo.maven.apache.org/maven2/org/antlr/stringtemplate/3.2.1/stringtemplate-3.2.1.pom
Progress (1): 2.8/7.5 kBProgress (1): 5.5/7.5 kBProgress (1): 7.5 kB                        Downloaded: https://repo.maven.apache.org/maven2/org/antlr/stringtemplate/3.2.1/stringtemplate-3.2.1.pom (7.5 kB at 574 kB/s)
Downloading: http://maven.twttr.com/com/twitter/common/stats/0.0.51/stats-0.0.51.pom
Downloading: https://repo.maven.apache.org/maven2/com/twitter/common/stats/0.0.51/stats-0.0.51.pom
Downloading: http://maven.twttr.com/com/google/code/gson/gson/2.1/gson-2.1.pom
Downloading: https://repo.maven.apache.org/maven2/com/google/code/gson/gson/2.1/gson-2.1.pom
Progress (1): 2.8/10 kBProgress (1): 5.5/10 kBProgress (1): 8.3/10 kBProgress (1): 10 kB                       Downloaded: https://repo.maven.apache.org/maven2/com/google/code/gson/gson/2.1/gson-2.1.pom (10 kB at 646 kB/s)
Downloading: http://maven.twttr.com/org/sonatype/oss/oss-parent/5/oss-parent-5.pom
Downloading: https://repo.maven.apache.org/maven2/org/sonatype/oss/oss-parent/5/oss-parent-5.pom
Progress (1): 2.2/4.1 kBProgress (1): 4.1 kB                        Downloaded: https://repo.maven.apache.org/maven2/org/sonatype/oss/oss-parent/5/oss-parent-5.pom (4.1 kB at 314 kB/s)
Downloading: http://maven.twttr.com/com/twitter/common/stats-time-series/0.0.36/stats-time-series-0.0.36.pom
Progress (1): 1.8 kBProgress (1): 2.2 kB                    Downloaded: http://maven.twttr.com/com/twitter/common/stats-time-series/0.0.36/stats-time-series-0.0.36.pom (2.2 kB at 4.6 kB/s)
Downloading: http://maven.twttr.com/com/twitter/common/stat-registry/0.0.9/stat-registry-0.0.9.pom
Progress (1): 906 B                   Downloaded: http://maven.twttr.com/com/twitter/common/stat-registry/0.0.9/stat-registry-0.0.9.pom (906 B at 2.2 kB/s)
Downloading: http://maven.twttr.com/com/twitter/common/stat/0.0.9/stat-0.0.9.pom
Progress (1): 687 B                   Downloaded: http://maven.twttr.com/com/twitter/common/stat/0.0.9/stat-0.0.9.pom (687 B at 1.1 kB/s)
Downloading: http://maven.twttr.com/com/twitter/common/stats/0.0.59/stats-0.0.59.pom
Progress (1): 2.0 kBProgress (1): 2.5 kB                    Downloaded: http://maven.twttr.com/com/twitter/common/stats/0.0.59/stats-0.0.59.pom (2.5 kB at 12 kB/s)
Downloading: http://maven.twttr.com/com/twitter/common/stats-provider/0.0.33/stats-provider-0.0.33.pom
Progress (1): 1.3 kB                    Downloaded: http://maven.twttr.com/com/twitter/common/stats-provider/0.0.33/stats-provider-0.0.33.pom (1.3 kB at 5.1 kB/s)
Downloading: http://maven.twttr.com/com/twitter/common/stat/0.0.10/stat-0.0.10.pom
Progress (1): 688 B                   Downloaded: http://maven.twttr.com/com/twitter/common/stat/0.0.10/stat-0.0.10.pom (688 B at 2.8 kB/s)
Downloading: http://maven.twttr.com/com/twitter/common/application-action/0.0.40/application-action-0.0.40.pom
Progress (1): 1.8 kBProgress (1): 1.8 kB                    Downloaded: http://maven.twttr.com/com/twitter/common/application-action/0.0.40/application-action-0.0.40.pom (1.8 kB at 15 kB/s)
Downloading: http://maven.twttr.com/com/twitter/common/base/0.0.52/base-0.0.52.pom
Progress (1): 1.6 kB                    Downloaded: http://maven.twttr.com/com/twitter/common/base/0.0.52/base-0.0.52.pom (1.6 kB at 14 kB/s)
Downloading: http://maven.twttr.com/com/twitter/common/quantity/0.0.40/quantity-0.0.40.pom
Progress (1): 1.3 kB                    Downloaded: http://maven.twttr.com/com/twitter/common/quantity/0.0.40/quantity-0.0.40.pom (1.3 kB at 9.7 kB/s)
Downloading: http://maven.twttr.com/com/twitter/common/collections/0.0.44/collections-0.0.44.pom
Progress (1): 1.4 kB                    Downloaded: http://maven.twttr.com/com/twitter/common/collections/0.0.44/collections-0.0.44.pom (1.4 kB at 12 kB/s)
Downloading: http://maven.twttr.com/com/twitter/common/util-system-mocks/0.0.40/util-system-mocks-0.0.40.pom
Progress (1): 1.1 kB                    Downloaded: http://maven.twttr.com/com/twitter/common/util-system-mocks/0.0.40/util-system-mocks-0.0.40.pom (1.1 kB at 9.0 kB/s)
Downloading: http://maven.twttr.com/com/twitter/common/net-util/0.0.44/net-util-0.0.44.pom
Progress (1): 1.8 kBProgress (1): 1.8 kB                    Downloaded: http://maven.twttr.com/com/twitter/common/net-util/0.0.44/net-util-0.0.44.pom (1.8 kB at 15 kB/s)
Downloading: http://maven.twttr.com/com/twitter/common/util-sampler/0.0.31/util-sampler-0.0.31.pom
Progress (1): 1.3 kB                    Downloaded: http://maven.twttr.com/com/twitter/common/util-sampler/0.0.31/util-sampler-0.0.31.pom (1.3 kB at 10 kB/s)
Downloading: http://maven.twttr.com/com/twitter/common/stats-jvm/0.0.33/stats-jvm-0.0.33.pom
Progress (1): 1.1 kB                    Downloaded: http://maven.twttr.com/com/twitter/common/stats-jvm/0.0.33/stats-jvm-0.0.33.pom (1.1 kB at 9.0 kB/s)
Downloading: http://maven.twttr.com/com/twitter/common/stats/0.0.57/stats-0.0.57.pom
Progress (1): 2.0 kBProgress (1): 2.5 kB                    Downloaded: http://maven.twttr.com/com/twitter/common/stats/0.0.57/stats-0.0.57.pom (2.5 kB at 13 kB/s)
Downloading: http://maven.twttr.com/com/twitter/common/stat-registry/0.0.8/stat-registry-0.0.8.pom
Progress (1): 906 B                   Downloaded: http://maven.twttr.com/com/twitter/common/stat-registry/0.0.8/stat-registry-0.0.8.pom (906 B at 7.4 kB/s)
Downloading: http://maven.twttr.com/com/twitter/common/stat/0.0.8/stat-0.0.8.pom
Progress (1): 687 B                   Downloaded: http://maven.twttr.com/com/twitter/common/stat/0.0.8/stat-0.0.8.pom (687 B at 5.7 kB/s)
Downloading: http://maven.twttr.com/com/twitter/common/stats-provider/0.0.31/stats-provider-0.0.31.pom
Progress (1): 1.3 kB                    Downloaded: http://maven.twttr.com/com/twitter/common/stats-provider/0.0.31/stats-provider-0.0.31.pom (1.3 kB at 10 kB/s)
Downloading: http://maven.twttr.com/com/twitter/common/application-action/0.0.39/application-action-0.0.39.pom
Progress (1): 1.8 kBProgress (1): 1.8 kB                    Downloaded: http://maven.twttr.com/com/twitter/common/application-action/0.0.39/application-action-0.0.39.pom (1.8 kB at 15 kB/s)
Downloading: http://maven.twttr.com/com/twitter/common/base/0.0.51/base-0.0.51.pom
Progress (1): 1.6 kB                    Downloaded: http://maven.twttr.com/com/twitter/common/base/0.0.51/base-0.0.51.pom (1.6 kB at 14 kB/s)
Downloading: http://maven.twttr.com/com/twitter/common/quantity/0.0.39/quantity-0.0.39.pom
Progress (1): 1.3 kB                    Downloaded: http://maven.twttr.com/com/twitter/common/quantity/0.0.39/quantity-0.0.39.pom (1.3 kB at 11 kB/s)
Downloading: http://maven.twttr.com/com/twitter/common/collections/0.0.43/collections-0.0.43.pom
Progress (1): 1.4 kB                    Downloaded: http://maven.twttr.com/com/twitter/common/collections/0.0.43/collections-0.0.43.pom (1.4 kB at 12 kB/s)
Downloading: http://maven.twttr.com/com/twitter/common/util-system-mocks/0.0.39/util-system-mocks-0.0.39.pom
Progress (1): 1.1 kB                    Downloaded: http://maven.twttr.com/com/twitter/common/util-system-mocks/0.0.39/util-system-mocks-0.0.39.pom (1.1 kB at 8.9 kB/s)
Downloading: http://maven.twttr.com/com/twitter/common/net-util/0.0.43/net-util-0.0.43.pom
Progress (1): 1.8 kBProgress (1): 1.8 kB                    Downloaded: http://maven.twttr.com/com/twitter/common/net-util/0.0.43/net-util-0.0.43.pom (1.8 kB at 15 kB/s)
Downloading: http://maven.twttr.com/com/twitter/common/util-sampler/0.0.30/util-sampler-0.0.30.pom
Progress (1): 1.3 kB                    Downloaded: http://maven.twttr.com/com/twitter/common/util-sampler/0.0.30/util-sampler-0.0.30.pom (1.3 kB at 10.0 kB/s)
Downloading: http://maven.twttr.com/org/eclipse/jetty/jetty-server/9.4.5.v20170502/jetty-server-9.4.5.v20170502.pom
Downloading: https://repo.maven.apache.org/maven2/org/eclipse/jetty/jetty-server/9.4.5.v20170502/jetty-server-9.4.5.v20170502.pom
Progress (1): 2.2/2.6 kBProgress (1): 2.6 kB                        Downloaded: https://repo.maven.apache.org/maven2/org/eclipse/jetty/jetty-server/9.4.5.v20170502/jetty-server-9.4.5.v20170502.pom (2.6 kB at 160 kB/s)
Downloading: http://maven.twttr.com/org/eclipse/jetty/jetty-project/9.4.5.v20170502/jetty-project-9.4.5.v20170502.pom
Downloading: https://repo.maven.apache.org/maven2/org/eclipse/jetty/jetty-project/9.4.5.v20170502/jetty-project-9.4.5.v20170502.pom
Progress (1): 2.8/54 kBProgress (1): 5.5/54 kBProgress (1): 8.3/54 kBProgress (1): 11/54 kB Progress (1): 14/54 kBProgress (1): 16/54 kBProgress (1): 19/54 kBProgress (1): 22/54 kBProgress (1): 25/54 kBProgress (1): 27/54 kBProgress (1): 30/54 kBProgress (1): 33/54 kBProgress (1): 37/54 kBProgress (1): 41/54 kBProgress (1): 45/54 kBProgress (1): 49/54 kBProgress (1): 53/54 kBProgress (1): 54 kB                      Downloaded: https://repo.maven.apache.org/maven2/org/eclipse/jetty/jetty-project/9.4.5.v20170502/jetty-project-9.4.5.v20170502.pom (54 kB at 2.5 MB/s)
Downloading: http://maven.twttr.com/javax/servlet/javax.servlet-api/3.1.0/javax.servlet-api-3.1.0.pom
Downloading: https://repo.maven.apache.org/maven2/javax/servlet/javax.servlet-api/3.1.0/javax.servlet-api-3.1.0.pom
Progress (1): 2.8/14 kBProgress (1): 5.5/14 kBProgress (1): 8.3/14 kBProgress (1): 11/14 kB Progress (1): 14 kB                      Downloaded: https://repo.maven.apache.org/maven2/javax/servlet/javax.servlet-api/3.1.0/javax.servlet-api-3.1.0.pom (14 kB at 845 kB/s)
Downloading: http://maven.twttr.com/net/java/jvnet-parent/3/jvnet-parent-3.pom
Downloading: https://repo.maven.apache.org/maven2/net/java/jvnet-parent/3/jvnet-parent-3.pom
Progress (1): 2.8/4.8 kBProgress (1): 4.8 kB                        Downloaded: https://repo.maven.apache.org/maven2/net/java/jvnet-parent/3/jvnet-parent-3.pom (4.8 kB at 368 kB/s)
Downloading: http://maven.twttr.com/org/eclipse/jetty/jetty-http/9.4.5.v20170502/jetty-http-9.4.5.v20170502.pom
Downloading: https://repo.maven.apache.org/maven2/org/eclipse/jetty/jetty-http/9.4.5.v20170502/jetty-http-9.4.5.v20170502.pom
Progress (1): 2.7 kB                    Downloaded: https://repo.maven.apache.org/maven2/org/eclipse/jetty/jetty-http/9.4.5.v20170502/jetty-http-9.4.5.v20170502.pom (2.7 kB at 228 kB/s)
Downloading: http://maven.twttr.com/org/eclipse/jetty/jetty-util/9.4.5.v20170502/jetty-util-9.4.5.v20170502.pom
Downloading: https://repo.maven.apache.org/maven2/org/eclipse/jetty/jetty-util/9.4.5.v20170502/jetty-util-9.4.5.v20170502.pom
Progress (1): 2.1 kB                    Downloaded: https://repo.maven.apache.org/maven2/org/eclipse/jetty/jetty-util/9.4.5.v20170502/jetty-util-9.4.5.v20170502.pom (2.1 kB at 173 kB/s)
Downloading: http://maven.twttr.com/org/eclipse/jetty/jetty-io/9.4.5.v20170502/jetty-io-9.4.5.v20170502.pom
Downloading: https://repo.maven.apache.org/maven2/org/eclipse/jetty/jetty-io/9.4.5.v20170502/jetty-io-9.4.5.v20170502.pom
Progress (1): 1.3 kB                    Downloaded: https://repo.maven.apache.org/maven2/org/eclipse/jetty/jetty-io/9.4.5.v20170502/jetty-io-9.4.5.v20170502.pom (1.3 kB at 108 kB/s)
Downloading: http://maven.twttr.com/org/eclipse/jetty/jetty-servlet/9.4.5.v20170502/jetty-servlet-9.4.5.v20170502.pom
Downloading: https://repo.maven.apache.org/maven2/org/eclipse/jetty/jetty-servlet/9.4.5.v20170502/jetty-servlet-9.4.5.v20170502.pom
Progress (1): 2.1 kB                    Downloaded: https://repo.maven.apache.org/maven2/org/eclipse/jetty/jetty-servlet/9.4.5.v20170502/jetty-servlet-9.4.5.v20170502.pom (2.1 kB at 152 kB/s)
Downloading: http://maven.twttr.com/org/eclipse/jetty/jetty-security/9.4.5.v20170502/jetty-security-9.4.5.v20170502.pom
Downloading: https://repo.maven.apache.org/maven2/org/eclipse/jetty/jetty-security/9.4.5.v20170502/jetty-security-9.4.5.v20170502.pom
Progress (1): 2.0 kB                    Downloaded: https://repo.maven.apache.org/maven2/org/eclipse/jetty/jetty-security/9.4.5.v20170502/jetty-security-9.4.5.v20170502.pom (2.0 kB at 155 kB/s)
2018-09-10\T\14:31:12.813 [INFO] ------------------------------------------------------------------------
2018-09-10\T\14:31:12.813 [INFO] Reactor Summary:
2018-09-10\T\14:31:12.813 [INFO] 
2018-09-10\T\14:31:12.814 [INFO] Apache BookKeeper :: Parent ........................ SUCCESS [ 11.253 s]
2018-09-10\T\14:31:12.814 [INFO] Apache BookKeeper :: Build Tools ................... SUCCESS [ 13.924 s]
2018-09-10\T\14:31:12.814 [INFO] Apache BookKeeper :: Circe Checksum Library ........ SUCCESS [01:03 min]
2018-09-10\T\14:31:12.814 [INFO] Apache BookKeeper :: Stats API ..................... SUCCESS [ 22.644 s]
2018-09-10\T\14:31:12.814 [INFO] Apache BookKeeper :: Common ........................ SUCCESS [ 38.161 s]
2018-09-10\T\14:31:12.814 [INFO] Apache BookKeeper :: Protocols ..................... SUCCESS [ 19.103 s]
2018-09-10\T\14:31:12.815 [INFO] Apache BookKeeper :: Tools :: Parent ............... SUCCESS [  4.960 s]
2018-09-10\T\14:31:12.815 [INFO] Apache BookKeeper :: Tools :: Framework ............ SUCCESS [ 13.778 s]
2018-09-10\T\14:31:12.815 [INFO] Apache BookKeeper :: Http :: Http Server ........... SUCCESS [ 11.979 s]
2018-09-10\T\14:31:12.815 [INFO] Apache BookKeeper :: Server ........................ SUCCESS [  01:40 h]
2018-09-10\T\14:31:12.815 [INFO] Apache BookKeeper :: Benchmark ..................... SUCCESS [01:53 min]
2018-09-10\T\14:31:12.815 [INFO] Apache BookKeeper :: Stats Providers :: Twitter Finagle Stats SUCCESS [ 16.100 s]
2018-09-10\T\14:31:12.815 [INFO] Apache BookKeeper :: Stats Providers :: Twitter Science Stats FAILURE [  9.819 s]
2018-09-10\T\14:31:12.815 [INFO] Apache BookKeeper :: Stats Providers :: Twitter Ostrich Stats SKIPPED
2018-09-10\T\14:31:12.815 [INFO] Apache BookKeeper :: Stats Providers :: Codahale Metrics SKIPPED
2018-09-10\T\14:31:12.815 [INFO] Apache BookKeeper :: Stats Providers :: Prometheus . SKIPPED
2018-09-10\T\14:31:12.815 [INFO] Apache BookKeeper :: Stats Providers ............... SKIPPED
2018-09-10\T\14:31:12.815 [INFO] Apache BookKeeper :: Bookkeeper Http :: Twitter Http Server SKIPPED
2018-09-10\T\14:31:12.816 [INFO] Apache BookKeeper :: Bookkeeper Http :: Vertx Http Server SKIPPED
2018-09-10\T\14:31:12.816 [INFO] Apache BookKeeper :: Http .......................... SKIPPED
2018-09-10\T\14:31:12.816 [INFO] Apache BookKeeper :: Shaded :: Parent .............. SKIPPED
2018-09-10\T\14:31:12.816 [INFO] Apache BookKeeper :: Shaded :: bookkeeper-server-shaded SKIPPED
2018-09-10\T\14:31:12.816 [INFO] Apache BookKeeper :: Shaded :: bookkeeper-server-tests-shaded SKIPPED
2018-09-10\T\14:31:12.816 [INFO] Apache BookKeeper :: DistributedLog :: Parent ...... SKIPPED
2018-09-10\T\14:31:12.816 [INFO] Apache BookKeeper :: DistributedLog :: Common ...... SKIPPED
2018-09-10\T\14:31:12.816 [INFO] Apache BookKeeper :: DistributedLog :: Protocol .... SKIPPED
2018-09-10\T\14:31:12.816 [INFO] Apache BookKeeper :: DistributedLog :: Core Library  SKIPPED
2018-09-10\T\14:31:12.816 [INFO] Apache BookKeeper :: Shaded :: distributedlog-core-shaded SKIPPED
2018-09-10\T\14:31:12.816 [INFO] Apache BookKeeper :: Tests ......................... SKIPPED
2018-09-10\T\14:31:12.816 [INFO] Apache BookKeeper :: Tests :: Test Shaded Jars ..... SKIPPED
2018-09-10\T\14:31:12.816 [INFO] Apache BookKeeper :: Tests :: bookkeeper-server-shaded test SKIPPED
2018-09-10\T\14:31:12.816 [INFO] Apache BookKeeper :: Tests :: bookkeeper-server-tests-shaded test SKIPPED
2018-09-10\T\14:31:12.816 [INFO] Apache BookKeeper :: Tests :: distributedlog-core-shaded test SKIPPED
2018-09-10\T\14:31:12.816 [INFO] Apache BookKeeper :: Tests :: Docker Images ........ SKIPPED
2018-09-10\T\14:31:12.816 [INFO] Apache BookKeeper :: Tests :: Docker Images :: All Released Versions SKIPPED
2018-09-10\T\14:31:12.816 [INFO] Apache BookKeeper :: Stream Storage :: Parent ...... SKIPPED
2018-09-10\T\14:31:12.816 [INFO] Apache BookKeeper :: Stream Storage :: Common Classes for Tests SKIPPED
2018-09-10\T\14:31:12.816 [INFO] Apache BookKeeper :: Stream Storage :: Common ...... SKIPPED
2018-09-10\T\14:31:12.817 [INFO] Apache BookKeeper :: Stream Storage :: API ......... SKIPPED
2018-09-10\T\14:31:12.817 [INFO] Apache BookKeeper :: Stream Storage :: Proto ....... SKIPPED
2018-09-10\T\14:31:12.817 [INFO] Apache BookKeeper :: Stream Storage :: Clients :: Parent SKIPPED
2018-09-10\T\14:31:12.817 [INFO] Apache BookKeeper :: Stream Storage :: Clients :: Java Client :: Parent SKIPPED
2018-09-10\T\14:31:12.817 [INFO] Apache BookKeeper :: Stream Storage :: Clients :: Java Client :: Base SKIPPED
2018-09-10\T\14:31:12.817 [INFO] Apache BookKeeper :: Stream Storage :: Clients :: Java Client :: KV SKIPPED
2018-09-10\T\14:31:12.817 [INFO] Apache BookKeeper :: Stream Storage :: Clients :: Java Client SKIPPED
2018-09-10\T\14:31:12.817 [INFO] Apache BookKeeper :: Stream Storage :: Storage :: Parent SKIPPED
2018-09-10\T\14:31:12.817 [INFO] Apache BookKeeper :: Stream Storage :: Storage :: Api SKIPPED
2018-09-10\T\14:31:12.817 [INFO] Apache BookKeeper :: Stream Storage :: State Library SKIPPED
2018-09-10\T\14:31:12.817 [INFO] Apache BookKeeper :: Stream Storage :: Storage :: Impl SKIPPED
2018-09-10\T\14:31:12.817 [INFO] Apache BookKeeper :: Tools :: Stream ............... SKIPPED
2018-09-10\T\14:31:12.817 [INFO] Apache BookKeeper :: Tools ......................... SKIPPED
2018-09-10\T\14:31:12.817 [INFO] Apache BookKeeper :: Stream Storage :: Server ...... SKIPPED
2018-09-10\T\14:31:12.817 [INFO] Apache BookKeeper :: Dist (Parent) ................. SKIPPED
2018-09-10\T\14:31:12.817 [INFO] Apache BookKeeper :: Dist (Server) ................. SKIPPED
2018-09-10\T\14:31:12.817 [INFO] Apache BookKeeper :: Tests :: Docker Images :: All Versions SKIPPED
2018-09-10\T\14:31:12.817 [INFO] Apache BookKeeper :: Tests :: Docker Images :: Current Version SKIPPED
2018-09-10\T\14:31:12.817 [INFO] Apache BookKeeper :: Tests :: Utility module for Arquillian based integration tests SKIPPED
2018-09-10\T\14:31:12.818 [INFO] Apache BookKeeper :: Tests :: Common topologies for Docker based integration tests SKIPPED
2018-09-10\T\14:31:12.818 [INFO] Apache BookKeeper :: Tests :: Base module for Arquillian based integration tests SKIPPED
2018-09-10\T\14:31:12.818 [INFO] Apache BookKeeper :: Tests :: Base module for Arquillian based integration tests using groovy SKIPPED
2018-09-10\T\14:31:12.818 [INFO] Apache BookKeeper :: Tests :: Backward Compatibility SKIPPED
2018-09-10\T\14:31:12.818 [INFO] Apache BookKeeper :: Tests :: Backward Compatibility :: Test upgrade between all released versions and current version SKIPPED
2018-09-10\T\14:31:12.818 [INFO] Apache BookKeeper :: Tests :: Backward Compatibility :: Test upgrade between 4.1.0 and current version SKIPPED
2018-09-10\T\14:31:12.818 [INFO] Apache BookKeeper :: Tests :: Backward Compatibility :: Test compat between old version and new version of hierarchical ledger manager SKIPPED
2018-09-10\T\14:31:12.818 [INFO] Apache BookKeeper :: Tests :: Backward Compatibility :: Test upgrade between 4.1.0 and current version (with hostname bookie ID) SKIPPED
2018-09-10\T\14:31:12.818 [INFO] Apache BookKeeper :: Tests :: Backward Compatibility :: Test recovery does not work when password no in metadata SKIPPED
2018-09-10\T\14:31:12.818 [INFO] Apache BookKeeper :: Tests :: Backward Compatibility :: Test upgrade 4.1.0 to current in cluster with cookies SKIPPED
2018-09-10\T\14:31:12.818 [INFO] Apache BookKeeper :: Tests :: Backward Compatibility :: Test old clients working on current server SKIPPED
2018-09-10\T\14:31:12.818 [INFO] Apache BookKeeper :: Tests :: Backward Compatibility :: Test upgrade between yahoo custom version and current SKIPPED
2018-09-10\T\14:31:12.818 [INFO] Apache BookKeeper :: Tests :: Integration .......... SKIPPED
2018-09-10\T\14:31:12.818 [INFO] Apache BookKeeper :: Tests :: Integration :: Smoke test SKIPPED
2018-09-10\T\14:31:12.818 [INFO] Apache BookKeeper :: Tests :: Integration :: Standalone test SKIPPED
2018-09-10\T\14:31:12.818 [INFO] Apache BookKeeper :: Tests :: Integration :: Cluster test SKIPPED
2018-09-10\T\14:31:12.818 [INFO] Apache BookKeeper :: Tests :: Bash Scripts Test .... SKIPPED
2018-09-10\T\14:31:12.818 [INFO] Apache BookKeeper :: Dist (All) .................... SKIPPED
2018-09-10\T\14:31:12.818 [INFO] Apache BookKeeper :: microbenchmarks ............... SKIPPED
2018-09-10\T\14:31:12.818 [INFO] Apache BookKeeper :: DistributedLog :: IO :: FileSystem SKIPPED
2018-09-10\T\14:31:12.819 [INFO] Apache BookKeeper :: DistributedLog :: IO .......... SKIPPED
2018-09-10\T\14:31:12.819 [INFO] ------------------------------------------------------------------------
2018-09-10\T\14:31:12.819 [INFO] BUILD FAILURE
2018-09-10\T\14:31:12.819 [INFO] ------------------------------------------------------------------------
2018-09-10\T\14:31:12.819 [INFO] Total time: 01:46 h
2018-09-10\T\14:31:12.819 [INFO] Finished at: 2018-09-10T14:31:12Z
2018-09-10\T\14:31:13.412 [INFO] Final Memory: 87M/3021M
2018-09-10\T\14:31:13.413 [INFO] ------------------------------------------------------------------------
2018-09-10\T\14:31:13.418 [ERROR] Failed to execute goal on project twitter-science-provider: Could not resolve dependencies for project org.apache.bookkeeper.stats:twitter-science-provider:jar:4.9.0-SNAPSHOT: Failed to collect dependencies at com.twitter.common:net-http-handlers:jar:0.0.39 -> com.twitter.common:stats:jar:0.0.51: Failed to read artifact descriptor for com.twitter.common:stats:jar:0.0.51: Could not transfer artifact com.twitter.common:stats:pom:0.0.51 from/to twitter (http://maven.twttr.com): sun.security.validator.ValidatorException: PKIX path validation failed: java.security.cert.CertPathValidatorException: validity check failed: NotAfter: Wed May 23 12:00:00 UTC 2018 -> [Help 1]
2018-09-10\T\14:31:13.418 [ERROR] 
2018-09-10\T\14:31:13.418 [ERROR] To see the full stack trace of the errors, re-run Maven with the -e switch.
2018-09-10\T\14:31:13.418 [ERROR] Re-run Maven using the -X switch to enable full debug logging.
2018-09-10\T\14:31:13.418 [ERROR] 
2018-09-10\T\14:31:13.418 [ERROR] For more information about the errors and possible solutions, please read the following articles:
2018-09-10\T\14:31:13.418 [ERROR] [Help 1] http://cwiki.apache.org/confluence/display/MAVEN/DependencyResolutionException
2018-09-10\T\14:31:13.418 [ERROR] 
2018-09-10\T\14:31:13.418 [ERROR] After correcting the problems, you can resume the build with the command
2018-09-10\T\14:31:13.418 [ERROR]   mvn <goals> -rf :twitter-science-provider
Build step 'Invoke top-level Maven targets' marked build as failure

Jenkins build is back to normal : bookkeeper_release_nightly_snapshot #121

Posted by Apache Jenkins Server <je...@builds.apache.org>.
See <https://builds.apache.org/job/bookkeeper_release_nightly_snapshot/121/display/redirect?page=changes>