You are viewing a plain text version of this content. The canonical link for it is here.
Posted to dev@poi.apache.org by Apache Jenkins Server <je...@builds.apache.org> on 2024/05/26 01:13:06 UTC
Build failed in Jenkins: POI » POI-XMLBeans-DSL-1.23 #11
See <https://ci-builds.apache.org/job/POI/job/POI-XMLBeans-DSL-1.23/11/display/redirect>
Changes:
------------------------------------------
[...truncated 168.34 KB...]
A test/perf/bin/svn.bat
AU test/perf/bin/v2.bat
A test/perf/bin/parsers.bat
A test/perf/bin/run_jaxb2.bat
A test/perf/bin/run_all.bat
A test/perf/bin/run_all_nonmemory.bat
A test/perf/bin/jaxb2.bat
A test/perf/bin/xerces.sh
A test/perf/bin/castor.sh
A test/perf/bin/jaxb.bat
A test/perf/bin/run_xmlbeans_all.bat
A test/perf/bin/jaxb.sh
A test/perf/bin/xerces.bat
AU test/perf/bin/castor.bat
A test/perf/bin/run_xmlbeans_nonmemory.bat
A test/perf/bin/run_svn.bat
A test/perf/bin/run_svn_nonmemory.bat
A test/perf/bin/run_svn.sh
A test/perf/bin/run_v1_nonmemory.bat
A test/perf/bin/run_v2_nonmemory.bat
A test/perf/bin/run_xerces_nonmemory.bat
A test/perf/bin/run_all.sh
A test/perf/bin/run_v2.sh
A test/perf/bin/run_v1.bat
A test/perf/bin/run_v2.bat
A test/perf/bin/run_jaxb.sh
A test/perf/bin/run_xerces.bat
A test/perf/bin/run_v1.sh
A test/perf/bin/run_castor.bat
A test/perf/bin/run_xerces.sh
A test/perf/bin/run_castor.sh
A test/perf/bin/run_jaxb.bat
A test/perf/bin/v1.sh
A test/perf/bin/jibx.sh
A test/perf/bin/run_jibx.bat
AU test/perf/bin/v1.bat
AU test/perf/bin/jibx.bat
A test/perf/bin/castor.properties
A test/perf/bin/run_jibx.sh
A test/perf/download.properties
A test/perf/cases
AU test/perf/cases/parser_instances.zip
A test/perf/cases/xsd
A test/perf/cases/xsd/non-primitives.xsd
A test/perf/cases/xsd/purchase-order-1.xml
A test/perf/cases/xsd/purchase-order.xsd
A test/perf/cases/xsd/purchase-order-2.xml
A test/perf/cases/xsd/purchase-order-3.xml
A test/perf/cases/xsd/doc.xsd
A test/perf/cases/xsd/purchase-order-4.xml
A test/perf/cases/xsd/purchase-order-5.xml
A test/perf/cases/xsd/purchase-order-6.xml
A test/perf/cases/xsd/purchase-order-7.xml
A test/perf/cases/xsd/purchase-order-jibxbinding.xml
A test/perf/cases/xsd/perf-results.xsd
A test/perf/cases/xsd/primitives.xsd
A test/perf/results.xml
AU test/perf/env.sh
AU test/perf/env.bat
A test/docs
AU test/docs/BuildingAndRunningTests.txt
AU test/docs/TestOrganization.txt
AU test/readme.txt
AU STATUS
A .github
A .github/workflows
A .github/workflows/test-gradle.yml
A .github/workflows/codeql-analysis.yml
A wrapper.gradle
AU NOTICE.txt
AU NOTICE-binary.txt
A legal
A legal/HEADER
A settings.gradle
A SECURITY.md
A CHANGES.txt
A .gitignore
AU xbeanenv.sh
AU xbeanenv.cmd
U .
At revision 1917964
ERROR: Not all environment variables could be successfully injected. Check for similarly-named environment variables.
[POI-XMLBeans-DSL-1.23] $ /bin/sh -xe /tmp/jenkins12026417523330278051.sh
+ rm -rf examples excelant integrationtest main ooxml ooxml-schema scratchpad build.javacheck.xml
+ svn status
+ svn revert poi*/src/*/java9/module-info.*
svn: E155010: The node '<https://ci-builds.apache.org/job/POI/job/POI-XMLBeans-DSL-1.23/ws/poi*/src/*'> was not found.
+ true
+ svn revert src/resources/ooxml-lite-report.*
Skipped 'src/resources/ooxml-lite-report.*'
+ echo Java-Home: /home/jenkins/tools/java/latest23
Java-Home: /home/jenkins/tools/java/latest23
+ ls -al /home/jenkins/tools/java/latest23/
total 52
drwxr-xr-x 8 root root 4096 Feb 8 19:42 .
drwxrwxr-x 40 root root 4096 Apr 12 16:59 ..
drwxr-xr-x 2 root root 4096 Feb 8 19:42 bin
drwxr-xr-x 5 root root 4096 Feb 8 19:42 conf
drwxr-xr-x 3 root root 4096 Feb 8 19:42 include
drwxr-xr-x 2 root root 12288 Feb 8 19:42 jmods
drwxr-xr-x 71 root root 4096 Jan 26 21:42 legal
drwxr-xr-x 5 root root 12288 Feb 8 19:42 lib
-rw-r--r-- 1 root root 1206 Jan 25 10:26 release
+ ls -al /home/jenkins/tools/java/latest23/bin
total 472
drwxr-xr-x 2 root root 4096 Feb 8 19:42 .
drwxr-xr-x 8 root root 4096 Feb 8 19:42 ..
-rwxr-xr-x 1 root root 12384 Jan 25 10:26 jar
-rwxr-xr-x 1 root root 12392 Jan 25 10:26 jarsigner
-rwxr-xr-x 1 root root 12328 Jan 25 10:26 java
-rwxr-xr-x 1 root root 12416 Jan 25 10:26 javac
-rwxr-xr-x 1 root root 12424 Jan 25 10:26 javadoc
-rwxr-xr-x 1 root root 12384 Jan 25 10:26 javap
-rwxr-xr-x 1 root root 12384 Jan 25 10:26 jcmd
-rwxr-xr-x 1 root root 12456 Jan 25 10:26 jconsole
-rwxr-xr-x 1 root root 12384 Jan 25 10:26 jdb
-rwxr-xr-x 1 root root 12392 Jan 25 10:26 jdeprscan
-rwxr-xr-x 1 root root 12384 Jan 25 10:26 jdeps
-rwxr-xr-x 1 root root 12384 Jan 25 10:26 jfr
-rwxr-xr-x 1 root root 12384 Jan 25 10:26 jhsdb
-rwxr-xr-x 1 root root 12392 Jan 25 10:26 jimage
-rwxr-xr-x 1 root root 12416 Jan 25 10:26 jinfo
-rwxr-xr-x 1 root root 12416 Jan 25 10:26 jlink
-rwxr-xr-x 1 root root 12416 Jan 25 10:26 jmap
-rwxr-xr-x 1 root root 12384 Jan 25 10:26 jmod
-rwxr-xr-x 1 root root 12392 Jan 25 10:26 jpackage
-rwxr-xr-x 1 root root 12384 Jan 25 10:26 jps
-rwxr-xr-x 1 root root 12424 Jan 25 10:26 jrunscript
-rwxr-xr-x 1 root root 12392 Jan 25 10:26 jshell
-rwxr-xr-x 1 root root 12424 Jan 25 10:26 jstack
-rwxr-xr-x 1 root root 12384 Jan 25 10:26 jstat
-rwxr-xr-x 1 root root 12392 Jan 25 10:26 jstatd
-rwxr-xr-x 1 root root 12392 Jan 25 10:26 jwebserver
-rwxr-xr-x 1 root root 12392 Jan 25 10:26 keytool
-rwxr-xr-x 1 root root 12416 Jan 25 10:26 rmiregistry
-rwxr-xr-x 1 root root 12392 Jan 25 10:26 serialver
+ /home/jenkins/tools/java/latest23/bin/java -version
openjdk version "23-ea" 2024-09-17
OpenJDK Runtime Environment (build 23-ea+7-481)
OpenJDK 64-Bit Server VM (build 23-ea+7-481, mixed mode, sharing)
+ echo which java
which java
+ which java
/home/jenkins/tools/java/latest23/bin/java
+ java -version
openjdk version "23-ea" 2024-09-17
OpenJDK Runtime Environment (build 23-ea+7-481)
OpenJDK 64-Bit Server VM (build 23-ea+7-481, mixed mode, sharing)
+ echo which javac
which javac
+ which javac
/home/jenkins/tools/java/latest23/bin/javac
+ javac -version
javac 23-ea
+ echo Ant-Home:
Ant-Home:
+ ls -al
total 416
drwxr-xr-x 10 jenkins jenkins 4096 May 26 01:12 .
drwxr-xr-x 7 jenkins jenkins 4096 May 22 09:49 ..
-rw-r--r-- 1 jenkins jenkins 28782 May 26 01:12 build.gradle
-rw-r--r-- 1 jenkins jenkins 54152 May 26 01:12 build.xml
-rw-r--r-- 1 jenkins jenkins 11963 May 26 01:12 CHANGES.txt
drwxr-xr-x 3 jenkins jenkins 4096 May 26 01:12 .github
-rw-r--r-- 1 jenkins jenkins 14 May 26 01:12 .gitignore
drwxr-xr-x 3 jenkins jenkins 4096 May 26 01:12 gradle
-rw-r--r-- 1 jenkins jenkins 1329 May 26 01:12 gradle.properties
-rwxr-xr-x 1 jenkins jenkins 9177 May 26 01:12 gradlew
-rw-r--r-- 1 jenkins jenkins 176588 May 26 01:12 KEYS
drwxr-xr-x 2 jenkins jenkins 4096 May 26 01:12 legal
-rwxr-xr-x 1 jenkins jenkins 12460 May 26 01:12 LICENSE-binary.txt
-rwxr-xr-x 1 jenkins jenkins 15242 May 26 01:12 LICENSE.txt
-rw-r--r-- 1 jenkins jenkins 2561 May 26 01:12 NOTICE-binary.txt
-rw-r--r-- 1 jenkins jenkins 1592 May 26 01:12 NOTICE.txt
-rw-r--r-- 1 jenkins jenkins 2227 May 26 01:12 README.txt
-rw-r--r-- 1 jenkins jenkins 11023 May 26 01:12 release-guide.txt
drwxr-xr-x 16 jenkins jenkins 4096 May 26 01:12 samples
-rw-r--r-- 1 jenkins jenkins 238 May 26 01:12 SECURITY.md
-rw-r--r-- 1 jenkins jenkins 661 May 26 01:12 settings.gradle
drwxr-xr-x 4 jenkins jenkins 4096 May 26 01:12 src
-rw-r--r-- 1 jenkins jenkins 359 May 26 01:12 STATUS
drwxr-xr-x 4 jenkins jenkins 4096 May 26 01:12 .svn
drwxr-xr-x 4 jenkins jenkins 4096 May 26 01:12 test
-rw-r--r-- 1 jenkins jenkins 3803 May 26 01:12 wrapper.gradle
-rw-r--r-- 1 jenkins jenkins 25 May 26 01:12 xbeanenv.cmd
-rwxr-xr-x 1 jenkins jenkins 27 May 26 01:12 xbeanenv.sh
drwxr-xr-x 2 jenkins jenkins 4096 May 26 01:12 xkit
+ echo which ant
which ant
+ which ant
/usr/bin/ant
+ ant -version
Apache Ant(TM) version 1.10.12 compiled on January 17 1970
+ echo <project default="test"><target name="test"><echo>Java ${ant.java.version}/${java.version}</echo><exec executable="javac"><arg value="-version"/></exec></target></project>
+ ant -f build.javacheck.xml -v
Apache Ant(TM) version 1.10.12 compiled on January 17 1970
Buildfile: <https://ci-builds.apache.org/job/POI/job/POI-XMLBeans-DSL-1.23/ws/build.javacheck.xml>
Detected Java version: 23 in: /usr/local/asfpackages/java/openjdk-23-ea+7
Detected OS: Linux
parsing buildfile <https://ci-builds.apache.org/job/POI/job/POI-XMLBeans-DSL-1.23/ws/build.javacheck.xml> with URI = <https://ci-builds.apache.org/job/POI/job/POI-XMLBeans-DSL-1.23/ws/build.javacheck.xml>
Project base dir set to: <https://ci-builds.apache.org/job/POI/job/POI-XMLBeans-DSL-1.23/ws/>
Build sequence for target(s) `test' is [test]
Complete build sequence is [test, ]
test:
parsing buildfile jar:file:/usr/share/ant/lib/ant.jar!/org/apache/tools/ant/antlib.xml with URI = jar:file:/usr/share/ant/lib/ant.jar!/org/apache/tools/ant/antlib.xml from a zip file
[echo] Java 23/23-ea
[exec] Current OS is Linux
[exec] Executing 'javac' with arguments:
[exec] '-version'
[exec]
[exec] The ' characters around the executable and arguments are
[exec] not part of the command.
[exec] javac 23-ea
BUILD SUCCESSFUL
Total time: 0 seconds
+ exit 0
[Gradle] - Launching build.
ERROR: Not all environment variables could be successfully injected. Check for similarly-named environment variables.
[POI-XMLBeans-DSL-1.23] $ <https://ci-builds.apache.org/job/POI/job/POI-XMLBeans-DSL-1.23/ws/gradlew> clean jenkins jacocoTestReport
To honour the JVM settings for this build a single-use Daemon process will be forked. For more on this, please refer to https://docs.gradle.org/8.7/userguide/gradle_daemon.html#sec:disabling_the_daemon in the Gradle documentation.
Daemon will be stopped at the end of the build
Configuration on demand is an incubating feature.
FAILURE: Build failed with an exception.
* What went wrong:
BUG! exception in phase 'semantic analysis' in source unit '_BuildScript_' Unsupported class file major version 67
> Unsupported class file major version 67
* Try:
> Run with --stacktrace option to get the stack trace.
> Run with --info or --debug option to get more log output.
> Run with --scan to get full insights.
> Get more help at https://help.gradle.org.
BUILD FAILED in 4s
Build step 'Invoke Gradle script' changed build result to FAILURE
Build step 'Invoke Gradle script' marked build as failure
ERROR: Not all environment variables could be successfully injected. Check for similarly-named environment variables.
Archiving artifacts
ERROR: Not all environment variables could be successfully injected. Check for similarly-named environment variables.
Recording test results
ERROR: Not all environment variables could be successfully injected. Check for similarly-named environment variables.
ERROR: Step ‘Publish JUnit test result report’ failed: No test report files were found. Configuration error?
[SpotBugs] Skipping execution of recorder since overall result is 'FAILURE'
ERROR: Not all environment variables could be successfully injected. Check for similarly-named environment variables.
---------------------------------------------------------------------
To unsubscribe, e-mail: dev-unsubscribe@poi.apache.org
For additional commands, e-mail: dev-help@poi.apache.org
Build failed in Jenkins: POI » POI-XMLBeans-DSL-1.23 #12
Posted by Apache Jenkins Server <je...@builds.apache.org>.
See <https://ci-builds.apache.org/job/POI/job/POI-XMLBeans-DSL-1.23/12/display/redirect?page=changes>
Changes:
[PJ Fanning] snapshot version
------------------------------------------
[...truncated 168.34 KB...]
AU test/perf/bin/v2.bat
A test/perf/bin/parsers.bat
A test/perf/bin/run_jaxb2.bat
A test/perf/bin/run_all.bat
A test/perf/bin/run_all_nonmemory.bat
A test/perf/bin/jaxb2.bat
A test/perf/bin/xerces.sh
A test/perf/bin/castor.sh
A test/perf/bin/jaxb.bat
A test/perf/bin/run_xmlbeans_all.bat
A test/perf/bin/jaxb.sh
A test/perf/bin/xerces.bat
AU test/perf/bin/castor.bat
A test/perf/bin/run_xmlbeans_nonmemory.bat
A test/perf/bin/run_svn.bat
A test/perf/bin/run_svn_nonmemory.bat
A test/perf/bin/run_svn.sh
A test/perf/bin/run_v1_nonmemory.bat
A test/perf/bin/run_v2_nonmemory.bat
A test/perf/bin/run_xerces_nonmemory.bat
A test/perf/bin/run_all.sh
A test/perf/bin/run_v2.sh
A test/perf/bin/run_v1.bat
A test/perf/bin/run_v2.bat
A test/perf/bin/run_jaxb.sh
A test/perf/bin/run_xerces.bat
A test/perf/bin/run_v1.sh
A test/perf/bin/run_castor.bat
A test/perf/bin/run_xerces.sh
A test/perf/bin/run_castor.sh
A test/perf/bin/run_jaxb.bat
A test/perf/bin/v1.sh
A test/perf/bin/jibx.sh
A test/perf/bin/run_jibx.bat
AU test/perf/bin/v1.bat
AU test/perf/bin/jibx.bat
A test/perf/bin/castor.properties
A test/perf/bin/run_jibx.sh
A test/perf/download.properties
A test/perf/cases
AU test/perf/cases/parser_instances.zip
A test/perf/cases/xsd
A test/perf/cases/xsd/non-primitives.xsd
A test/perf/cases/xsd/purchase-order-1.xml
A test/perf/cases/xsd/purchase-order.xsd
A test/perf/cases/xsd/purchase-order-2.xml
A test/perf/cases/xsd/purchase-order-3.xml
A test/perf/cases/xsd/doc.xsd
A test/perf/cases/xsd/purchase-order-4.xml
A test/perf/cases/xsd/purchase-order-5.xml
A test/perf/cases/xsd/purchase-order-6.xml
A test/perf/cases/xsd/purchase-order-7.xml
A test/perf/cases/xsd/purchase-order-jibxbinding.xml
A test/perf/cases/xsd/perf-results.xsd
A test/perf/cases/xsd/primitives.xsd
A test/perf/results.xml
AU test/perf/env.sh
AU test/perf/env.bat
A test/docs
AU test/docs/BuildingAndRunningTests.txt
AU test/docs/TestOrganization.txt
AU test/readme.txt
AU STATUS
A .github
A .github/workflows
A .github/workflows/test-gradle.yml
A .github/workflows/codeql-analysis.yml
A wrapper.gradle
AU NOTICE.txt
AU NOTICE-binary.txt
A legal
A legal/HEADER
A settings.gradle
A SECURITY.md
A CHANGES.txt
A .gitignore
AU xbeanenv.sh
AU xbeanenv.cmd
U .
At revision 1918107
ERROR: Not all environment variables could be successfully injected. Check for similarly-named environment variables.
ERROR: Not all environment variables could be successfully injected. Check for similarly-named environment variables.
[POI-XMLBeans-DSL-1.23] $ /bin/sh -xe /tmp/jenkins2423285014894743957.sh
+ rm -rf examples excelant integrationtest main ooxml ooxml-schema scratchpad build.javacheck.xml
+ svn status
+ svn revert poi*/src/*/java9/module-info.*
svn: E155010: The node '<https://ci-builds.apache.org/job/POI/job/POI-XMLBeans-DSL-1.23/ws/poi*/src/*'> was not found.
+ true
+ svn revert src/resources/ooxml-lite-report.*
Skipped 'src/resources/ooxml-lite-report.*'
+ echo Java-Home: /home/jenkins/tools/java/latest23
Java-Home: /home/jenkins/tools/java/latest23
+ ls -al /home/jenkins/tools/java/latest23/
total 52
drwxr-xr-x 8 root root 4096 Feb 8 19:37 .
drwxrwxr-x 40 root root 4096 Apr 12 16:57 ..
drwxr-xr-x 2 root root 4096 Feb 8 19:37 bin
drwxr-xr-x 5 root root 4096 Feb 8 19:37 conf
drwxr-xr-x 3 root root 4096 Feb 8 19:37 include
drwxr-xr-x 2 root root 12288 Feb 8 19:37 jmods
drwxr-xr-x 71 root root 4096 Jan 26 22:07 legal
drwxr-xr-x 5 root root 12288 Feb 8 19:37 lib
-rw-r--r-- 1 root root 1206 Jan 25 10:26 release
+ ls -al /home/jenkins/tools/java/latest23/bin
total 472
drwxr-xr-x 2 root root 4096 Feb 8 19:37 .
drwxr-xr-x 8 root root 4096 Feb 8 19:37 ..
-rwxr-xr-x 1 root root 12384 Jan 25 10:26 jar
-rwxr-xr-x 1 root root 12392 Jan 25 10:26 jarsigner
-rwxr-xr-x 1 root root 12328 Jan 25 10:26 java
-rwxr-xr-x 1 root root 12416 Jan 25 10:26 javac
-rwxr-xr-x 1 root root 12424 Jan 25 10:26 javadoc
-rwxr-xr-x 1 root root 12384 Jan 25 10:26 javap
-rwxr-xr-x 1 root root 12384 Jan 25 10:26 jcmd
-rwxr-xr-x 1 root root 12456 Jan 25 10:26 jconsole
-rwxr-xr-x 1 root root 12384 Jan 25 10:26 jdb
-rwxr-xr-x 1 root root 12392 Jan 25 10:26 jdeprscan
-rwxr-xr-x 1 root root 12384 Jan 25 10:26 jdeps
-rwxr-xr-x 1 root root 12384 Jan 25 10:26 jfr
-rwxr-xr-x 1 root root 12384 Jan 25 10:26 jhsdb
-rwxr-xr-x 1 root root 12392 Jan 25 10:26 jimage
-rwxr-xr-x 1 root root 12416 Jan 25 10:26 jinfo
-rwxr-xr-x 1 root root 12416 Jan 25 10:26 jlink
-rwxr-xr-x 1 root root 12416 Jan 25 10:26 jmap
-rwxr-xr-x 1 root root 12384 Jan 25 10:26 jmod
-rwxr-xr-x 1 root root 12392 Jan 25 10:26 jpackage
-rwxr-xr-x 1 root root 12384 Jan 25 10:26 jps
-rwxr-xr-x 1 root root 12424 Jan 25 10:26 jrunscript
-rwxr-xr-x 1 root root 12392 Jan 25 10:26 jshell
-rwxr-xr-x 1 root root 12424 Jan 25 10:26 jstack
-rwxr-xr-x 1 root root 12384 Jan 25 10:26 jstat
-rwxr-xr-x 1 root root 12392 Jan 25 10:26 jstatd
-rwxr-xr-x 1 root root 12392 Jan 25 10:26 jwebserver
-rwxr-xr-x 1 root root 12392 Jan 25 10:26 keytool
-rwxr-xr-x 1 root root 12416 Jan 25 10:26 rmiregistry
-rwxr-xr-x 1 root root 12392 Jan 25 10:26 serialver
+ /home/jenkins/tools/java/latest23/bin/java -version
openjdk version "23-ea" 2024-09-17
OpenJDK Runtime Environment (build 23-ea+7-481)
OpenJDK 64-Bit Server VM (build 23-ea+7-481, mixed mode, sharing)
+ echo which java
which java
+ which java
/home/jenkins/tools/java/latest23/bin/java
+ java -version
openjdk version "23-ea" 2024-09-17
OpenJDK Runtime Environment (build 23-ea+7-481)
OpenJDK 64-Bit Server VM (build 23-ea+7-481, mixed mode, sharing)
+ echo which javac
which javac
+ which javac
/home/jenkins/tools/java/latest23/bin/javac
+ javac -version
javac 23-ea
+ echo Ant-Home:
Ant-Home:
+ ls -al
total 416
drwxr-xr-x 10 jenkins jenkins 4096 Jun 2 01:13 .
drwxr-xr-x 4 jenkins jenkins 4096 Jun 2 01:10 ..
-rw-r--r-- 1 jenkins jenkins 28782 Jun 2 01:10 build.gradle
-rw-r--r-- 1 jenkins jenkins 54161 Jun 2 01:10 build.xml
-rw-r--r-- 1 jenkins jenkins 11963 Jun 2 01:13 CHANGES.txt
drwxr-xr-x 3 jenkins jenkins 4096 Jun 2 01:13 .github
-rw-r--r-- 1 jenkins jenkins 14 Jun 2 01:13 .gitignore
drwxr-xr-x 3 jenkins jenkins 4096 Jun 2 01:12 gradle
-rw-r--r-- 1 jenkins jenkins 1338 Jun 2 01:10 gradle.properties
-rwxr-xr-x 1 jenkins jenkins 9177 Jun 2 01:12 gradlew
-rw-r--r-- 1 jenkins jenkins 176588 Jun 2 01:12 KEYS
drwxr-xr-x 2 jenkins jenkins 4096 Jun 2 01:13 legal
-rwxr-xr-x 1 jenkins jenkins 12460 Jun 2 01:12 LICENSE-binary.txt
-rwxr-xr-x 1 jenkins jenkins 15242 Jun 2 01:10 LICENSE.txt
-rw-r--r-- 1 jenkins jenkins 2561 Jun 2 01:13 NOTICE-binary.txt
-rw-r--r-- 1 jenkins jenkins 1592 Jun 2 01:13 NOTICE.txt
-rw-r--r-- 1 jenkins jenkins 2227 Jun 2 01:12 README.txt
-rw-r--r-- 1 jenkins jenkins 11023 Jun 2 01:12 release-guide.txt
drwxr-xr-x 16 jenkins jenkins 4096 Jun 2 01:13 samples
-rw-r--r-- 1 jenkins jenkins 238 Jun 2 01:13 SECURITY.md
-rw-r--r-- 1 jenkins jenkins 661 Jun 2 01:13 settings.gradle
drwxr-xr-x 4 jenkins jenkins 4096 Jun 2 01:11 src
-rw-r--r-- 1 jenkins jenkins 359 Jun 2 01:13 STATUS
drwxr-xr-x 4 jenkins jenkins 4096 Jun 2 01:14 .svn
drwxr-xr-x 4 jenkins jenkins 4096 Jun 2 01:13 test
-rw-r--r-- 1 jenkins jenkins 3803 Jun 2 01:13 wrapper.gradle
-rw-r--r-- 1 jenkins jenkins 25 Jun 2 01:13 xbeanenv.cmd
-rwxr-xr-x 1 jenkins jenkins 27 Jun 2 01:13 xbeanenv.sh
drwxr-xr-x 2 jenkins jenkins 4096 Jun 2 01:12 xkit
+ echo which ant
which ant
+ which ant
/usr/bin/ant
+ ant -version
Apache Ant(TM) version 1.10.12 compiled on January 17 1970
+ echo <project default="test"><target name="test"><echo>Java ${ant.java.version}/${java.version}</echo><exec executable="javac"><arg value="-version"/></exec></target></project>
+ ant -f build.javacheck.xml -v
Apache Ant(TM) version 1.10.12 compiled on January 17 1970
Buildfile: <https://ci-builds.apache.org/job/POI/job/POI-XMLBeans-DSL-1.23/ws/build.javacheck.xml>
Detected Java version: 23 in: /usr/local/asfpackages/java/openjdk-23-ea+7
Detected OS: Linux
parsing buildfile <https://ci-builds.apache.org/job/POI/job/POI-XMLBeans-DSL-1.23/ws/build.javacheck.xml> with URI = <https://ci-builds.apache.org/job/POI/job/POI-XMLBeans-DSL-1.23/ws/build.javacheck.xml>
Project base dir set to: <https://ci-builds.apache.org/job/POI/job/POI-XMLBeans-DSL-1.23/ws/>
Build sequence for target(s) `test' is [test]
Complete build sequence is [test, ]
test:
parsing buildfile jar:file:/usr/share/ant/lib/ant.jar!/org/apache/tools/ant/antlib.xml with URI = jar:file:/usr/share/ant/lib/ant.jar!/org/apache/tools/ant/antlib.xml from a zip file
[echo] Java 23/23-ea
[exec] Current OS is Linux
[exec] Executing 'javac' with arguments:
[exec] '-version'
[exec]
[exec] The ' characters around the executable and arguments are
[exec] not part of the command.
[exec] javac 23-ea
BUILD SUCCESSFUL
Total time: 3 seconds
+ exit 0
[Gradle] - Launching build.
ERROR: Not all environment variables could be successfully injected. Check for similarly-named environment variables.
[POI-XMLBeans-DSL-1.23] $ <https://ci-builds.apache.org/job/POI/job/POI-XMLBeans-DSL-1.23/ws/gradlew> clean jenkins jacocoTestReport
To honour the JVM settings for this build a single-use Daemon process will be forked. For more on this, please refer to https://docs.gradle.org/8.7/userguide/gradle_daemon.html#sec:disabling_the_daemon in the Gradle documentation.
Daemon will be stopped at the end of the build
Configuration on demand is an incubating feature.
FAILURE: Build failed with an exception.
* What went wrong:
BUG! exception in phase 'semantic analysis' in source unit '_BuildScript_' Unsupported class file major version 67
> Unsupported class file major version 67
* Try:
> Run with --stacktrace option to get the stack trace.
> Run with --info or --debug option to get more log output.
> Run with --scan to get full insights.
> Get more help at https://help.gradle.org.
BUILD FAILED in 28s
Build step 'Invoke Gradle script' changed build result to FAILURE
Build step 'Invoke Gradle script' marked build as failure
ERROR: Not all environment variables could be successfully injected. Check for similarly-named environment variables.
Archiving artifacts
ERROR: Not all environment variables could be successfully injected. Check for similarly-named environment variables.
Recording test results
ERROR: Not all environment variables could be successfully injected. Check for similarly-named environment variables.
ERROR: Step ‘Publish JUnit test result report’ failed: No test report files were found. Configuration error?
[SpotBugs] Skipping execution of recorder since overall result is 'FAILURE'
ERROR: Not all environment variables could be successfully injected. Check for similarly-named environment variables.
---------------------------------------------------------------------
To unsubscribe, e-mail: dev-unsubscribe@poi.apache.org
For additional commands, e-mail: dev-help@poi.apache.org