You are viewing a plain text version of this content. The canonical link for it is here.
Posted to dev@kafka.apache.org by Apache Jenkins Server <je...@builds.apache.org> on 2015/10/29 05:45:44 UTC
Build failed in Jenkins: kafka-trunk-jdk7 #733
See <https://builds.apache.org/job/kafka-trunk-jdk7/733/changes>
Changes:
[wangguoz] MINOR: Fix missing copyright in config file added in KAFKA-2640.
------------------------------------------
[...truncated 427 lines...]
^
<https://builds.apache.org/job/kafka-trunk-jdk7/ws/core/src/main/scala/kafka/controller/ControllerChannelManager.scala>:389: class BrokerEndPoint in object UpdateMetadataRequest is deprecated: see corresponding Javadoc for more information.
new UpdateMetadataRequest.BrokerEndPoint(brokerEndPoint.id, brokerEndPoint.host, brokerEndPoint.port)
^
<https://builds.apache.org/job/kafka-trunk-jdk7/ws/core/src/main/scala/kafka/controller/ControllerChannelManager.scala>:391: constructor UpdateMetadataRequest in class UpdateMetadataRequest is deprecated: see corresponding Javadoc for more information.
new UpdateMetadataRequest(controllerId, controllerEpoch, liveBrokers.asJava, partitionStates.asJava)
^
<https://builds.apache.org/job/kafka-trunk-jdk7/ws/core/src/main/scala/kafka/network/BlockingChannel.scala>:129: method readFromReadableChannel in class NetworkReceive is deprecated: see corresponding Javadoc for more information.
response.readFromReadableChannel(channel)
^
there were 15 feature warnings; re-run with -feature for details
18 warnings found
:kafka-trunk-jdk7:core:processResources UP-TO-DATE
:kafka-trunk-jdk7:core:classes
:kafka-trunk-jdk7:log4j-appender:javadoc UP-TO-DATE
:kafka-trunk-jdk7:core:javadoc
:kafka-trunk-jdk7:core:javadocJar
:kafka-trunk-jdk7:core:scaladoc
[ant:scaladoc] Element '<https://builds.apache.org/job/kafka-trunk-jdk7/ws/core/build/resources/main'> does not exist.
[ant:scaladoc] <https://builds.apache.org/job/kafka-trunk-jdk7/ws/core/src/main/scala/kafka/server/KafkaServer.scala>:293: warning: a pure expression does nothing in statement position; you may be omitting necessary parentheses
[ant:scaladoc] ControllerStats.uncleanLeaderElectionRate
[ant:scaladoc] ^
[ant:scaladoc] <https://builds.apache.org/job/kafka-trunk-jdk7/ws/core/src/main/scala/kafka/server/KafkaServer.scala>:294: warning: a pure expression does nothing in statement position; you may be omitting necessary parentheses
[ant:scaladoc] ControllerStats.leaderElectionTimer
[ant:scaladoc] ^
[ant:scaladoc] warning: there were 15 feature warnings; re-run with -feature for details
[ant:scaladoc] <https://builds.apache.org/job/kafka-trunk-jdk7/ws/core/src/main/scala/kafka/controller/PartitionLeaderSelector.scala>:28: warning: Could not find any member to link for "NoReplicaOnlineException".
[ant:scaladoc] /**
[ant:scaladoc] ^
[ant:scaladoc] <https://builds.apache.org/job/kafka-trunk-jdk7/ws/core/src/main/scala/kafka/controller/KafkaController.scala>:1160: warning: Could not find any member to link for "Exception".
[ant:scaladoc] /**
[ant:scaladoc] ^
[ant:scaladoc] <https://builds.apache.org/job/kafka-trunk-jdk7/ws/core/src/main/scala/kafka/controller/KafkaController.scala>:1334: warning: Could not find any member to link for "Exception".
[ant:scaladoc] /**
[ant:scaladoc] ^
[ant:scaladoc] <https://builds.apache.org/job/kafka-trunk-jdk7/ws/core/src/main/scala/kafka/controller/KafkaController.scala>:1293: warning: Could not find any member to link for "Exception".
[ant:scaladoc] /**
[ant:scaladoc] ^
[ant:scaladoc] <https://builds.apache.org/job/kafka-trunk-jdk7/ws/core/src/main/scala/kafka/controller/PartitionStateMachine.scala>:490: warning: Could not find any member to link for "Exception".
[ant:scaladoc] /**
[ant:scaladoc] ^
[ant:scaladoc] <https://builds.apache.org/job/kafka-trunk-jdk7/ws/core/src/main/scala/kafka/controller/PartitionStateMachine.scala>:455: warning: Could not find any member to link for "Exception".
[ant:scaladoc] /**
[ant:scaladoc] ^
[ant:scaladoc] <https://builds.apache.org/job/kafka-trunk-jdk7/ws/core/src/main/scala/kafka/controller/KafkaController.scala>:1276: warning: Could not find any member to link for "Exception".
[ant:scaladoc] /**
[ant:scaladoc] ^
[ant:scaladoc] <https://builds.apache.org/job/kafka-trunk-jdk7/ws/core/src/main/scala/kafka/controller/KafkaController.scala>:1250: warning: Could not find any member to link for "Exception".
[ant:scaladoc] /**
[ant:scaladoc] ^
[ant:scaladoc] <https://builds.apache.org/job/kafka-trunk-jdk7/ws/core/src/main/scala/kafka/controller/KafkaController.scala>:1438: warning: Could not find any member to link for "Exception".
[ant:scaladoc] /**
[ant:scaladoc] ^
[ant:scaladoc] <https://builds.apache.org/job/kafka-trunk-jdk7/ws/core/src/main/scala/kafka/controller/KafkaController.scala>:1415: warning: Could not find any member to link for "Exception".
[ant:scaladoc] /**
[ant:scaladoc] ^
[ant:scaladoc] <https://builds.apache.org/job/kafka-trunk-jdk7/ws/core/src/main/scala/kafka/log/LogSegment.scala>:274: warning: Could not find any member to link for "KafkaStorageException".
[ant:scaladoc] /**
[ant:scaladoc] ^
[ant:scaladoc] <https://builds.apache.org/job/kafka-trunk-jdk7/ws/core/src/main/scala/kafka/log/OffsetIndex.scala>:349: warning: Could not find any member to link for "IllegalArgumentException".
[ant:scaladoc] /**
[ant:scaladoc] ^
[ant:scaladoc] <https://builds.apache.org/job/kafka-trunk-jdk7/ws/core/src/main/scala/kafka/log/Log.scala>:460: warning: Could not find any member to link for "OffsetOutOfRangeException".
[ant:scaladoc] /**
[ant:scaladoc] ^
[ant:scaladoc] <https://builds.apache.org/job/kafka-trunk-jdk7/ws/core/src/main/scala/kafka/log/Log.scala>:295: warning: Could not find any member to link for "KafkaStorageException".
[ant:scaladoc] /**
[ant:scaladoc] ^
[ant:scaladoc] <https://builds.apache.org/job/kafka-trunk-jdk7/ws/core/src/main/scala/kafka/utils/ByteBoundedBlockingQueue.scala>:97: warning: Could not find any member to link for "NullPointerException".
[ant:scaladoc] /**
[ant:scaladoc] ^
[ant:scaladoc] <https://builds.apache.org/job/kafka-trunk-jdk7/ws/core/src/main/scala/kafka/utils/ByteBoundedBlockingQueue.scala>:97: warning: Could not find any member to link for "InterruptedException".
[ant:scaladoc] /**
[ant:scaladoc] ^
[ant:scaladoc] <https://builds.apache.org/job/kafka-trunk-jdk7/ws/core/src/main/scala/kafka/utils/ByteBoundedBlockingQueue.scala>:72: warning: Could not find any member to link for "NullPointerException".
[ant:scaladoc] /**
[ant:scaladoc] ^
[ant:scaladoc] <https://builds.apache.org/job/kafka-trunk-jdk7/ws/core/src/main/scala/kafka/utils/ByteBoundedBlockingQueue.scala>:72: warning: Could not find any member to link for "InterruptedException".
[ant:scaladoc] /**
[ant:scaladoc] ^
[ant:scaladoc] <https://builds.apache.org/job/kafka-trunk-jdk7/ws/core/src/main/scala/kafka/utils/ByteBoundedBlockingQueue.scala>:32: warning: Could not find any member to link for "NullPointerException".
[ant:scaladoc] /**
[ant:scaladoc] ^
[ant:scaladoc] <https://builds.apache.org/job/kafka-trunk-jdk7/ws/core/src/main/scala/kafka/utils/ByteBoundedBlockingQueue.scala>:32: warning: Could not find any member to link for "InterruptedException".
[ant:scaladoc] /**
[ant:scaladoc] ^
[ant:scaladoc] <https://builds.apache.org/job/kafka-trunk-jdk7/ws/core/src/main/scala/kafka/utils/VerifiableProperties.scala>:125: warning: Could not find any member to link for "IllegalArgumentException".
[ant:scaladoc] /**
[ant:scaladoc] ^
[ant:scaladoc] <https://builds.apache.org/job/kafka-trunk-jdk7/ws/core/src/main/scala/kafka/utils/VerifiableProperties.scala>:106: warning: Could not find any member to link for "IllegalArgumentException".
[ant:scaladoc] /**
[ant:scaladoc] ^
[ant:scaladoc] <https://builds.apache.org/job/kafka-trunk-jdk7/ws/core/src/main/scala/kafka/utils/VerifiableProperties.scala>:63: warning: Could not find any member to link for "IllegalArgumentException".
[ant:scaladoc] /**
[ant:scaladoc] ^
[ant:scaladoc] <https://builds.apache.org/job/kafka-trunk-jdk7/ws/core/src/main/scala/kafka/server/ZookeeperLeaderElector.scala>:134: warning: Could not find any member to link for "Exception".
[ant:scaladoc] /**
[ant:scaladoc] ^
[ant:scaladoc] <https://builds.apache.org/job/kafka-trunk-jdk7/ws/core/src/main/scala/kafka/server/ZookeeperLeaderElector.scala>:118: warning: Could not find any member to link for "Exception".
[ant:scaladoc] /**
[ant:scaladoc] ^
[ant:scaladoc] <https://builds.apache.org/job/kafka-trunk-jdk7/ws/core/src/main/scala/kafka/server/KafkaHealthcheck.scala>:75: warning: Could not find any member to link for "Exception".
[ant:scaladoc] /**
[ant:scaladoc] ^
[ant:scaladoc] <https://builds.apache.org/job/kafka-trunk-jdk7/ws/core/src/main/scala/kafka/utils/ByteBoundedBlockingQueue.scala>:72: warning: Could not find any member to link for "java.util.concurrent.BlockingQueue#offer".
[ant:scaladoc] /**
[ant:scaladoc] ^
[ant:scaladoc] <https://builds.apache.org/job/kafka-trunk-jdk7/ws/core/src/main/scala/kafka/utils/ByteBoundedBlockingQueue.scala>:32: warning: Could not find any member to link for "java.util.concurrent.BlockingQueue#offer".
[ant:scaladoc] /**
[ant:scaladoc] ^
[ant:scaladoc] <https://builds.apache.org/job/kafka-trunk-jdk7/ws/core/src/main/scala/kafka/utils/ByteBoundedBlockingQueue.scala>:137: warning: Could not find any member to link for "java.util.concurrent.BlockingQueue#poll".
[ant:scaladoc] /**
[ant:scaladoc] ^
[ant:scaladoc] <https://builds.apache.org/job/kafka-trunk-jdk7/ws/core/src/main/scala/kafka/utils/ByteBoundedBlockingQueue.scala>:120: warning: Could not find any member to link for "java.util.concurrent.BlockingQueue#poll".
[ant:scaladoc] /**
[ant:scaladoc] ^
[ant:scaladoc] <https://builds.apache.org/job/kafka-trunk-jdk7/ws/core/src/main/scala/kafka/utils/ByteBoundedBlockingQueue.scala>:97: warning: Could not find any member to link for "java.util.concurrent.BlockingQueue#put".
[ant:scaladoc] /**
[ant:scaladoc] ^
[ant:scaladoc] <https://builds.apache.org/job/kafka-trunk-jdk7/ws/core/src/main/scala/kafka/utils/ByteBoundedBlockingQueue.scala>:152: warning: Could not find any member to link for "java.util.concurrent.BlockingQueue#take".
[ant:scaladoc] /**
[ant:scaladoc] ^
[ant:scaladoc] 35 warnings found
:kafka-trunk-jdk7:core:scaladocJar
:kafka-trunk-jdk7:core:docsJar
:clients:docsJar
:log4j-appender:javadoc UP-TO-DATE
:core:javadoc
cache fileHashes.bin (<https://builds.apache.org/job/kafka-trunk-jdk7/ws/.gradle/2.8/taskArtifacts/fileHashes.bin)> is corrupt. Discarding.
:examples:javadoc
:examples:javadocJar
:examples:docsJar
:log4j-appender:javadocJar
:log4j-appender:docsJar
:streams:javadoc
:streams:javadocJar
:streams:docsJar
:tools:javadoc<https://builds.apache.org/job/kafka-trunk-jdk7/ws/tools/src/main/java/org/apache/kafka/tools/ThroughputThrottler.java>:68: warning - @return tag has no arguments.
1 warning
:tools:javadocJar
:tools:docsJar
:contrib:hadoop-consumer:javadoc
:contrib:hadoop-consumer:javadocJar
:contrib:hadoop-consumer:docsJar
:contrib:hadoop-producer:javadoc
:contrib:hadoop-producer:javadocJar
:contrib:hadoop-producer:docsJar
:copycat:api:javadoc UP-TO-DATE
:copycat:api:javadocJar
:copycat:api:docsJar
:copycat:file:javadoc UP-TO-DATE
:copycat:file:javadocJar
:copycat:file:docsJar
:copycat:json:javadoc UP-TO-DATE
:copycat:json:javadocJar
:copycat:json:docsJar
:copycat:runtime:javadoc UP-TO-DATE
:copycat:runtime:javadocJar
:copycat:runtime:docsJar
:docsJarAll
:test_core_2_10_5
Building project 'core' with Scala version 2.10.5
:kafka-trunk-jdk7:clients:compileJava UP-TO-DATE
:kafka-trunk-jdk7:clients:processResources UP-TO-DATE
:kafka-trunk-jdk7:clients:classes UP-TO-DATE
:kafka-trunk-jdk7:clients:determineCommitId UP-TO-DATE
:kafka-trunk-jdk7:clients:createVersionFile
:kafka-trunk-jdk7:clients:jar UP-TO-DATE
:kafka-trunk-jdk7:clients:compileTestJava UP-TO-DATE
:kafka-trunk-jdk7:clients:processTestResources UP-TO-DATE
:kafka-trunk-jdk7:clients:testClasses UP-TO-DATE
:kafka-trunk-jdk7:log4j-appender:compileJava UP-TO-DATE
:kafka-trunk-jdk7:log4j-appender:processResources UP-TO-DATE
:kafka-trunk-jdk7:log4j-appender:classes UP-TO-DATE
:kafka-trunk-jdk7:log4j-appender:jar UP-TO-DATE
:kafka-trunk-jdk7:core:compileJava UP-TO-DATE
:kafka-trunk-jdk7:core:compileScala
<https://builds.apache.org/job/kafka-trunk-jdk7/ws/core/src/main/scala/kafka/api/OffsetCommitRequest.scala>:78: value DEFAULT_TIMESTAMP in object OffsetCommitRequest is deprecated: see corresponding Javadoc for more information.
org.apache.kafka.common.requests.OffsetCommitRequest.DEFAULT_TIMESTAMP
^
<https://builds.apache.org/job/kafka-trunk-jdk7/ws/core/src/main/scala/kafka/common/OffsetMetadataAndError.scala>:36: value DEFAULT_TIMESTAMP in object OffsetCommitRequest is deprecated: see corresponding Javadoc for more information.
commitTimestamp: Long = org.apache.kafka.common.requests.OffsetCommitRequest.DEFAULT_TIMESTAMP,
^
<https://builds.apache.org/job/kafka-trunk-jdk7/ws/core/src/main/scala/kafka/common/OffsetMetadataAndError.scala>:37: value DEFAULT_TIMESTAMP in object OffsetCommitRequest is deprecated: see corresponding Javadoc for more information.
expireTimestamp: Long = org.apache.kafka.common.requests.OffsetCommitRequest.DEFAULT_TIMESTAMP) {
^
<https://builds.apache.org/job/kafka-trunk-jdk7/ws/core/src/main/scala/kafka/server/KafkaApis.scala>:262: value DEFAULT_TIMESTAMP in object OffsetCommitRequest is deprecated: see corresponding Javadoc for more information.
if (offsetAndMetadata.commitTimestamp == org.apache.kafka.common.requests.OffsetCommitRequest.DEFAULT_TIMESTAMP)
^
<https://builds.apache.org/job/kafka-trunk-jdk7/ws/core/src/main/scala/kafka/server/KafkaServer.scala>:293: a pure expression does nothing in statement position; you may be omitting necessary parentheses
ControllerStats.uncleanLeaderElectionRate
^
<https://builds.apache.org/job/kafka-trunk-jdk7/ws/core/src/main/scala/kafka/server/KafkaServer.scala>:294: a pure expression does nothing in statement position; you may be omitting necessary parentheses
ControllerStats.leaderElectionTimer
^
<https://builds.apache.org/job/kafka-trunk-jdk7/ws/core/src/main/scala/kafka/server/OffsetManager.scala>:380: value DEFAULT_TIMESTAMP in object OffsetCommitRequest is deprecated: see corresponding Javadoc for more information.
if (value.expireTimestamp == org.apache.kafka.common.requests.OffsetCommitRequest.DEFAULT_TIMESTAMP)
^
<https://builds.apache.org/job/kafka-trunk-jdk7/ws/core/src/main/scala/kafka/tools/ConsoleProducer.scala>:115: value METADATA_FETCH_TIMEOUT_CONFIG in object ProducerConfig is deprecated: see corresponding Javadoc for more information.
props.put(ProducerConfig.METADATA_FETCH_TIMEOUT_CONFIG, config.metadataFetchTimeoutMs.toString)
^
<https://builds.apache.org/job/kafka-trunk-jdk7/ws/core/src/main/scala/kafka/tools/ConsoleProducer.scala>:117: value TIMEOUT_CONFIG in object ProducerConfig is deprecated: see corresponding Javadoc for more information.
props.put(ProducerConfig.TIMEOUT_CONFIG, config.requestTimeoutMs.toString)
^
<https://builds.apache.org/job/kafka-trunk-jdk7/ws/core/src/main/scala/kafka/tools/ConsoleProducer.scala>:121: value BLOCK_ON_BUFFER_FULL_CONFIG in object ProducerConfig is deprecated: see corresponding Javadoc for more information.
props.put(ProducerConfig.BLOCK_ON_BUFFER_FULL_CONFIG, "false")
^
<https://builds.apache.org/job/kafka-trunk-jdk7/ws/core/src/main/scala/kafka/tools/EndToEndLatency.scala>:75: value BLOCK_ON_BUFFER_FULL_CONFIG in object ProducerConfig is deprecated: see corresponding Javadoc for more information.
producerProps.put(ProducerConfig.BLOCK_ON_BUFFER_FULL_CONFIG, "true")
^
<https://builds.apache.org/job/kafka-trunk-jdk7/ws/core/src/main/scala/kafka/tools/MirrorMaker.scala>:194: value BLOCK_ON_BUFFER_FULL_CONFIG in object ProducerConfig is deprecated: see corresponding Javadoc for more information.
maybeSetDefaultProperty(producerProps, ProducerConfig.BLOCK_ON_BUFFER_FULL_CONFIG, "true")
^
<https://builds.apache.org/job/kafka-trunk-jdk7/ws/core/src/main/scala/kafka/controller/ControllerChannelManager.scala>:389: class BrokerEndPoint in object UpdateMetadataRequest is deprecated: see corresponding Javadoc for more information.
new UpdateMetadataRequest.BrokerEndPoint(brokerEndPoint.id, brokerEndPoint.host, brokerEndPoint.port)
^
<https://builds.apache.org/job/kafka-trunk-jdk7/ws/core/src/main/scala/kafka/controller/ControllerChannelManager.scala>:391: constructor UpdateMetadataRequest in class UpdateMetadataRequest is deprecated: see corresponding Javadoc for more information.
new UpdateMetadataRequest(controllerId, controllerEpoch, liveBrokers.asJava, partitionStates.asJava)
^
<https://builds.apache.org/job/kafka-trunk-jdk7/ws/core/src/main/scala/kafka/network/BlockingChannel.scala>:129: method readFromReadableChannel in class NetworkReceive is deprecated: see corresponding Javadoc for more information.
response.readFromReadableChannel(channel)
^
there were 15 feature warning(s); re-run with -feature for details
16 warnings found
:kafka-trunk-jdk7:core:processResources UP-TO-DATE
:kafka-trunk-jdk7:core:classes
:kafka-trunk-jdk7:core:compileTestJava UP-TO-DATE
:kafka-trunk-jdk7:core:compileTestScala
:test_core_2_10_5 FAILED
FAILURE: Build failed with an exception.
* What went wrong:
org.gradle.api.internal.changedetection.state.DefaultFileCollectionSnapshotter$FileCollectionSnapshotImpl cannot be cast to org.gradle.api.internal.changedetection.state.OutputFilesCollectionSnapshotter$OutputFilesSnapshot
* Try:
Run with --stacktrace option to get the stack trace. Run with --info or --debug option to get more log output.
BUILD FAILED
Total time: 7 mins 20.734 secs
Build step 'Execute shell' marked build as failure
Recording test results
Setting GRADLE_2_1_HOME=/home/jenkins/jenkins-slave/tools/hudson.plugins.gradle.GradleInstallation/Gradle_2.1
Setting JDK_1_7_LATEST__HOME=/home/jenkins/tools/java/latest1.7
ERROR: Publisher 'Publish JUnit test result report' failed: No test report files were found. Configuration error?
Setting GRADLE_2_1_HOME=/home/jenkins/jenkins-slave/tools/hudson.plugins.gradle.GradleInstallation/Gradle_2.1
Setting JDK_1_7_LATEST__HOME=/home/jenkins/tools/java/latest1.7
Jenkins build is back to normal : kafka-trunk-jdk7 #734
Posted by Apache Jenkins Server <je...@builds.apache.org>.
See <https://builds.apache.org/job/kafka-trunk-jdk7/734/>