You are viewing a plain text version of this content. The canonical link for it is here.
Posted to commits@tomee.apache.org by Apache Jenkins Server <je...@builds.apache.org> on 2026/10/04 19:18:28 UTC
Jenkins build is still unstable: TomEE » master-build-full #2304
See <https://ci-builds.apache.org/job/Tomee/job/master-build-full/2304/display/redirect>
Jenkins build is back to stable : TomEE » master-build-full #2324
Posted by Apache Jenkins Server <je...@builds.apache.org>.
See <https://ci-builds.apache.org/job/Tomee/job/master-build-full/2324/display/redirect>
Jenkins build is still unstable: TomEE » master-build-full #2323
Posted by Apache Jenkins Server <je...@builds.apache.org>.
See <https://ci-builds.apache.org/job/Tomee/job/master-build-full/2323/display/redirect?page=changes>
Jenkins build is unstable: TomEE » master-build-full #2322
Posted by Apache Jenkins Server <je...@builds.apache.org>.
See <https://ci-builds.apache.org/job/Tomee/job/master-build-full/2322/display/redirect>
Build failed in Jenkins: TomEE » master-build-full #2321
Posted by Apache Jenkins Server <je...@builds.apache.org>.
See <https://ci-builds.apache.org/job/Tomee/job/master-build-full/2321/display/redirect>
Changes:
------------------------------------------
Started by timer
Running as SYSTEM
[EnvInject] - Loading node environment variables.
Building remotely on builds37 (ubuntu) in workspace <https://ci-builds.apache.org/job/Tomee/job/master-build-full/ws/>
The recommended git tool is: NONE
No credentials specified
> git rev-parse --resolve-git-dir <https://ci-builds.apache.org/job/Tomee/job/master-build-full/ws/.git> # timeout=10
Fetching changes from the remote Git repository
> git config remote.origin.url https://github.com/apache/tomee # timeout=10
Cleaning workspace
> git rev-parse --verify HEAD # timeout=10
Resetting working tree
> git reset --hard # timeout=10
> git clean -fdx # timeout=10
Fetching upstream changes from https://github.com/apache/tomee
> git --version # timeout=10
> git --version # 'git version 2.34.1'
> git fetch --tags --force --progress -- https://github.com/apache/tomee +refs/heads/*:refs/remotes/origin/* # timeout=10
> git rev-parse refs/remotes/origin/main^{commit} # timeout=10
Checking out Revision c90600ece534802be81f9fc1b5008cd3a37333f1 (refs/remotes/origin/main)
> git config core.sparsecheckout # timeout=10
> git checkout -f c90600ece534802be81f9fc1b5008cd3a37333f1 # timeout=10
Commit message: "use properties for the Hibernate libraries of the Jakarta Data TCK"
> git rev-list --no-walk c90600ece534802be81f9fc1b5008cd3a37333f1 # timeout=10
[master-build-full] $ /bin/sh -xe /tmp/jenkins11363571841441769986.sh
+ rm -rf /home/jenkins/.m2/repository/org/apache
Parsing POMs
Downloaded artifact https://repository.apache.org/content/repositories/releases/org/apache/apache/40/apache-40.pom
Downloaded artifact https://repo.maven.apache.org/maven2/org/apache/maven/maven/3.5.2/maven-3.5.2.pom
Downloaded artifact https://repo.maven.apache.org/maven2/org/apache/maven/maven-parent/27/maven-parent-27.pom
Downloaded artifact https://repo.maven.apache.org/maven2/org/apache/apache/17/apache-17.pom
Downloaded artifact https://repo.maven.apache.org/maven2/org/apache/maven/maven/3.9.9/maven-3.9.9.pom
Downloaded artifact https://repo.maven.apache.org/maven2/org/apache/maven/maven-parent/43/maven-parent-43.pom
Downloaded artifact https://repo.maven.apache.org/maven2/org/apache/apache/33/apache-33.pom
ERROR: Failed to parse POMs
hudson.remoting.ProxyException: hudson.maven.MavenModuleSetBuild$MavenExecutionException: org.apache.maven.project.ProjectBuildingException: Some problems were encountered while processing the POMs:
[FATAL] Non-readable POM /home/jenkins/.m2/repository/org/junit/junit-bom/5.10.3/junit-bom-5.10.3.pom: input contained no data @ /home/jenkins/.m2/repository/org/junit/junit-bom/5.10.3/junit-bom-5.10.3.pom
[ERROR] 'dependencies.dependency.version' for org.jboss.shrinkwrap.resolver:shrinkwrap-resolver-depchain:pom is missing. @ line 98, column 17
[FATAL] Non-readable POM /home/jenkins/.m2/repository/org/junit/junit-bom/5.10.3/junit-bom-5.10.3.pom: input contained no data @ /home/jenkins/.m2/repository/org/junit/junit-bom/5.10.3/junit-bom-5.10.3.pom
[ERROR] 'dependencies.dependency.version' for org.jboss.shrinkwrap.resolver:shrinkwrap-resolver-depchain:pom is missing. @ line 121, column 17
[FATAL] Non-readable POM /home/jenkins/.m2/repository/org/junit/junit-bom/5.10.3/junit-bom-5.10.3.pom: input contained no data @ /home/jenkins/.m2/repository/org/junit/junit-bom/5.10.3/junit-bom-5.10.3.pom
[ERROR] 'dependencies.dependency.version' for org.jboss.shrinkwrap.resolver:shrinkwrap-resolver-depchain:pom is missing. @ line 146, column 17
[FATAL] Non-readable POM /home/jenkins/.m2/repository/org/junit/junit-bom/5.10.3/junit-bom-5.10.3.pom: input contained no data @ /home/jenkins/.m2/repository/org/junit/junit-bom/5.10.3/junit-bom-5.10.3.pom
[ERROR] 'dependencies.dependency.version' for org.jboss.shrinkwrap.resolver:shrinkwrap-resolver-depchain:pom is missing. @ line 111, column 21
[FATAL] Non-readable POM /home/jenkins/.m2/repository/org/junit/junit-bom/5.10.3/junit-bom-5.10.3.pom: input contained no data @ /home/jenkins/.m2/repository/org/junit/junit-bom/5.10.3/junit-bom-5.10.3.pom
[ERROR] 'dependencies.dependency.version' for org.jboss.shrinkwrap.resolver:shrinkwrap-resolver-depchain:pom is missing. @ line 129, column 17
[FATAL] Non-readable POM /home/jenkins/.m2/repository/org/junit/junit-bom/5.10.3/junit-bom-5.10.3.pom: input contained no data @ /home/jenkins/.m2/repository/org/junit/junit-bom/5.10.3/junit-bom-5.10.3.pom
[ERROR] 'dependencies.dependency.version' for org.jboss.shrinkwrap.resolver:shrinkwrap-resolver-depchain:pom is missing. @ line 129, column 17
[FATAL] Non-readable POM /home/jenkins/.m2/repository/org/junit/junit-bom/5.10.3/junit-bom-5.10.3.pom: input contained no data @ /home/jenkins/.m2/repository/org/junit/junit-bom/5.10.3/junit-bom-5.10.3.pom
[ERROR] 'dependencies.dependency.version' for org.jboss.shrinkwrap.resolver:shrinkwrap-resolver-depchain:pom is missing. @ line 125, column 17
[FATAL] Non-readable POM /home/jenkins/.m2/repository/org/junit/junit-bom/5.10.3/junit-bom-5.10.3.pom: input contained no data @ /home/jenkins/.m2/repository/org/junit/junit-bom/5.10.3/junit-bom-5.10.3.pom
[ERROR] 'dependencies.dependency.version' for org.jboss.shrinkwrap.resolver:shrinkwrap-resolver-depchain:pom is missing. @ line 154, column 17
[FATAL] Non-readable POM /home/jenkins/.m2/repository/org/junit/junit-bom/5.10.3/junit-bom-5.10.3.pom: input contained no data @ /home/jenkins/.m2/repository/org/junit/junit-bom/5.10.3/junit-bom-5.10.3.pom
[ERROR] 'dependencies.dependency.version' for org.jboss.shrinkwrap.resolver:shrinkwrap-resolver-depchain:pom is missing. @ line 112, column 17
[WARNING] 'build.plugins.plugin.version' for org.codehaus.mojo:build-helper-maven-plugin is missing. @ line 42, column 15
[WARNING] 'build.plugins.plugin.version' for org.codehaus.mojo:build-helper-maven-plugin is missing. @ line 45, column 15
[FATAL] Non-readable POM /home/jenkins/.m2/repository/org/junit/junit-bom/5.10.3/junit-bom-5.10.3.pom: input contained no data @ /home/jenkins/.m2/repository/org/junit/junit-bom/5.10.3/junit-bom-5.10.3.pom
[ERROR] 'dependencies.dependency.version' for org.jboss.shrinkwrap.resolver:shrinkwrap-resolver-depchain:pom is missing. @ line 77, column 17
[FATAL] Non-readable POM /home/jenkins/.m2/repository/org/junit/junit-bom/5.10.3/junit-bom-5.10.3.pom: input contained no data @ /home/jenkins/.m2/repository/org/junit/junit-bom/5.10.3/junit-bom-5.10.3.pom
[ERROR] 'dependencies.dependency.version' for org.jboss.shrinkwrap.resolver:shrinkwrap-resolver-depchain:pom is missing. @ line 186, column 17
[FATAL] Non-readable POM /home/jenkins/.m2/repository/org/junit/junit-bom/5.10.3/junit-bom-5.10.3.pom: input contained no data @ /home/jenkins/.m2/repository/org/junit/junit-bom/5.10.3/junit-bom-5.10.3.pom
[ERROR] 'dependencies.dependency.version' for org.jboss.shrinkwrap.resolver:shrinkwrap-resolver-depchain:pom is missing. @ line 169, column 17
[FATAL] Non-readable POM /home/jenkins/.m2/repository/org/junit/junit-bom/5.10.3/junit-bom-5.10.3.pom: input contained no data @ /home/jenkins/.m2/repository/org/junit/junit-bom/5.10.3/junit-bom-5.10.3.pom
[ERROR] 'dependencies.dependency.version' for org.jboss.shrinkwrap.resolver:shrinkwrap-resolver-depchain:pom is missing. @ line 124, column 17
[WARNING] 'dependencies.dependency.scope' for org.junit:junit-bom:pom must be one of [provided, compile, runtime, test, system] but is 'import'. @ line 43, column 20
[WARNING] 'dependencies.dependency.scope' for org.junit:junit-bom:pom must be one of [provided, compile, runtime, test, system] but is 'import'. @ line 44, column 20
at PluginClassLoader for maven-plugin//hudson.maven.MavenModuleSetBuild$PomParser.invoke(MavenModuleSetBuild.java:1391)
at PluginClassLoader for maven-plugin//hudson.maven.MavenModuleSetBuild$PomParser.invoke(MavenModuleSetBuild.java:1124)
at hudson.FilePath$FileCallableWrapper.call(FilePath.java:3614)
at hudson.remoting.UserRequest.perform(UserRequest.java:225)
at hudson.remoting.UserRequest.perform(UserRequest.java:50)
at hudson.remoting.Request$2.run(Request.java:391)
at hudson.remoting.InterceptingExecutorService.lambda$wrap$0(InterceptingExecutorService.java:81)
at java.base/java.util.concurrent.FutureTask.run(FutureTask.java:264)
at java.base/java.util.concurrent.ThreadPoolExecutor.runWorker(ThreadPoolExecutor.java:1136)
at java.base/java.util.concurrent.ThreadPoolExecutor$Worker.run(ThreadPoolExecutor.java:635)
at java.base/java.lang.Thread.run(Thread.java:840)
Suppressed: hudson.remoting.Channel$CallSiteStackTrace: Remote call to builds37
at hudson.remoting.Channel.attachCallSiteStackTrace(Channel.java:1923)
at hudson.remoting.UserRequest$ExceptionResponse.retrieve(UserRequest.java:384)
at hudson.remoting.Channel.call(Channel.java:1112)
at hudson.FilePath.act(FilePath.java:1228)
at hudson.FilePath.act(FilePath.java:1217)
at PluginClassLoader for maven-plugin//hudson.maven.MavenModuleSetBuild$MavenModuleSetBuildExecution.parsePoms(MavenModuleSetBuild.java:985)
at PluginClassLoader for maven-plugin//hudson.maven.MavenModuleSetBuild$MavenModuleSetBuildExecution.doRun(MavenModuleSetBuild.java:689)
at hudson.model.AbstractBuild$AbstractBuildExecution.run(AbstractBuild.java:527)
at hudson.model.Run.execute(Run.java:1833)
at PluginClassLoader for maven-plugin//hudson.maven.MavenModuleSetBuild.run(MavenModuleSetBuild.java:543)
at hudson.model.ResourceController.execute(ResourceController.java:101)
at hudson.model.Executor.run(Executor.java:446)
Caused by: hudson.remoting.ProxyException: org.apache.maven.project.ProjectBuildingException: Some problems were encountered while processing the POMs:
[FATAL] Non-readable POM /home/jenkins/.m2/repository/org/junit/junit-bom/5.10.3/junit-bom-5.10.3.pom: input contained no data @ /home/jenkins/.m2/repository/org/junit/junit-bom/5.10.3/junit-bom-5.10.3.pom
[ERROR] 'dependencies.dependency.version' for org.jboss.shrinkwrap.resolver:shrinkwrap-resolver-depchain:pom is missing. @ line 98, column 17
[FATAL] Non-readable POM /home/jenkins/.m2/repository/org/junit/junit-bom/5.10.3/junit-bom-5.10.3.pom: input contained no data @ /home/jenkins/.m2/repository/org/junit/junit-bom/5.10.3/junit-bom-5.10.3.pom
[ERROR] 'dependencies.dependency.version' for org.jboss.shrinkwrap.resolver:shrinkwrap-resolver-depchain:pom is missing. @ line 121, column 17
[FATAL] Non-readable POM /home/jenkins/.m2/repository/org/junit/junit-bom/5.10.3/junit-bom-5.10.3.pom: input contained no data @ /home/jenkins/.m2/repository/org/junit/junit-bom/5.10.3/junit-bom-5.10.3.pom
[ERROR] 'dependencies.dependency.version' for org.jboss.shrinkwrap.resolver:shrinkwrap-resolver-depchain:pom is missing. @ line 146, column 17
[FATAL] Non-readable POM /home/jenkins/.m2/repository/org/junit/junit-bom/5.10.3/junit-bom-5.10.3.pom: input contained no data @ /home/jenkins/.m2/repository/org/junit/junit-bom/5.10.3/junit-bom-5.10.3.pom
[ERROR] 'dependencies.dependency.version' for org.jboss.shrinkwrap.resolver:shrinkwrap-resolver-depchain:pom is missing. @ line 111, column 21
[FATAL] Non-readable POM /home/jenkins/.m2/repository/org/junit/junit-bom/5.10.3/junit-bom-5.10.3.pom: input contained no data @ /home/jenkins/.m2/repository/org/junit/junit-bom/5.10.3/junit-bom-5.10.3.pom
[ERROR] 'dependencies.dependency.version' for org.jboss.shrinkwrap.resolver:shrinkwrap-resolver-depchain:pom is missing. @ line 129, column 17
[FATAL] Non-readable POM /home/jenkins/.m2/repository/org/junit/junit-bom/5.10.3/junit-bom-5.10.3.pom: input contained no data @ /home/jenkins/.m2/repository/org/junit/junit-bom/5.10.3/junit-bom-5.10.3.pom
[ERROR] 'dependencies.dependency.version' for org.jboss.shrinkwrap.resolver:shrinkwrap-resolver-depchain:pom is missing. @ line 129, column 17
[FATAL] Non-readable POM /home/jenkins/.m2/repository/org/junit/junit-bom/5.10.3/junit-bom-5.10.3.pom: input contained no data @ /home/jenkins/.m2/repository/org/junit/junit-bom/5.10.3/junit-bom-5.10.3.pom
[ERROR] 'dependencies.dependency.version' for org.jboss.shrinkwrap.resolver:shrinkwrap-resolver-depchain:pom is missing. @ line 125, column 17
[FATAL] Non-readable POM /home/jenkins/.m2/repository/org/junit/junit-bom/5.10.3/junit-bom-5.10.3.pom: input contained no data @ /home/jenkins/.m2/repository/org/junit/junit-bom/5.10.3/junit-bom-5.10.3.pom
[ERROR] 'dependencies.dependency.version' for org.jboss.shrinkwrap.resolver:shrinkwrap-resolver-depchain:pom is missing. @ line 154, column 17
[FATAL] Non-readable POM /home/jenkins/.m2/repository/org/junit/junit-bom/5.10.3/junit-bom-5.10.3.pom: input contained no data @ /home/jenkins/.m2/repository/org/junit/junit-bom/5.10.3/junit-bom-5.10.3.pom
[ERROR] 'dependencies.dependency.version' for org.jboss.shrinkwrap.resolver:shrinkwrap-resolver-depchain:pom is missing. @ line 112, column 17
[WARNING] 'build.plugins.plugin.version' for org.codehaus.mojo:build-helper-maven-plugin is missing. @ line 42, column 15
[WARNING] 'build.plugins.plugin.version' for org.codehaus.mojo:build-helper-maven-plugin is missing. @ line 45, column 15
[FATAL] Non-readable POM /home/jenkins/.m2/repository/org/junit/junit-bom/5.10.3/junit-bom-5.10.3.pom: input contained no data @ /home/jenkins/.m2/repository/org/junit/junit-bom/5.10.3/junit-bom-5.10.3.pom
[ERROR] 'dependencies.dependency.version' for org.jboss.shrinkwrap.resolver:shrinkwrap-resolver-depchain:pom is missing. @ line 77, column 17
[FATAL] Non-readable POM /home/jenkins/.m2/repository/org/junit/junit-bom/5.10.3/junit-bom-5.10.3.pom: input contained no data @ /home/jenkins/.m2/repository/org/junit/junit-bom/5.10.3/junit-bom-5.10.3.pom
[ERROR] 'dependencies.dependency.version' for org.jboss.shrinkwrap.resolver:shrinkwrap-resolver-depchain:pom is missing. @ line 186, column 17
[FATAL] Non-readable POM /home/jenkins/.m2/repository/org/junit/junit-bom/5.10.3/junit-bom-5.10.3.pom: input contained no data @ /home/jenkins/.m2/repository/org/junit/junit-bom/5.10.3/junit-bom-5.10.3.pom
[ERROR] 'dependencies.dependency.version' for org.jboss.shrinkwrap.resolver:shrinkwrap-resolver-depchain:pom is missing. @ line 169, column 17
[FATAL] Non-readable POM /home/jenkins/.m2/repository/org/junit/junit-bom/5.10.3/junit-bom-5.10.3.pom: input contained no data @ /home/jenkins/.m2/repository/org/junit/junit-bom/5.10.3/junit-bom-5.10.3.pom
[ERROR] 'dependencies.dependency.version' for org.jboss.shrinkwrap.resolver:shrinkwrap-resolver-depchain:pom is missing. @ line 124, column 17
[WARNING] 'dependencies.dependency.scope' for org.junit:junit-bom:pom must be one of [provided, compile, runtime, test, system] but is 'import'. @ line 43, column 20
[WARNING] 'dependencies.dependency.scope' for org.junit:junit-bom:pom must be one of [provided, compile, runtime, test, system] but is 'import'. @ line 44, column 20
at PluginClassLoader for maven-plugin//org.apache.maven.project.DefaultProjectBuilder.build(DefaultProjectBuilder.java:397)
at PluginClassLoader for maven-plugin//hudson.maven.MavenEmbedder.buildProjects(MavenEmbedder.java:370)
at PluginClassLoader for maven-plugin//hudson.maven.MavenEmbedder.readProjects(MavenEmbedder.java:340)
at PluginClassLoader for maven-plugin//hudson.maven.MavenModuleSetBuild$PomParser.invoke(MavenModuleSetBuild.java:1330)
... 10 more
Build failed in Jenkins: TomEE » master-build-full #2320
Posted by Apache Jenkins Server <je...@builds.apache.org>.
See <https://ci-builds.apache.org/job/Tomee/job/master-build-full/2320/display/redirect>
Changes:
------------------------------------------
Started by timer
Running as SYSTEM
[EnvInject] - Loading node environment variables.
Building remotely on builds37 (ubuntu) in workspace <https://ci-builds.apache.org/job/Tomee/job/master-build-full/ws/>
The recommended git tool is: NONE
No credentials specified
> git rev-parse --resolve-git-dir <https://ci-builds.apache.org/job/Tomee/job/master-build-full/ws/.git> # timeout=10
Fetching changes from the remote Git repository
> git config remote.origin.url https://github.com/apache/tomee # timeout=10
Cleaning workspace
> git rev-parse --verify HEAD # timeout=10
Resetting working tree
> git reset --hard # timeout=10
> git clean -fdx # timeout=10
Fetching upstream changes from https://github.com/apache/tomee
> git --version # timeout=10
> git --version # 'git version 2.34.1'
> git fetch --tags --force --progress -- https://github.com/apache/tomee +refs/heads/*:refs/remotes/origin/* # timeout=10
> git rev-parse refs/remotes/origin/main^{commit} # timeout=10
Checking out Revision c90600ece534802be81f9fc1b5008cd3a37333f1 (refs/remotes/origin/main)
> git config core.sparsecheckout # timeout=10
> git checkout -f c90600ece534802be81f9fc1b5008cd3a37333f1 # timeout=10
Commit message: "use properties for the Hibernate libraries of the Jakarta Data TCK"
> git rev-list --no-walk c90600ece534802be81f9fc1b5008cd3a37333f1 # timeout=10
[master-build-full] $ /bin/sh -xe /tmp/jenkins3131399013893916733.sh
+ rm -rf /home/jenkins/.m2/repository/org/apache
Parsing POMs
Downloaded artifact https://repository.apache.org/content/repositories/releases/org/apache/apache/40/apache-40.pom
Downloaded artifact https://repo.maven.apache.org/maven2/org/apache/maven/maven/3.5.2/maven-3.5.2.pom
Downloaded artifact https://repo.maven.apache.org/maven2/org/apache/maven/maven-parent/27/maven-parent-27.pom
Downloaded artifact https://repo.maven.apache.org/maven2/org/apache/apache/17/apache-17.pom
Downloaded artifact https://repo.maven.apache.org/maven2/org/apache/maven/maven/3.9.9/maven-3.9.9.pom
Downloaded artifact https://repo.maven.apache.org/maven2/org/apache/maven/maven-parent/43/maven-parent-43.pom
Downloaded artifact https://repo.maven.apache.org/maven2/org/apache/apache/33/apache-33.pom
ERROR: Failed to parse POMs
hudson.remoting.ProxyException: hudson.maven.MavenModuleSetBuild$MavenExecutionException: org.apache.maven.project.ProjectBuildingException: Some problems were encountered while processing the POMs:
[FATAL] Non-readable POM /home/jenkins/.m2/repository/org/junit/junit-bom/5.10.3/junit-bom-5.10.3.pom: input contained no data @ /home/jenkins/.m2/repository/org/junit/junit-bom/5.10.3/junit-bom-5.10.3.pom
[ERROR] 'dependencies.dependency.version' for org.jboss.shrinkwrap.resolver:shrinkwrap-resolver-depchain:pom is missing. @ line 98, column 17
[FATAL] Non-readable POM /home/jenkins/.m2/repository/org/junit/junit-bom/5.10.3/junit-bom-5.10.3.pom: input contained no data @ /home/jenkins/.m2/repository/org/junit/junit-bom/5.10.3/junit-bom-5.10.3.pom
[ERROR] 'dependencies.dependency.version' for org.jboss.shrinkwrap.resolver:shrinkwrap-resolver-depchain:pom is missing. @ line 121, column 17
[FATAL] Non-readable POM /home/jenkins/.m2/repository/org/junit/junit-bom/5.10.3/junit-bom-5.10.3.pom: input contained no data @ /home/jenkins/.m2/repository/org/junit/junit-bom/5.10.3/junit-bom-5.10.3.pom
[ERROR] 'dependencies.dependency.version' for org.jboss.shrinkwrap.resolver:shrinkwrap-resolver-depchain:pom is missing. @ line 146, column 17
[FATAL] Non-readable POM /home/jenkins/.m2/repository/org/junit/junit-bom/5.10.3/junit-bom-5.10.3.pom: input contained no data @ /home/jenkins/.m2/repository/org/junit/junit-bom/5.10.3/junit-bom-5.10.3.pom
[ERROR] 'dependencies.dependency.version' for org.jboss.shrinkwrap.resolver:shrinkwrap-resolver-depchain:pom is missing. @ line 111, column 21
[FATAL] Non-readable POM /home/jenkins/.m2/repository/org/junit/junit-bom/5.10.3/junit-bom-5.10.3.pom: input contained no data @ /home/jenkins/.m2/repository/org/junit/junit-bom/5.10.3/junit-bom-5.10.3.pom
[ERROR] 'dependencies.dependency.version' for org.jboss.shrinkwrap.resolver:shrinkwrap-resolver-depchain:pom is missing. @ line 129, column 17
[FATAL] Non-readable POM /home/jenkins/.m2/repository/org/junit/junit-bom/5.10.3/junit-bom-5.10.3.pom: input contained no data @ /home/jenkins/.m2/repository/org/junit/junit-bom/5.10.3/junit-bom-5.10.3.pom
[ERROR] 'dependencies.dependency.version' for org.jboss.shrinkwrap.resolver:shrinkwrap-resolver-depchain:pom is missing. @ line 129, column 17
[FATAL] Non-readable POM /home/jenkins/.m2/repository/org/junit/junit-bom/5.10.3/junit-bom-5.10.3.pom: input contained no data @ /home/jenkins/.m2/repository/org/junit/junit-bom/5.10.3/junit-bom-5.10.3.pom
[ERROR] 'dependencies.dependency.version' for org.jboss.shrinkwrap.resolver:shrinkwrap-resolver-depchain:pom is missing. @ line 125, column 17
[FATAL] Non-readable POM /home/jenkins/.m2/repository/org/junit/junit-bom/5.10.3/junit-bom-5.10.3.pom: input contained no data @ /home/jenkins/.m2/repository/org/junit/junit-bom/5.10.3/junit-bom-5.10.3.pom
[ERROR] 'dependencies.dependency.version' for org.jboss.shrinkwrap.resolver:shrinkwrap-resolver-depchain:pom is missing. @ line 154, column 17
[FATAL] Non-readable POM /home/jenkins/.m2/repository/org/junit/junit-bom/5.10.3/junit-bom-5.10.3.pom: input contained no data @ /home/jenkins/.m2/repository/org/junit/junit-bom/5.10.3/junit-bom-5.10.3.pom
[ERROR] 'dependencies.dependency.version' for org.jboss.shrinkwrap.resolver:shrinkwrap-resolver-depchain:pom is missing. @ line 112, column 17
[WARNING] 'build.plugins.plugin.version' for org.codehaus.mojo:build-helper-maven-plugin is missing. @ line 42, column 15
[WARNING] 'build.plugins.plugin.version' for org.codehaus.mojo:build-helper-maven-plugin is missing. @ line 45, column 15
[FATAL] Non-readable POM /home/jenkins/.m2/repository/org/junit/junit-bom/5.10.3/junit-bom-5.10.3.pom: input contained no data @ /home/jenkins/.m2/repository/org/junit/junit-bom/5.10.3/junit-bom-5.10.3.pom
[ERROR] 'dependencies.dependency.version' for org.jboss.shrinkwrap.resolver:shrinkwrap-resolver-depchain:pom is missing. @ line 77, column 17
[FATAL] Non-readable POM /home/jenkins/.m2/repository/org/junit/junit-bom/5.10.3/junit-bom-5.10.3.pom: input contained no data @ /home/jenkins/.m2/repository/org/junit/junit-bom/5.10.3/junit-bom-5.10.3.pom
[ERROR] 'dependencies.dependency.version' for org.jboss.shrinkwrap.resolver:shrinkwrap-resolver-depchain:pom is missing. @ line 186, column 17
[FATAL] Non-readable POM /home/jenkins/.m2/repository/org/junit/junit-bom/5.10.3/junit-bom-5.10.3.pom: input contained no data @ /home/jenkins/.m2/repository/org/junit/junit-bom/5.10.3/junit-bom-5.10.3.pom
[ERROR] 'dependencies.dependency.version' for org.jboss.shrinkwrap.resolver:shrinkwrap-resolver-depchain:pom is missing. @ line 169, column 17
[FATAL] Non-readable POM /home/jenkins/.m2/repository/org/junit/junit-bom/5.10.3/junit-bom-5.10.3.pom: input contained no data @ /home/jenkins/.m2/repository/org/junit/junit-bom/5.10.3/junit-bom-5.10.3.pom
[ERROR] 'dependencies.dependency.version' for org.jboss.shrinkwrap.resolver:shrinkwrap-resolver-depchain:pom is missing. @ line 124, column 17
[WARNING] 'dependencies.dependency.scope' for org.junit:junit-bom:pom must be one of [provided, compile, runtime, test, system] but is 'import'. @ line 43, column 20
[WARNING] 'dependencies.dependency.scope' for org.junit:junit-bom:pom must be one of [provided, compile, runtime, test, system] but is 'import'. @ line 44, column 20
at PluginClassLoader for maven-plugin//hudson.maven.MavenModuleSetBuild$PomParser.invoke(MavenModuleSetBuild.java:1391)
at PluginClassLoader for maven-plugin//hudson.maven.MavenModuleSetBuild$PomParser.invoke(MavenModuleSetBuild.java:1124)
at hudson.FilePath$FileCallableWrapper.call(FilePath.java:3614)
at hudson.remoting.UserRequest.perform(UserRequest.java:225)
at hudson.remoting.UserRequest.perform(UserRequest.java:50)
at hudson.remoting.Request$2.run(Request.java:391)
at hudson.remoting.InterceptingExecutorService.lambda$wrap$0(InterceptingExecutorService.java:81)
at java.base/java.util.concurrent.FutureTask.run(FutureTask.java:264)
at java.base/java.util.concurrent.ThreadPoolExecutor.runWorker(ThreadPoolExecutor.java:1136)
at java.base/java.util.concurrent.ThreadPoolExecutor$Worker.run(ThreadPoolExecutor.java:635)
at java.base/java.lang.Thread.run(Thread.java:840)
Suppressed: hudson.remoting.Channel$CallSiteStackTrace: Remote call to builds37
at hudson.remoting.Channel.attachCallSiteStackTrace(Channel.java:1923)
at hudson.remoting.UserRequest$ExceptionResponse.retrieve(UserRequest.java:384)
at hudson.remoting.Channel.call(Channel.java:1112)
at hudson.FilePath.act(FilePath.java:1228)
at hudson.FilePath.act(FilePath.java:1217)
at PluginClassLoader for maven-plugin//hudson.maven.MavenModuleSetBuild$MavenModuleSetBuildExecution.parsePoms(MavenModuleSetBuild.java:985)
at PluginClassLoader for maven-plugin//hudson.maven.MavenModuleSetBuild$MavenModuleSetBuildExecution.doRun(MavenModuleSetBuild.java:689)
at hudson.model.AbstractBuild$AbstractBuildExecution.run(AbstractBuild.java:527)
at hudson.model.Run.execute(Run.java:1833)
at PluginClassLoader for maven-plugin//hudson.maven.MavenModuleSetBuild.run(MavenModuleSetBuild.java:543)
at hudson.model.ResourceController.execute(ResourceController.java:101)
at hudson.model.Executor.run(Executor.java:446)
Caused by: hudson.remoting.ProxyException: org.apache.maven.project.ProjectBuildingException: Some problems were encountered while processing the POMs:
[FATAL] Non-readable POM /home/jenkins/.m2/repository/org/junit/junit-bom/5.10.3/junit-bom-5.10.3.pom: input contained no data @ /home/jenkins/.m2/repository/org/junit/junit-bom/5.10.3/junit-bom-5.10.3.pom
[ERROR] 'dependencies.dependency.version' for org.jboss.shrinkwrap.resolver:shrinkwrap-resolver-depchain:pom is missing. @ line 98, column 17
[FATAL] Non-readable POM /home/jenkins/.m2/repository/org/junit/junit-bom/5.10.3/junit-bom-5.10.3.pom: input contained no data @ /home/jenkins/.m2/repository/org/junit/junit-bom/5.10.3/junit-bom-5.10.3.pom
[ERROR] 'dependencies.dependency.version' for org.jboss.shrinkwrap.resolver:shrinkwrap-resolver-depchain:pom is missing. @ line 121, column 17
[FATAL] Non-readable POM /home/jenkins/.m2/repository/org/junit/junit-bom/5.10.3/junit-bom-5.10.3.pom: input contained no data @ /home/jenkins/.m2/repository/org/junit/junit-bom/5.10.3/junit-bom-5.10.3.pom
[ERROR] 'dependencies.dependency.version' for org.jboss.shrinkwrap.resolver:shrinkwrap-resolver-depchain:pom is missing. @ line 146, column 17
[FATAL] Non-readable POM /home/jenkins/.m2/repository/org/junit/junit-bom/5.10.3/junit-bom-5.10.3.pom: input contained no data @ /home/jenkins/.m2/repository/org/junit/junit-bom/5.10.3/junit-bom-5.10.3.pom
[ERROR] 'dependencies.dependency.version' for org.jboss.shrinkwrap.resolver:shrinkwrap-resolver-depchain:pom is missing. @ line 111, column 21
[FATAL] Non-readable POM /home/jenkins/.m2/repository/org/junit/junit-bom/5.10.3/junit-bom-5.10.3.pom: input contained no data @ /home/jenkins/.m2/repository/org/junit/junit-bom/5.10.3/junit-bom-5.10.3.pom
[ERROR] 'dependencies.dependency.version' for org.jboss.shrinkwrap.resolver:shrinkwrap-resolver-depchain:pom is missing. @ line 129, column 17
[FATAL] Non-readable POM /home/jenkins/.m2/repository/org/junit/junit-bom/5.10.3/junit-bom-5.10.3.pom: input contained no data @ /home/jenkins/.m2/repository/org/junit/junit-bom/5.10.3/junit-bom-5.10.3.pom
[ERROR] 'dependencies.dependency.version' for org.jboss.shrinkwrap.resolver:shrinkwrap-resolver-depchain:pom is missing. @ line 129, column 17
[FATAL] Non-readable POM /home/jenkins/.m2/repository/org/junit/junit-bom/5.10.3/junit-bom-5.10.3.pom: input contained no data @ /home/jenkins/.m2/repository/org/junit/junit-bom/5.10.3/junit-bom-5.10.3.pom
[ERROR] 'dependencies.dependency.version' for org.jboss.shrinkwrap.resolver:shrinkwrap-resolver-depchain:pom is missing. @ line 125, column 17
[FATAL] Non-readable POM /home/jenkins/.m2/repository/org/junit/junit-bom/5.10.3/junit-bom-5.10.3.pom: input contained no data @ /home/jenkins/.m2/repository/org/junit/junit-bom/5.10.3/junit-bom-5.10.3.pom
[ERROR] 'dependencies.dependency.version' for org.jboss.shrinkwrap.resolver:shrinkwrap-resolver-depchain:pom is missing. @ line 154, column 17
[FATAL] Non-readable POM /home/jenkins/.m2/repository/org/junit/junit-bom/5.10.3/junit-bom-5.10.3.pom: input contained no data @ /home/jenkins/.m2/repository/org/junit/junit-bom/5.10.3/junit-bom-5.10.3.pom
[ERROR] 'dependencies.dependency.version' for org.jboss.shrinkwrap.resolver:shrinkwrap-resolver-depchain:pom is missing. @ line 112, column 17
[WARNING] 'build.plugins.plugin.version' for org.codehaus.mojo:build-helper-maven-plugin is missing. @ line 42, column 15
[WARNING] 'build.plugins.plugin.version' for org.codehaus.mojo:build-helper-maven-plugin is missing. @ line 45, column 15
[FATAL] Non-readable POM /home/jenkins/.m2/repository/org/junit/junit-bom/5.10.3/junit-bom-5.10.3.pom: input contained no data @ /home/jenkins/.m2/repository/org/junit/junit-bom/5.10.3/junit-bom-5.10.3.pom
[ERROR] 'dependencies.dependency.version' for org.jboss.shrinkwrap.resolver:shrinkwrap-resolver-depchain:pom is missing. @ line 77, column 17
[FATAL] Non-readable POM /home/jenkins/.m2/repository/org/junit/junit-bom/5.10.3/junit-bom-5.10.3.pom: input contained no data @ /home/jenkins/.m2/repository/org/junit/junit-bom/5.10.3/junit-bom-5.10.3.pom
[ERROR] 'dependencies.dependency.version' for org.jboss.shrinkwrap.resolver:shrinkwrap-resolver-depchain:pom is missing. @ line 186, column 17
[FATAL] Non-readable POM /home/jenkins/.m2/repository/org/junit/junit-bom/5.10.3/junit-bom-5.10.3.pom: input contained no data @ /home/jenkins/.m2/repository/org/junit/junit-bom/5.10.3/junit-bom-5.10.3.pom
[ERROR] 'dependencies.dependency.version' for org.jboss.shrinkwrap.resolver:shrinkwrap-resolver-depchain:pom is missing. @ line 169, column 17
[FATAL] Non-readable POM /home/jenkins/.m2/repository/org/junit/junit-bom/5.10.3/junit-bom-5.10.3.pom: input contained no data @ /home/jenkins/.m2/repository/org/junit/junit-bom/5.10.3/junit-bom-5.10.3.pom
[ERROR] 'dependencies.dependency.version' for org.jboss.shrinkwrap.resolver:shrinkwrap-resolver-depchain:pom is missing. @ line 124, column 17
[WARNING] 'dependencies.dependency.scope' for org.junit:junit-bom:pom must be one of [provided, compile, runtime, test, system] but is 'import'. @ line 43, column 20
[WARNING] 'dependencies.dependency.scope' for org.junit:junit-bom:pom must be one of [provided, compile, runtime, test, system] but is 'import'. @ line 44, column 20
at PluginClassLoader for maven-plugin//org.apache.maven.project.DefaultProjectBuilder.build(DefaultProjectBuilder.java:397)
at PluginClassLoader for maven-plugin//hudson.maven.MavenEmbedder.buildProjects(MavenEmbedder.java:370)
at PluginClassLoader for maven-plugin//hudson.maven.MavenEmbedder.readProjects(MavenEmbedder.java:340)
at PluginClassLoader for maven-plugin//hudson.maven.MavenModuleSetBuild$PomParser.invoke(MavenModuleSetBuild.java:1330)
... 10 more
Build failed in Jenkins: TomEE » master-build-full #2319
Posted by Apache Jenkins Server <je...@builds.apache.org>.
See <https://ci-builds.apache.org/job/Tomee/job/master-build-full/2319/display/redirect?page=changes>
Changes:
[github] Align the Jakarta Data TCK Hibernate libraries with hibernate-core 7.4.11 (#3089)
[Richard Zowalla] use properties for the Hibernate libraries of the Jakarta Data TCK
------------------------------------------
Started by timer
Running as SYSTEM
[EnvInject] - Loading node environment variables.
Building remotely on builds37 (ubuntu) in workspace <https://ci-builds.apache.org/job/Tomee/job/master-build-full/ws/>
The recommended git tool is: NONE
No credentials specified
> git rev-parse --resolve-git-dir <https://ci-builds.apache.org/job/Tomee/job/master-build-full/ws/.git> # timeout=10
Fetching changes from the remote Git repository
> git config remote.origin.url https://github.com/apache/tomee # timeout=10
Cleaning workspace
> git rev-parse --verify HEAD # timeout=10
Resetting working tree
> git reset --hard # timeout=10
> git clean -fdx # timeout=10
Fetching upstream changes from https://github.com/apache/tomee
> git --version # timeout=10
> git --version # 'git version 2.34.1'
> git fetch --tags --force --progress -- https://github.com/apache/tomee +refs/heads/*:refs/remotes/origin/* # timeout=10
> git rev-parse refs/remotes/origin/main^{commit} # timeout=10
Checking out Revision c90600ece534802be81f9fc1b5008cd3a37333f1 (refs/remotes/origin/main)
> git config core.sparsecheckout # timeout=10
> git checkout -f c90600ece534802be81f9fc1b5008cd3a37333f1 # timeout=10
Commit message: "use properties for the Hibernate libraries of the Jakarta Data TCK"
> git rev-list --no-walk 1d72919b50ebd447fe839d9b9dfa36add82e206e # timeout=10
[master-build-full] $ /bin/sh -xe /tmp/jenkins5347349538773699002.sh
+ rm -rf /home/jenkins/.m2/repository/org/apache
Parsing POMs
Downloaded artifact https://repository.apache.org/content/repositories/releases/org/apache/apache/40/apache-40.pom
Downloaded artifact https://repo.maven.apache.org/maven2/org/apache/maven/maven/3.5.2/maven-3.5.2.pom
Downloaded artifact https://repo.maven.apache.org/maven2/org/apache/maven/maven-parent/27/maven-parent-27.pom
Downloaded artifact https://repo.maven.apache.org/maven2/org/apache/apache/17/apache-17.pom
Downloaded artifact https://repo.maven.apache.org/maven2/org/apache/maven/maven/3.9.9/maven-3.9.9.pom
Downloaded artifact https://repo.maven.apache.org/maven2/org/apache/maven/maven-parent/43/maven-parent-43.pom
Downloaded artifact https://repo.maven.apache.org/maven2/org/apache/apache/33/apache-33.pom
ERROR: Failed to parse POMs
hudson.remoting.ProxyException: hudson.maven.MavenModuleSetBuild$MavenExecutionException: org.apache.maven.project.ProjectBuildingException: Some problems were encountered while processing the POMs:
[FATAL] Non-readable POM /home/jenkins/.m2/repository/org/junit/junit-bom/5.10.3/junit-bom-5.10.3.pom: input contained no data @ /home/jenkins/.m2/repository/org/junit/junit-bom/5.10.3/junit-bom-5.10.3.pom
[ERROR] 'dependencies.dependency.version' for org.jboss.shrinkwrap.resolver:shrinkwrap-resolver-depchain:pom is missing. @ line 98, column 17
[FATAL] Non-readable POM /home/jenkins/.m2/repository/org/junit/junit-bom/5.10.3/junit-bom-5.10.3.pom: input contained no data @ /home/jenkins/.m2/repository/org/junit/junit-bom/5.10.3/junit-bom-5.10.3.pom
[ERROR] 'dependencies.dependency.version' for org.jboss.shrinkwrap.resolver:shrinkwrap-resolver-depchain:pom is missing. @ line 121, column 17
[FATAL] Non-readable POM /home/jenkins/.m2/repository/org/junit/junit-bom/5.10.3/junit-bom-5.10.3.pom: input contained no data @ /home/jenkins/.m2/repository/org/junit/junit-bom/5.10.3/junit-bom-5.10.3.pom
[ERROR] 'dependencies.dependency.version' for org.jboss.shrinkwrap.resolver:shrinkwrap-resolver-depchain:pom is missing. @ line 146, column 17
[FATAL] Non-readable POM /home/jenkins/.m2/repository/org/junit/junit-bom/5.10.3/junit-bom-5.10.3.pom: input contained no data @ /home/jenkins/.m2/repository/org/junit/junit-bom/5.10.3/junit-bom-5.10.3.pom
[ERROR] 'dependencies.dependency.version' for org.jboss.shrinkwrap.resolver:shrinkwrap-resolver-depchain:pom is missing. @ line 111, column 21
[FATAL] Non-readable POM /home/jenkins/.m2/repository/org/junit/junit-bom/5.10.3/junit-bom-5.10.3.pom: input contained no data @ /home/jenkins/.m2/repository/org/junit/junit-bom/5.10.3/junit-bom-5.10.3.pom
[ERROR] 'dependencies.dependency.version' for org.jboss.shrinkwrap.resolver:shrinkwrap-resolver-depchain:pom is missing. @ line 129, column 17
[FATAL] Non-readable POM /home/jenkins/.m2/repository/org/junit/junit-bom/5.10.3/junit-bom-5.10.3.pom: input contained no data @ /home/jenkins/.m2/repository/org/junit/junit-bom/5.10.3/junit-bom-5.10.3.pom
[ERROR] 'dependencies.dependency.version' for org.jboss.shrinkwrap.resolver:shrinkwrap-resolver-depchain:pom is missing. @ line 129, column 17
[FATAL] Non-readable POM /home/jenkins/.m2/repository/org/junit/junit-bom/5.10.3/junit-bom-5.10.3.pom: input contained no data @ /home/jenkins/.m2/repository/org/junit/junit-bom/5.10.3/junit-bom-5.10.3.pom
[ERROR] 'dependencies.dependency.version' for org.jboss.shrinkwrap.resolver:shrinkwrap-resolver-depchain:pom is missing. @ line 125, column 17
[FATAL] Non-readable POM /home/jenkins/.m2/repository/org/junit/junit-bom/5.10.3/junit-bom-5.10.3.pom: input contained no data @ /home/jenkins/.m2/repository/org/junit/junit-bom/5.10.3/junit-bom-5.10.3.pom
[ERROR] 'dependencies.dependency.version' for org.jboss.shrinkwrap.resolver:shrinkwrap-resolver-depchain:pom is missing. @ line 154, column 17
[FATAL] Non-readable POM /home/jenkins/.m2/repository/org/junit/junit-bom/5.10.3/junit-bom-5.10.3.pom: input contained no data @ /home/jenkins/.m2/repository/org/junit/junit-bom/5.10.3/junit-bom-5.10.3.pom
[ERROR] 'dependencies.dependency.version' for org.jboss.shrinkwrap.resolver:shrinkwrap-resolver-depchain:pom is missing. @ line 112, column 17
[WARNING] 'build.plugins.plugin.version' for org.codehaus.mojo:build-helper-maven-plugin is missing. @ line 42, column 15
[WARNING] 'build.plugins.plugin.version' for org.codehaus.mojo:build-helper-maven-plugin is missing. @ line 45, column 15
[FATAL] Non-readable POM /home/jenkins/.m2/repository/org/junit/junit-bom/5.10.3/junit-bom-5.10.3.pom: input contained no data @ /home/jenkins/.m2/repository/org/junit/junit-bom/5.10.3/junit-bom-5.10.3.pom
[ERROR] 'dependencies.dependency.version' for org.jboss.shrinkwrap.resolver:shrinkwrap-resolver-depchain:pom is missing. @ line 77, column 17
[FATAL] Non-readable POM /home/jenkins/.m2/repository/org/junit/junit-bom/5.10.3/junit-bom-5.10.3.pom: input contained no data @ /home/jenkins/.m2/repository/org/junit/junit-bom/5.10.3/junit-bom-5.10.3.pom
[ERROR] 'dependencies.dependency.version' for org.jboss.shrinkwrap.resolver:shrinkwrap-resolver-depchain:pom is missing. @ line 186, column 17
[FATAL] Non-readable POM /home/jenkins/.m2/repository/org/junit/junit-bom/5.10.3/junit-bom-5.10.3.pom: input contained no data @ /home/jenkins/.m2/repository/org/junit/junit-bom/5.10.3/junit-bom-5.10.3.pom
[ERROR] 'dependencies.dependency.version' for org.jboss.shrinkwrap.resolver:shrinkwrap-resolver-depchain:pom is missing. @ line 169, column 17
[FATAL] Non-readable POM /home/jenkins/.m2/repository/org/junit/junit-bom/5.10.3/junit-bom-5.10.3.pom: input contained no data @ /home/jenkins/.m2/repository/org/junit/junit-bom/5.10.3/junit-bom-5.10.3.pom
[ERROR] 'dependencies.dependency.version' for org.jboss.shrinkwrap.resolver:shrinkwrap-resolver-depchain:pom is missing. @ line 124, column 17
[WARNING] 'dependencies.dependency.scope' for org.junit:junit-bom:pom must be one of [provided, compile, runtime, test, system] but is 'import'. @ line 43, column 20
[WARNING] 'dependencies.dependency.scope' for org.junit:junit-bom:pom must be one of [provided, compile, runtime, test, system] but is 'import'. @ line 44, column 20
at PluginClassLoader for maven-plugin//hudson.maven.MavenModuleSetBuild$PomParser.invoke(MavenModuleSetBuild.java:1391)
at PluginClassLoader for maven-plugin//hudson.maven.MavenModuleSetBuild$PomParser.invoke(MavenModuleSetBuild.java:1124)
at hudson.FilePath$FileCallableWrapper.call(FilePath.java:3614)
at hudson.remoting.UserRequest.perform(UserRequest.java:225)
at hudson.remoting.UserRequest.perform(UserRequest.java:50)
at hudson.remoting.Request$2.run(Request.java:391)
at hudson.remoting.InterceptingExecutorService.lambda$wrap$0(InterceptingExecutorService.java:81)
at java.base/java.util.concurrent.FutureTask.run(FutureTask.java:264)
at java.base/java.util.concurrent.ThreadPoolExecutor.runWorker(ThreadPoolExecutor.java:1136)
at java.base/java.util.concurrent.ThreadPoolExecutor$Worker.run(ThreadPoolExecutor.java:635)
at java.base/java.lang.Thread.run(Thread.java:840)
Suppressed: hudson.remoting.Channel$CallSiteStackTrace: Remote call to builds37
at hudson.remoting.Channel.attachCallSiteStackTrace(Channel.java:1923)
at hudson.remoting.UserRequest$ExceptionResponse.retrieve(UserRequest.java:384)
at hudson.remoting.Channel.call(Channel.java:1112)
at hudson.FilePath.act(FilePath.java:1228)
at hudson.FilePath.act(FilePath.java:1217)
at PluginClassLoader for maven-plugin//hudson.maven.MavenModuleSetBuild$MavenModuleSetBuildExecution.parsePoms(MavenModuleSetBuild.java:985)
at PluginClassLoader for maven-plugin//hudson.maven.MavenModuleSetBuild$MavenModuleSetBuildExecution.doRun(MavenModuleSetBuild.java:689)
at hudson.model.AbstractBuild$AbstractBuildExecution.run(AbstractBuild.java:527)
at hudson.model.Run.execute(Run.java:1833)
at PluginClassLoader for maven-plugin//hudson.maven.MavenModuleSetBuild.run(MavenModuleSetBuild.java:543)
at hudson.model.ResourceController.execute(ResourceController.java:101)
at hudson.model.Executor.run(Executor.java:446)
Caused by: hudson.remoting.ProxyException: org.apache.maven.project.ProjectBuildingException: Some problems were encountered while processing the POMs:
[FATAL] Non-readable POM /home/jenkins/.m2/repository/org/junit/junit-bom/5.10.3/junit-bom-5.10.3.pom: input contained no data @ /home/jenkins/.m2/repository/org/junit/junit-bom/5.10.3/junit-bom-5.10.3.pom
[ERROR] 'dependencies.dependency.version' for org.jboss.shrinkwrap.resolver:shrinkwrap-resolver-depchain:pom is missing. @ line 98, column 17
[FATAL] Non-readable POM /home/jenkins/.m2/repository/org/junit/junit-bom/5.10.3/junit-bom-5.10.3.pom: input contained no data @ /home/jenkins/.m2/repository/org/junit/junit-bom/5.10.3/junit-bom-5.10.3.pom
[ERROR] 'dependencies.dependency.version' for org.jboss.shrinkwrap.resolver:shrinkwrap-resolver-depchain:pom is missing. @ line 121, column 17
[FATAL] Non-readable POM /home/jenkins/.m2/repository/org/junit/junit-bom/5.10.3/junit-bom-5.10.3.pom: input contained no data @ /home/jenkins/.m2/repository/org/junit/junit-bom/5.10.3/junit-bom-5.10.3.pom
[ERROR] 'dependencies.dependency.version' for org.jboss.shrinkwrap.resolver:shrinkwrap-resolver-depchain:pom is missing. @ line 146, column 17
[FATAL] Non-readable POM /home/jenkins/.m2/repository/org/junit/junit-bom/5.10.3/junit-bom-5.10.3.pom: input contained no data @ /home/jenkins/.m2/repository/org/junit/junit-bom/5.10.3/junit-bom-5.10.3.pom
[ERROR] 'dependencies.dependency.version' for org.jboss.shrinkwrap.resolver:shrinkwrap-resolver-depchain:pom is missing. @ line 111, column 21
[FATAL] Non-readable POM /home/jenkins/.m2/repository/org/junit/junit-bom/5.10.3/junit-bom-5.10.3.pom: input contained no data @ /home/jenkins/.m2/repository/org/junit/junit-bom/5.10.3/junit-bom-5.10.3.pom
[ERROR] 'dependencies.dependency.version' for org.jboss.shrinkwrap.resolver:shrinkwrap-resolver-depchain:pom is missing. @ line 129, column 17
[FATAL] Non-readable POM /home/jenkins/.m2/repository/org/junit/junit-bom/5.10.3/junit-bom-5.10.3.pom: input contained no data @ /home/jenkins/.m2/repository/org/junit/junit-bom/5.10.3/junit-bom-5.10.3.pom
[ERROR] 'dependencies.dependency.version' for org.jboss.shrinkwrap.resolver:shrinkwrap-resolver-depchain:pom is missing. @ line 129, column 17
[FATAL] Non-readable POM /home/jenkins/.m2/repository/org/junit/junit-bom/5.10.3/junit-bom-5.10.3.pom: input contained no data @ /home/jenkins/.m2/repository/org/junit/junit-bom/5.10.3/junit-bom-5.10.3.pom
[ERROR] 'dependencies.dependency.version' for org.jboss.shrinkwrap.resolver:shrinkwrap-resolver-depchain:pom is missing. @ line 125, column 17
[FATAL] Non-readable POM /home/jenkins/.m2/repository/org/junit/junit-bom/5.10.3/junit-bom-5.10.3.pom: input contained no data @ /home/jenkins/.m2/repository/org/junit/junit-bom/5.10.3/junit-bom-5.10.3.pom
[ERROR] 'dependencies.dependency.version' for org.jboss.shrinkwrap.resolver:shrinkwrap-resolver-depchain:pom is missing. @ line 154, column 17
[FATAL] Non-readable POM /home/jenkins/.m2/repository/org/junit/junit-bom/5.10.3/junit-bom-5.10.3.pom: input contained no data @ /home/jenkins/.m2/repository/org/junit/junit-bom/5.10.3/junit-bom-5.10.3.pom
[ERROR] 'dependencies.dependency.version' for org.jboss.shrinkwrap.resolver:shrinkwrap-resolver-depchain:pom is missing. @ line 112, column 17
[WARNING] 'build.plugins.plugin.version' for org.codehaus.mojo:build-helper-maven-plugin is missing. @ line 42, column 15
[WARNING] 'build.plugins.plugin.version' for org.codehaus.mojo:build-helper-maven-plugin is missing. @ line 45, column 15
[FATAL] Non-readable POM /home/jenkins/.m2/repository/org/junit/junit-bom/5.10.3/junit-bom-5.10.3.pom: input contained no data @ /home/jenkins/.m2/repository/org/junit/junit-bom/5.10.3/junit-bom-5.10.3.pom
[ERROR] 'dependencies.dependency.version' for org.jboss.shrinkwrap.resolver:shrinkwrap-resolver-depchain:pom is missing. @ line 77, column 17
[FATAL] Non-readable POM /home/jenkins/.m2/repository/org/junit/junit-bom/5.10.3/junit-bom-5.10.3.pom: input contained no data @ /home/jenkins/.m2/repository/org/junit/junit-bom/5.10.3/junit-bom-5.10.3.pom
[ERROR] 'dependencies.dependency.version' for org.jboss.shrinkwrap.resolver:shrinkwrap-resolver-depchain:pom is missing. @ line 186, column 17
[FATAL] Non-readable POM /home/jenkins/.m2/repository/org/junit/junit-bom/5.10.3/junit-bom-5.10.3.pom: input contained no data @ /home/jenkins/.m2/repository/org/junit/junit-bom/5.10.3/junit-bom-5.10.3.pom
[ERROR] 'dependencies.dependency.version' for org.jboss.shrinkwrap.resolver:shrinkwrap-resolver-depchain:pom is missing. @ line 169, column 17
[FATAL] Non-readable POM /home/jenkins/.m2/repository/org/junit/junit-bom/5.10.3/junit-bom-5.10.3.pom: input contained no data @ /home/jenkins/.m2/repository/org/junit/junit-bom/5.10.3/junit-bom-5.10.3.pom
[ERROR] 'dependencies.dependency.version' for org.jboss.shrinkwrap.resolver:shrinkwrap-resolver-depchain:pom is missing. @ line 124, column 17
[WARNING] 'dependencies.dependency.scope' for org.junit:junit-bom:pom must be one of [provided, compile, runtime, test, system] but is 'import'. @ line 43, column 20
[WARNING] 'dependencies.dependency.scope' for org.junit:junit-bom:pom must be one of [provided, compile, runtime, test, system] but is 'import'. @ line 44, column 20
at PluginClassLoader for maven-plugin//org.apache.maven.project.DefaultProjectBuilder.build(DefaultProjectBuilder.java:397)
at PluginClassLoader for maven-plugin//hudson.maven.MavenEmbedder.buildProjects(MavenEmbedder.java:370)
at PluginClassLoader for maven-plugin//hudson.maven.MavenEmbedder.readProjects(MavenEmbedder.java:340)
at PluginClassLoader for maven-plugin//hudson.maven.MavenModuleSetBuild$PomParser.invoke(MavenModuleSetBuild.java:1330)
... 10 more
Build failed in Jenkins: TomEE » master-build-full #2318
Posted by Apache Jenkins Server <je...@builds.apache.org>.
See <https://ci-builds.apache.org/job/Tomee/job/master-build-full/2318/display/redirect>
Changes:
------------------------------------------
Started by user Richard Zowalla
Running as SYSTEM
[EnvInject] - Loading node environment variables.
Building remotely on builds37 (ubuntu) in workspace <https://ci-builds.apache.org/job/Tomee/job/master-build-full/ws/>
The recommended git tool is: NONE
No credentials specified
> git rev-parse --resolve-git-dir <https://ci-builds.apache.org/job/Tomee/job/master-build-full/ws/.git> # timeout=10
Fetching changes from the remote Git repository
> git config remote.origin.url https://github.com/apache/tomee # timeout=10
Cleaning workspace
> git rev-parse --verify HEAD # timeout=10
Resetting working tree
> git reset --hard # timeout=10
> git clean -fdx # timeout=10
Fetching upstream changes from https://github.com/apache/tomee
> git --version # timeout=10
> git --version # 'git version 2.34.1'
> git fetch --tags --force --progress -- https://github.com/apache/tomee +refs/heads/*:refs/remotes/origin/* # timeout=10
> git rev-parse refs/remotes/origin/main^{commit} # timeout=10
Checking out Revision 1d72919b50ebd447fe839d9b9dfa36add82e206e (refs/remotes/origin/main)
> git config core.sparsecheckout # timeout=10
> git checkout -f 1d72919b50ebd447fe839d9b9dfa36add82e206e # timeout=10
Commit message: "make the scan exclusion and async MP-JWT tests independent of their environment (#3088)"
> git rev-list --no-walk 1d72919b50ebd447fe839d9b9dfa36add82e206e # timeout=10
[master-build-full] $ /bin/sh -xe /tmp/jenkins3419274219879922761.sh
+ rm -rf /home/jenkins/.m2/repository/org/apache
Parsing POMs
Downloaded artifact https://repository.apache.org/content/repositories/releases/org/apache/apache/40/apache-40.pom
Downloaded artifact https://repo.maven.apache.org/maven2/org/apache/maven/maven/3.5.2/maven-3.5.2.pom
Downloaded artifact https://repo.maven.apache.org/maven2/org/apache/maven/maven-parent/27/maven-parent-27.pom
Downloaded artifact https://repo.maven.apache.org/maven2/org/apache/apache/17/apache-17.pom
Downloaded artifact https://repo.maven.apache.org/maven2/org/apache/maven/maven/3.9.9/maven-3.9.9.pom
Downloaded artifact https://repo.maven.apache.org/maven2/org/apache/maven/maven-parent/43/maven-parent-43.pom
Downloaded artifact https://repo.maven.apache.org/maven2/org/apache/apache/33/apache-33.pom
ERROR: Failed to parse POMs
hudson.remoting.ProxyException: hudson.maven.MavenModuleSetBuild$MavenExecutionException: org.apache.maven.project.ProjectBuildingException: Some problems were encountered while processing the POMs:
[FATAL] Non-readable POM /home/jenkins/.m2/repository/org/junit/junit-bom/5.10.3/junit-bom-5.10.3.pom: input contained no data @ /home/jenkins/.m2/repository/org/junit/junit-bom/5.10.3/junit-bom-5.10.3.pom
[ERROR] 'dependencies.dependency.version' for org.jboss.shrinkwrap.resolver:shrinkwrap-resolver-depchain:pom is missing. @ line 98, column 17
[FATAL] Non-readable POM /home/jenkins/.m2/repository/org/junit/junit-bom/5.10.3/junit-bom-5.10.3.pom: input contained no data @ /home/jenkins/.m2/repository/org/junit/junit-bom/5.10.3/junit-bom-5.10.3.pom
[ERROR] 'dependencies.dependency.version' for org.jboss.shrinkwrap.resolver:shrinkwrap-resolver-depchain:pom is missing. @ line 121, column 17
[FATAL] Non-readable POM /home/jenkins/.m2/repository/org/junit/junit-bom/5.10.3/junit-bom-5.10.3.pom: input contained no data @ /home/jenkins/.m2/repository/org/junit/junit-bom/5.10.3/junit-bom-5.10.3.pom
[ERROR] 'dependencies.dependency.version' for org.jboss.shrinkwrap.resolver:shrinkwrap-resolver-depchain:pom is missing. @ line 146, column 17
[FATAL] Non-readable POM /home/jenkins/.m2/repository/org/junit/junit-bom/5.10.3/junit-bom-5.10.3.pom: input contained no data @ /home/jenkins/.m2/repository/org/junit/junit-bom/5.10.3/junit-bom-5.10.3.pom
[ERROR] 'dependencies.dependency.version' for org.jboss.shrinkwrap.resolver:shrinkwrap-resolver-depchain:pom is missing. @ line 111, column 21
[FATAL] Non-readable POM /home/jenkins/.m2/repository/org/junit/junit-bom/5.10.3/junit-bom-5.10.3.pom: input contained no data @ /home/jenkins/.m2/repository/org/junit/junit-bom/5.10.3/junit-bom-5.10.3.pom
[ERROR] 'dependencies.dependency.version' for org.jboss.shrinkwrap.resolver:shrinkwrap-resolver-depchain:pom is missing. @ line 129, column 17
[FATAL] Non-readable POM /home/jenkins/.m2/repository/org/junit/junit-bom/5.10.3/junit-bom-5.10.3.pom: input contained no data @ /home/jenkins/.m2/repository/org/junit/junit-bom/5.10.3/junit-bom-5.10.3.pom
[ERROR] 'dependencies.dependency.version' for org.jboss.shrinkwrap.resolver:shrinkwrap-resolver-depchain:pom is missing. @ line 129, column 17
[FATAL] Non-readable POM /home/jenkins/.m2/repository/org/junit/junit-bom/5.10.3/junit-bom-5.10.3.pom: input contained no data @ /home/jenkins/.m2/repository/org/junit/junit-bom/5.10.3/junit-bom-5.10.3.pom
[ERROR] 'dependencies.dependency.version' for org.jboss.shrinkwrap.resolver:shrinkwrap-resolver-depchain:pom is missing. @ line 125, column 17
[FATAL] Non-readable POM /home/jenkins/.m2/repository/org/junit/junit-bom/5.10.3/junit-bom-5.10.3.pom: input contained no data @ /home/jenkins/.m2/repository/org/junit/junit-bom/5.10.3/junit-bom-5.10.3.pom
[ERROR] 'dependencies.dependency.version' for org.jboss.shrinkwrap.resolver:shrinkwrap-resolver-depchain:pom is missing. @ line 154, column 17
[FATAL] Non-readable POM /home/jenkins/.m2/repository/org/junit/junit-bom/5.10.3/junit-bom-5.10.3.pom: input contained no data @ /home/jenkins/.m2/repository/org/junit/junit-bom/5.10.3/junit-bom-5.10.3.pom
[ERROR] 'dependencies.dependency.version' for org.jboss.shrinkwrap.resolver:shrinkwrap-resolver-depchain:pom is missing. @ line 112, column 17
[WARNING] 'build.plugins.plugin.version' for org.codehaus.mojo:build-helper-maven-plugin is missing. @ line 42, column 15
[WARNING] 'build.plugins.plugin.version' for org.codehaus.mojo:build-helper-maven-plugin is missing. @ line 45, column 15
[FATAL] Non-readable POM /home/jenkins/.m2/repository/org/junit/junit-bom/5.10.3/junit-bom-5.10.3.pom: input contained no data @ /home/jenkins/.m2/repository/org/junit/junit-bom/5.10.3/junit-bom-5.10.3.pom
[ERROR] 'dependencies.dependency.version' for org.jboss.shrinkwrap.resolver:shrinkwrap-resolver-depchain:pom is missing. @ line 77, column 17
[FATAL] Non-readable POM /home/jenkins/.m2/repository/org/junit/junit-bom/5.10.3/junit-bom-5.10.3.pom: input contained no data @ /home/jenkins/.m2/repository/org/junit/junit-bom/5.10.3/junit-bom-5.10.3.pom
[ERROR] 'dependencies.dependency.version' for org.jboss.shrinkwrap.resolver:shrinkwrap-resolver-depchain:pom is missing. @ line 186, column 17
[FATAL] Non-readable POM /home/jenkins/.m2/repository/org/junit/junit-bom/5.10.3/junit-bom-5.10.3.pom: input contained no data @ /home/jenkins/.m2/repository/org/junit/junit-bom/5.10.3/junit-bom-5.10.3.pom
[ERROR] 'dependencies.dependency.version' for org.jboss.shrinkwrap.resolver:shrinkwrap-resolver-depchain:pom is missing. @ line 169, column 17
[FATAL] Non-readable POM /home/jenkins/.m2/repository/org/junit/junit-bom/5.10.3/junit-bom-5.10.3.pom: input contained no data @ /home/jenkins/.m2/repository/org/junit/junit-bom/5.10.3/junit-bom-5.10.3.pom
[ERROR] 'dependencies.dependency.version' for org.jboss.shrinkwrap.resolver:shrinkwrap-resolver-depchain:pom is missing. @ line 124, column 17
[WARNING] 'dependencies.dependency.scope' for org.junit:junit-bom:pom must be one of [provided, compile, runtime, test, system] but is 'import'. @ line 43, column 20
[WARNING] 'dependencies.dependency.scope' for org.junit:junit-bom:pom must be one of [provided, compile, runtime, test, system] but is 'import'. @ line 44, column 20
at PluginClassLoader for maven-plugin//hudson.maven.MavenModuleSetBuild$PomParser.invoke(MavenModuleSetBuild.java:1391)
at PluginClassLoader for maven-plugin//hudson.maven.MavenModuleSetBuild$PomParser.invoke(MavenModuleSetBuild.java:1124)
at hudson.FilePath$FileCallableWrapper.call(FilePath.java:3614)
at hudson.remoting.UserRequest.perform(UserRequest.java:225)
at hudson.remoting.UserRequest.perform(UserRequest.java:50)
at hudson.remoting.Request$2.run(Request.java:391)
at hudson.remoting.InterceptingExecutorService.lambda$wrap$0(InterceptingExecutorService.java:81)
at java.base/java.util.concurrent.FutureTask.run(FutureTask.java:264)
at java.base/java.util.concurrent.ThreadPoolExecutor.runWorker(ThreadPoolExecutor.java:1136)
at java.base/java.util.concurrent.ThreadPoolExecutor$Worker.run(ThreadPoolExecutor.java:635)
at java.base/java.lang.Thread.run(Thread.java:840)
Suppressed: hudson.remoting.Channel$CallSiteStackTrace: Remote call to builds37
at hudson.remoting.Channel.attachCallSiteStackTrace(Channel.java:1923)
at hudson.remoting.UserRequest$ExceptionResponse.retrieve(UserRequest.java:384)
at hudson.remoting.Channel.call(Channel.java:1112)
at hudson.FilePath.act(FilePath.java:1228)
at hudson.FilePath.act(FilePath.java:1217)
at PluginClassLoader for maven-plugin//hudson.maven.MavenModuleSetBuild$MavenModuleSetBuildExecution.parsePoms(MavenModuleSetBuild.java:985)
at PluginClassLoader for maven-plugin//hudson.maven.MavenModuleSetBuild$MavenModuleSetBuildExecution.doRun(MavenModuleSetBuild.java:689)
at hudson.model.AbstractBuild$AbstractBuildExecution.run(AbstractBuild.java:527)
at hudson.model.Run.execute(Run.java:1833)
at PluginClassLoader for maven-plugin//hudson.maven.MavenModuleSetBuild.run(MavenModuleSetBuild.java:543)
at hudson.model.ResourceController.execute(ResourceController.java:101)
at hudson.model.Executor.run(Executor.java:446)
Caused by: hudson.remoting.ProxyException: org.apache.maven.project.ProjectBuildingException: Some problems were encountered while processing the POMs:
[FATAL] Non-readable POM /home/jenkins/.m2/repository/org/junit/junit-bom/5.10.3/junit-bom-5.10.3.pom: input contained no data @ /home/jenkins/.m2/repository/org/junit/junit-bom/5.10.3/junit-bom-5.10.3.pom
[ERROR] 'dependencies.dependency.version' for org.jboss.shrinkwrap.resolver:shrinkwrap-resolver-depchain:pom is missing. @ line 98, column 17
[FATAL] Non-readable POM /home/jenkins/.m2/repository/org/junit/junit-bom/5.10.3/junit-bom-5.10.3.pom: input contained no data @ /home/jenkins/.m2/repository/org/junit/junit-bom/5.10.3/junit-bom-5.10.3.pom
[ERROR] 'dependencies.dependency.version' for org.jboss.shrinkwrap.resolver:shrinkwrap-resolver-depchain:pom is missing. @ line 121, column 17
[FATAL] Non-readable POM /home/jenkins/.m2/repository/org/junit/junit-bom/5.10.3/junit-bom-5.10.3.pom: input contained no data @ /home/jenkins/.m2/repository/org/junit/junit-bom/5.10.3/junit-bom-5.10.3.pom
[ERROR] 'dependencies.dependency.version' for org.jboss.shrinkwrap.resolver:shrinkwrap-resolver-depchain:pom is missing. @ line 146, column 17
[FATAL] Non-readable POM /home/jenkins/.m2/repository/org/junit/junit-bom/5.10.3/junit-bom-5.10.3.pom: input contained no data @ /home/jenkins/.m2/repository/org/junit/junit-bom/5.10.3/junit-bom-5.10.3.pom
[ERROR] 'dependencies.dependency.version' for org.jboss.shrinkwrap.resolver:shrinkwrap-resolver-depchain:pom is missing. @ line 111, column 21
[FATAL] Non-readable POM /home/jenkins/.m2/repository/org/junit/junit-bom/5.10.3/junit-bom-5.10.3.pom: input contained no data @ /home/jenkins/.m2/repository/org/junit/junit-bom/5.10.3/junit-bom-5.10.3.pom
[ERROR] 'dependencies.dependency.version' for org.jboss.shrinkwrap.resolver:shrinkwrap-resolver-depchain:pom is missing. @ line 129, column 17
[FATAL] Non-readable POM /home/jenkins/.m2/repository/org/junit/junit-bom/5.10.3/junit-bom-5.10.3.pom: input contained no data @ /home/jenkins/.m2/repository/org/junit/junit-bom/5.10.3/junit-bom-5.10.3.pom
[ERROR] 'dependencies.dependency.version' for org.jboss.shrinkwrap.resolver:shrinkwrap-resolver-depchain:pom is missing. @ line 129, column 17
[FATAL] Non-readable POM /home/jenkins/.m2/repository/org/junit/junit-bom/5.10.3/junit-bom-5.10.3.pom: input contained no data @ /home/jenkins/.m2/repository/org/junit/junit-bom/5.10.3/junit-bom-5.10.3.pom
[ERROR] 'dependencies.dependency.version' for org.jboss.shrinkwrap.resolver:shrinkwrap-resolver-depchain:pom is missing. @ line 125, column 17
[FATAL] Non-readable POM /home/jenkins/.m2/repository/org/junit/junit-bom/5.10.3/junit-bom-5.10.3.pom: input contained no data @ /home/jenkins/.m2/repository/org/junit/junit-bom/5.10.3/junit-bom-5.10.3.pom
[ERROR] 'dependencies.dependency.version' for org.jboss.shrinkwrap.resolver:shrinkwrap-resolver-depchain:pom is missing. @ line 154, column 17
[FATAL] Non-readable POM /home/jenkins/.m2/repository/org/junit/junit-bom/5.10.3/junit-bom-5.10.3.pom: input contained no data @ /home/jenkins/.m2/repository/org/junit/junit-bom/5.10.3/junit-bom-5.10.3.pom
[ERROR] 'dependencies.dependency.version' for org.jboss.shrinkwrap.resolver:shrinkwrap-resolver-depchain:pom is missing. @ line 112, column 17
[WARNING] 'build.plugins.plugin.version' for org.codehaus.mojo:build-helper-maven-plugin is missing. @ line 42, column 15
[WARNING] 'build.plugins.plugin.version' for org.codehaus.mojo:build-helper-maven-plugin is missing. @ line 45, column 15
[FATAL] Non-readable POM /home/jenkins/.m2/repository/org/junit/junit-bom/5.10.3/junit-bom-5.10.3.pom: input contained no data @ /home/jenkins/.m2/repository/org/junit/junit-bom/5.10.3/junit-bom-5.10.3.pom
[ERROR] 'dependencies.dependency.version' for org.jboss.shrinkwrap.resolver:shrinkwrap-resolver-depchain:pom is missing. @ line 77, column 17
[FATAL] Non-readable POM /home/jenkins/.m2/repository/org/junit/junit-bom/5.10.3/junit-bom-5.10.3.pom: input contained no data @ /home/jenkins/.m2/repository/org/junit/junit-bom/5.10.3/junit-bom-5.10.3.pom
[ERROR] 'dependencies.dependency.version' for org.jboss.shrinkwrap.resolver:shrinkwrap-resolver-depchain:pom is missing. @ line 186, column 17
[FATAL] Non-readable POM /home/jenkins/.m2/repository/org/junit/junit-bom/5.10.3/junit-bom-5.10.3.pom: input contained no data @ /home/jenkins/.m2/repository/org/junit/junit-bom/5.10.3/junit-bom-5.10.3.pom
[ERROR] 'dependencies.dependency.version' for org.jboss.shrinkwrap.resolver:shrinkwrap-resolver-depchain:pom is missing. @ line 169, column 17
[FATAL] Non-readable POM /home/jenkins/.m2/repository/org/junit/junit-bom/5.10.3/junit-bom-5.10.3.pom: input contained no data @ /home/jenkins/.m2/repository/org/junit/junit-bom/5.10.3/junit-bom-5.10.3.pom
[ERROR] 'dependencies.dependency.version' for org.jboss.shrinkwrap.resolver:shrinkwrap-resolver-depchain:pom is missing. @ line 124, column 17
[WARNING] 'dependencies.dependency.scope' for org.junit:junit-bom:pom must be one of [provided, compile, runtime, test, system] but is 'import'. @ line 43, column 20
[WARNING] 'dependencies.dependency.scope' for org.junit:junit-bom:pom must be one of [provided, compile, runtime, test, system] but is 'import'. @ line 44, column 20
at PluginClassLoader for maven-plugin//org.apache.maven.project.DefaultProjectBuilder.build(DefaultProjectBuilder.java:397)
at PluginClassLoader for maven-plugin//hudson.maven.MavenEmbedder.buildProjects(MavenEmbedder.java:370)
at PluginClassLoader for maven-plugin//hudson.maven.MavenEmbedder.readProjects(MavenEmbedder.java:340)
at PluginClassLoader for maven-plugin//hudson.maven.MavenModuleSetBuild$PomParser.invoke(MavenModuleSetBuild.java:1330)
... 10 more
Build failed in Jenkins: TomEE » master-build-full #2317
Posted by Apache Jenkins Server <je...@builds.apache.org>.
See <https://ci-builds.apache.org/job/Tomee/job/master-build-full/2317/display/redirect>
Changes:
------------------------------------------
Started by user Richard Zowalla
Running as SYSTEM
[EnvInject] - Loading node environment variables.
Building remotely on builds37 (ubuntu) in workspace <https://ci-builds.apache.org/job/Tomee/job/master-build-full/ws/>
The recommended git tool is: NONE
No credentials specified
> git rev-parse --resolve-git-dir <https://ci-builds.apache.org/job/Tomee/job/master-build-full/ws/.git> # timeout=10
Fetching changes from the remote Git repository
> git config remote.origin.url https://github.com/apache/tomee # timeout=10
Cleaning workspace
> git rev-parse --verify HEAD # timeout=10
Resetting working tree
> git reset --hard # timeout=10
> git clean -fdx # timeout=10
Fetching upstream changes from https://github.com/apache/tomee
> git --version # timeout=10
> git --version # 'git version 2.34.1'
> git fetch --tags --force --progress -- https://github.com/apache/tomee +refs/heads/*:refs/remotes/origin/* # timeout=10
> git rev-parse refs/remotes/origin/main^{commit} # timeout=10
Checking out Revision 1d72919b50ebd447fe839d9b9dfa36add82e206e (refs/remotes/origin/main)
> git config core.sparsecheckout # timeout=10
> git checkout -f 1d72919b50ebd447fe839d9b9dfa36add82e206e # timeout=10
Commit message: "make the scan exclusion and async MP-JWT tests independent of their environment (#3088)"
> git rev-list --no-walk 1d72919b50ebd447fe839d9b9dfa36add82e206e # timeout=10
Parsing POMs
ERROR: Failed to parse POMs
hudson.remoting.ProxyException: hudson.maven.MavenModuleSetBuild$MavenExecutionException: org.apache.maven.project.ProjectBuildingException: Some problems were encountered while processing the POMs:
[FATAL] Non-readable POM /home/jenkins/.m2/repository/org/apache/maven/maven-parent/43/maven-parent-43.pom: input contained no data @ /home/jenkins/.m2/repository/org/apache/maven/maven-parent/43/maven-parent-43.pom
[ERROR] 'dependencies.dependency.version' for org.jboss.shrinkwrap.resolver:shrinkwrap-resolver-depchain:pom is missing. @ line 98, column 17
[FATAL] Non-readable POM /home/jenkins/.m2/repository/org/apache/maven/maven-parent/43/maven-parent-43.pom: input contained no data @ /home/jenkins/.m2/repository/org/apache/maven/maven-parent/43/maven-parent-43.pom
[ERROR] 'dependencies.dependency.version' for org.jboss.shrinkwrap.resolver:shrinkwrap-resolver-depchain:pom is missing. @ line 121, column 17
[FATAL] Non-readable POM /home/jenkins/.m2/repository/org/apache/maven/maven-parent/43/maven-parent-43.pom: input contained no data @ /home/jenkins/.m2/repository/org/apache/maven/maven-parent/43/maven-parent-43.pom
[ERROR] 'dependencies.dependency.version' for org.jboss.shrinkwrap.resolver:shrinkwrap-resolver-depchain:pom is missing. @ line 146, column 17
[FATAL] Non-readable POM /home/jenkins/.m2/repository/org/apache/maven/maven-parent/43/maven-parent-43.pom: input contained no data @ /home/jenkins/.m2/repository/org/apache/maven/maven-parent/43/maven-parent-43.pom
[ERROR] 'dependencies.dependency.version' for org.jboss.shrinkwrap.resolver:shrinkwrap-resolver-depchain:pom is missing. @ line 111, column 21
[FATAL] Non-readable POM /home/jenkins/.m2/repository/org/apache/maven/maven-parent/43/maven-parent-43.pom: input contained no data @ /home/jenkins/.m2/repository/org/apache/maven/maven-parent/43/maven-parent-43.pom
[ERROR] 'dependencies.dependency.version' for org.jboss.shrinkwrap.resolver:shrinkwrap-resolver-depchain:pom is missing. @ line 129, column 17
[FATAL] Non-readable POM /home/jenkins/.m2/repository/org/apache/maven/maven-parent/43/maven-parent-43.pom: input contained no data @ /home/jenkins/.m2/repository/org/apache/maven/maven-parent/43/maven-parent-43.pom
[ERROR] 'dependencies.dependency.version' for org.jboss.shrinkwrap.resolver:shrinkwrap-resolver-depchain:pom is missing. @ line 129, column 17
[FATAL] Non-readable POM /home/jenkins/.m2/repository/org/apache/maven/maven-parent/43/maven-parent-43.pom: input contained no data @ /home/jenkins/.m2/repository/org/apache/maven/maven-parent/43/maven-parent-43.pom
[ERROR] 'dependencies.dependency.version' for org.jboss.shrinkwrap.resolver:shrinkwrap-resolver-depchain:pom is missing. @ line 125, column 17
[FATAL] Non-readable POM /home/jenkins/.m2/repository/org/apache/maven/maven-parent/43/maven-parent-43.pom: input contained no data @ /home/jenkins/.m2/repository/org/apache/maven/maven-parent/43/maven-parent-43.pom
[ERROR] 'dependencies.dependency.version' for org.jboss.shrinkwrap.resolver:shrinkwrap-resolver-depchain:pom is missing. @ line 154, column 17
[FATAL] Non-readable POM /home/jenkins/.m2/repository/org/apache/maven/maven-parent/43/maven-parent-43.pom: input contained no data @ /home/jenkins/.m2/repository/org/apache/maven/maven-parent/43/maven-parent-43.pom
[ERROR] 'dependencies.dependency.version' for org.jboss.shrinkwrap.resolver:shrinkwrap-resolver-depchain:pom is missing. @ line 112, column 17
[WARNING] 'build.plugins.plugin.version' for org.codehaus.mojo:build-helper-maven-plugin is missing. @ line 42, column 15
[WARNING] 'build.plugins.plugin.version' for org.codehaus.mojo:build-helper-maven-plugin is missing. @ line 45, column 15
[FATAL] Non-readable POM /home/jenkins/.m2/repository/org/apache/maven/maven-parent/43/maven-parent-43.pom: input contained no data @ /home/jenkins/.m2/repository/org/apache/maven/maven-parent/43/maven-parent-43.pom
[ERROR] 'dependencies.dependency.version' for org.jboss.shrinkwrap.resolver:shrinkwrap-resolver-depchain:pom is missing. @ line 77, column 17
[FATAL] Non-readable POM /home/jenkins/.m2/repository/org/apache/maven/maven-parent/43/maven-parent-43.pom: input contained no data @ /home/jenkins/.m2/repository/org/apache/maven/maven-parent/43/maven-parent-43.pom
[ERROR] 'dependencies.dependency.version' for org.jboss.shrinkwrap.resolver:shrinkwrap-resolver-depchain:pom is missing. @ line 186, column 17
[FATAL] Non-readable POM /home/jenkins/.m2/repository/org/apache/maven/maven-parent/43/maven-parent-43.pom: input contained no data @ /home/jenkins/.m2/repository/org/apache/maven/maven-parent/43/maven-parent-43.pom
[ERROR] 'dependencies.dependency.version' for org.jboss.shrinkwrap.resolver:shrinkwrap-resolver-depchain:pom is missing. @ line 169, column 17
[FATAL] Non-readable POM /home/jenkins/.m2/repository/org/apache/maven/maven-parent/43/maven-parent-43.pom: input contained no data @ /home/jenkins/.m2/repository/org/apache/maven/maven-parent/43/maven-parent-43.pom
[ERROR] 'dependencies.dependency.version' for org.jboss.shrinkwrap.resolver:shrinkwrap-resolver-depchain:pom is missing. @ line 124, column 17
[WARNING] 'dependencies.dependency.scope' for org.junit:junit-bom:pom must be one of [provided, compile, runtime, test, system] but is 'import'. @ line 43, column 20
[WARNING] 'dependencies.dependency.scope' for org.junit:junit-bom:pom must be one of [provided, compile, runtime, test, system] but is 'import'. @ line 44, column 20
at PluginClassLoader for maven-plugin//hudson.maven.MavenModuleSetBuild$PomParser.invoke(MavenModuleSetBuild.java:1391)
at PluginClassLoader for maven-plugin//hudson.maven.MavenModuleSetBuild$PomParser.invoke(MavenModuleSetBuild.java:1124)
at hudson.FilePath$FileCallableWrapper.call(FilePath.java:3614)
at hudson.remoting.UserRequest.perform(UserRequest.java:225)
at hudson.remoting.UserRequest.perform(UserRequest.java:50)
at hudson.remoting.Request$2.run(Request.java:391)
at hudson.remoting.InterceptingExecutorService.lambda$wrap$0(InterceptingExecutorService.java:81)
at java.base/java.util.concurrent.FutureTask.run(FutureTask.java:264)
at java.base/java.util.concurrent.ThreadPoolExecutor.runWorker(ThreadPoolExecutor.java:1136)
at java.base/java.util.concurrent.ThreadPoolExecutor$Worker.run(ThreadPoolExecutor.java:635)
at java.base/java.lang.Thread.run(Thread.java:840)
Suppressed: hudson.remoting.Channel$CallSiteStackTrace: Remote call to builds37
at hudson.remoting.Channel.attachCallSiteStackTrace(Channel.java:1923)
at hudson.remoting.UserRequest$ExceptionResponse.retrieve(UserRequest.java:384)
at hudson.remoting.Channel.call(Channel.java:1112)
at hudson.FilePath.act(FilePath.java:1228)
at hudson.FilePath.act(FilePath.java:1217)
at PluginClassLoader for maven-plugin//hudson.maven.MavenModuleSetBuild$MavenModuleSetBuildExecution.parsePoms(MavenModuleSetBuild.java:985)
at PluginClassLoader for maven-plugin//hudson.maven.MavenModuleSetBuild$MavenModuleSetBuildExecution.doRun(MavenModuleSetBuild.java:689)
at hudson.model.AbstractBuild$AbstractBuildExecution.run(AbstractBuild.java:527)
at hudson.model.Run.execute(Run.java:1833)
at PluginClassLoader for maven-plugin//hudson.maven.MavenModuleSetBuild.run(MavenModuleSetBuild.java:543)
at hudson.model.ResourceController.execute(ResourceController.java:101)
at hudson.model.Executor.run(Executor.java:446)
Caused by: hudson.remoting.ProxyException: org.apache.maven.project.ProjectBuildingException: Some problems were encountered while processing the POMs:
[FATAL] Non-readable POM /home/jenkins/.m2/repository/org/apache/maven/maven-parent/43/maven-parent-43.pom: input contained no data @ /home/jenkins/.m2/repository/org/apache/maven/maven-parent/43/maven-parent-43.pom
[ERROR] 'dependencies.dependency.version' for org.jboss.shrinkwrap.resolver:shrinkwrap-resolver-depchain:pom is missing. @ line 98, column 17
[FATAL] Non-readable POM /home/jenkins/.m2/repository/org/apache/maven/maven-parent/43/maven-parent-43.pom: input contained no data @ /home/jenkins/.m2/repository/org/apache/maven/maven-parent/43/maven-parent-43.pom
[ERROR] 'dependencies.dependency.version' for org.jboss.shrinkwrap.resolver:shrinkwrap-resolver-depchain:pom is missing. @ line 121, column 17
[FATAL] Non-readable POM /home/jenkins/.m2/repository/org/apache/maven/maven-parent/43/maven-parent-43.pom: input contained no data @ /home/jenkins/.m2/repository/org/apache/maven/maven-parent/43/maven-parent-43.pom
[ERROR] 'dependencies.dependency.version' for org.jboss.shrinkwrap.resolver:shrinkwrap-resolver-depchain:pom is missing. @ line 146, column 17
[FATAL] Non-readable POM /home/jenkins/.m2/repository/org/apache/maven/maven-parent/43/maven-parent-43.pom: input contained no data @ /home/jenkins/.m2/repository/org/apache/maven/maven-parent/43/maven-parent-43.pom
[ERROR] 'dependencies.dependency.version' for org.jboss.shrinkwrap.resolver:shrinkwrap-resolver-depchain:pom is missing. @ line 111, column 21
[FATAL] Non-readable POM /home/jenkins/.m2/repository/org/apache/maven/maven-parent/43/maven-parent-43.pom: input contained no data @ /home/jenkins/.m2/repository/org/apache/maven/maven-parent/43/maven-parent-43.pom
[ERROR] 'dependencies.dependency.version' for org.jboss.shrinkwrap.resolver:shrinkwrap-resolver-depchain:pom is missing. @ line 129, column 17
[FATAL] Non-readable POM /home/jenkins/.m2/repository/org/apache/maven/maven-parent/43/maven-parent-43.pom: input contained no data @ /home/jenkins/.m2/repository/org/apache/maven/maven-parent/43/maven-parent-43.pom
[ERROR] 'dependencies.dependency.version' for org.jboss.shrinkwrap.resolver:shrinkwrap-resolver-depchain:pom is missing. @ line 129, column 17
[FATAL] Non-readable POM /home/jenkins/.m2/repository/org/apache/maven/maven-parent/43/maven-parent-43.pom: input contained no data @ /home/jenkins/.m2/repository/org/apache/maven/maven-parent/43/maven-parent-43.pom
[ERROR] 'dependencies.dependency.version' for org.jboss.shrinkwrap.resolver:shrinkwrap-resolver-depchain:pom is missing. @ line 125, column 17
[FATAL] Non-readable POM /home/jenkins/.m2/repository/org/apache/maven/maven-parent/43/maven-parent-43.pom: input contained no data @ /home/jenkins/.m2/repository/org/apache/maven/maven-parent/43/maven-parent-43.pom
[ERROR] 'dependencies.dependency.version' for org.jboss.shrinkwrap.resolver:shrinkwrap-resolver-depchain:pom is missing. @ line 154, column 17
[FATAL] Non-readable POM /home/jenkins/.m2/repository/org/apache/maven/maven-parent/43/maven-parent-43.pom: input contained no data @ /home/jenkins/.m2/repository/org/apache/maven/maven-parent/43/maven-parent-43.pom
[ERROR] 'dependencies.dependency.version' for org.jboss.shrinkwrap.resolver:shrinkwrap-resolver-depchain:pom is missing. @ line 112, column 17
[WARNING] 'build.plugins.plugin.version' for org.codehaus.mojo:build-helper-maven-plugin is missing. @ line 42, column 15
[WARNING] 'build.plugins.plugin.version' for org.codehaus.mojo:build-helper-maven-plugin is missing. @ line 45, column 15
[FATAL] Non-readable POM /home/jenkins/.m2/repository/org/apache/maven/maven-parent/43/maven-parent-43.pom: input contained no data @ /home/jenkins/.m2/repository/org/apache/maven/maven-parent/43/maven-parent-43.pom
[ERROR] 'dependencies.dependency.version' for org.jboss.shrinkwrap.resolver:shrinkwrap-resolver-depchain:pom is missing. @ line 77, column 17
[FATAL] Non-readable POM /home/jenkins/.m2/repository/org/apache/maven/maven-parent/43/maven-parent-43.pom: input contained no data @ /home/jenkins/.m2/repository/org/apache/maven/maven-parent/43/maven-parent-43.pom
[ERROR] 'dependencies.dependency.version' for org.jboss.shrinkwrap.resolver:shrinkwrap-resolver-depchain:pom is missing. @ line 186, column 17
[FATAL] Non-readable POM /home/jenkins/.m2/repository/org/apache/maven/maven-parent/43/maven-parent-43.pom: input contained no data @ /home/jenkins/.m2/repository/org/apache/maven/maven-parent/43/maven-parent-43.pom
[ERROR] 'dependencies.dependency.version' for org.jboss.shrinkwrap.resolver:shrinkwrap-resolver-depchain:pom is missing. @ line 169, column 17
[FATAL] Non-readable POM /home/jenkins/.m2/repository/org/apache/maven/maven-parent/43/maven-parent-43.pom: input contained no data @ /home/jenkins/.m2/repository/org/apache/maven/maven-parent/43/maven-parent-43.pom
[ERROR] 'dependencies.dependency.version' for org.jboss.shrinkwrap.resolver:shrinkwrap-resolver-depchain:pom is missing. @ line 124, column 17
[WARNING] 'dependencies.dependency.scope' for org.junit:junit-bom:pom must be one of [provided, compile, runtime, test, system] but is 'import'. @ line 43, column 20
[WARNING] 'dependencies.dependency.scope' for org.junit:junit-bom:pom must be one of [provided, compile, runtime, test, system] but is 'import'. @ line 44, column 20
at PluginClassLoader for maven-plugin//org.apache.maven.project.DefaultProjectBuilder.build(DefaultProjectBuilder.java:397)
at PluginClassLoader for maven-plugin//hudson.maven.MavenEmbedder.buildProjects(MavenEmbedder.java:370)
at PluginClassLoader for maven-plugin//hudson.maven.MavenEmbedder.readProjects(MavenEmbedder.java:340)
at PluginClassLoader for maven-plugin//hudson.maven.MavenModuleSetBuild$PomParser.invoke(MavenModuleSetBuild.java:1330)
... 10 more
Build failed in Jenkins: TomEE » master-build-full #2316
Posted by Apache Jenkins Server <je...@builds.apache.org>.
See <https://ci-builds.apache.org/job/Tomee/job/master-build-full/2316/display/redirect?page=changes>
Changes:
[github] TOMEE-4730 - Apply class-level security annotations of a resource superclass (#3081)
[github] make the scan exclusion and async MP-JWT tests independent of their environment (#3088)
------------------------------------------
Started by timer
Running as SYSTEM
[EnvInject] - Loading node environment variables.
Building remotely on builds37 (ubuntu) in workspace <https://ci-builds.apache.org/job/Tomee/job/master-build-full/ws/>
The recommended git tool is: NONE
No credentials specified
> git rev-parse --resolve-git-dir <https://ci-builds.apache.org/job/Tomee/job/master-build-full/ws/.git> # timeout=10
Fetching changes from the remote Git repository
> git config remote.origin.url https://github.com/apache/tomee # timeout=10
Cleaning workspace
> git rev-parse --verify HEAD # timeout=10
Resetting working tree
> git reset --hard # timeout=10
> git clean -fdx # timeout=10
Fetching upstream changes from https://github.com/apache/tomee
> git --version # timeout=10
> git --version # 'git version 2.34.1'
> git fetch --tags --force --progress -- https://github.com/apache/tomee +refs/heads/*:refs/remotes/origin/* # timeout=10
> git rev-parse refs/remotes/origin/main^{commit} # timeout=10
Checking out Revision 1d72919b50ebd447fe839d9b9dfa36add82e206e (refs/remotes/origin/main)
> git config core.sparsecheckout # timeout=10
> git checkout -f 1d72919b50ebd447fe839d9b9dfa36add82e206e # timeout=10
Commit message: "make the scan exclusion and async MP-JWT tests independent of their environment (#3088)"
> git rev-list --no-walk 0fb057efe6e322538a8c30ddfa7401a4c0835793 # timeout=10
Parsing POMs
ERROR: Failed to parse POMs
hudson.remoting.ProxyException: hudson.maven.MavenModuleSetBuild$MavenExecutionException: org.apache.maven.project.ProjectBuildingException: Some problems were encountered while processing the POMs:
[FATAL] Non-readable POM /home/jenkins/.m2/repository/org/apache/maven/maven-parent/43/maven-parent-43.pom: input contained no data @ /home/jenkins/.m2/repository/org/apache/maven/maven-parent/43/maven-parent-43.pom
[ERROR] 'dependencies.dependency.version' for org.jboss.shrinkwrap.resolver:shrinkwrap-resolver-depchain:pom is missing. @ line 98, column 17
[FATAL] Non-readable POM /home/jenkins/.m2/repository/org/apache/maven/maven-parent/43/maven-parent-43.pom: input contained no data @ /home/jenkins/.m2/repository/org/apache/maven/maven-parent/43/maven-parent-43.pom
[ERROR] 'dependencies.dependency.version' for org.jboss.shrinkwrap.resolver:shrinkwrap-resolver-depchain:pom is missing. @ line 121, column 17
[FATAL] Non-readable POM /home/jenkins/.m2/repository/org/apache/maven/maven-parent/43/maven-parent-43.pom: input contained no data @ /home/jenkins/.m2/repository/org/apache/maven/maven-parent/43/maven-parent-43.pom
[ERROR] 'dependencies.dependency.version' for org.jboss.shrinkwrap.resolver:shrinkwrap-resolver-depchain:pom is missing. @ line 146, column 17
[FATAL] Non-readable POM /home/jenkins/.m2/repository/org/apache/maven/maven-parent/43/maven-parent-43.pom: input contained no data @ /home/jenkins/.m2/repository/org/apache/maven/maven-parent/43/maven-parent-43.pom
[ERROR] 'dependencies.dependency.version' for org.jboss.shrinkwrap.resolver:shrinkwrap-resolver-depchain:pom is missing. @ line 111, column 21
[FATAL] Non-readable POM /home/jenkins/.m2/repository/org/apache/maven/maven-parent/43/maven-parent-43.pom: input contained no data @ /home/jenkins/.m2/repository/org/apache/maven/maven-parent/43/maven-parent-43.pom
[ERROR] 'dependencies.dependency.version' for org.jboss.shrinkwrap.resolver:shrinkwrap-resolver-depchain:pom is missing. @ line 129, column 17
[FATAL] Non-readable POM /home/jenkins/.m2/repository/org/apache/maven/maven-parent/43/maven-parent-43.pom: input contained no data @ /home/jenkins/.m2/repository/org/apache/maven/maven-parent/43/maven-parent-43.pom
[ERROR] 'dependencies.dependency.version' for org.jboss.shrinkwrap.resolver:shrinkwrap-resolver-depchain:pom is missing. @ line 129, column 17
[FATAL] Non-readable POM /home/jenkins/.m2/repository/org/apache/maven/maven-parent/43/maven-parent-43.pom: input contained no data @ /home/jenkins/.m2/repository/org/apache/maven/maven-parent/43/maven-parent-43.pom
[ERROR] 'dependencies.dependency.version' for org.jboss.shrinkwrap.resolver:shrinkwrap-resolver-depchain:pom is missing. @ line 125, column 17
[FATAL] Non-readable POM /home/jenkins/.m2/repository/org/apache/maven/maven-parent/43/maven-parent-43.pom: input contained no data @ /home/jenkins/.m2/repository/org/apache/maven/maven-parent/43/maven-parent-43.pom
[ERROR] 'dependencies.dependency.version' for org.jboss.shrinkwrap.resolver:shrinkwrap-resolver-depchain:pom is missing. @ line 154, column 17
[FATAL] Non-readable POM /home/jenkins/.m2/repository/org/apache/maven/maven-parent/43/maven-parent-43.pom: input contained no data @ /home/jenkins/.m2/repository/org/apache/maven/maven-parent/43/maven-parent-43.pom
[ERROR] 'dependencies.dependency.version' for org.jboss.shrinkwrap.resolver:shrinkwrap-resolver-depchain:pom is missing. @ line 112, column 17
[WARNING] 'build.plugins.plugin.version' for org.codehaus.mojo:build-helper-maven-plugin is missing. @ line 42, column 15
[WARNING] 'build.plugins.plugin.version' for org.codehaus.mojo:build-helper-maven-plugin is missing. @ line 45, column 15
[FATAL] Non-readable POM /home/jenkins/.m2/repository/org/apache/maven/maven-parent/43/maven-parent-43.pom: input contained no data @ /home/jenkins/.m2/repository/org/apache/maven/maven-parent/43/maven-parent-43.pom
[ERROR] 'dependencies.dependency.version' for org.jboss.shrinkwrap.resolver:shrinkwrap-resolver-depchain:pom is missing. @ line 77, column 17
[FATAL] Non-readable POM /home/jenkins/.m2/repository/org/apache/maven/maven-parent/43/maven-parent-43.pom: input contained no data @ /home/jenkins/.m2/repository/org/apache/maven/maven-parent/43/maven-parent-43.pom
[ERROR] 'dependencies.dependency.version' for org.jboss.shrinkwrap.resolver:shrinkwrap-resolver-depchain:pom is missing. @ line 186, column 17
[FATAL] Non-readable POM /home/jenkins/.m2/repository/org/apache/maven/maven-parent/43/maven-parent-43.pom: input contained no data @ /home/jenkins/.m2/repository/org/apache/maven/maven-parent/43/maven-parent-43.pom
[ERROR] 'dependencies.dependency.version' for org.jboss.shrinkwrap.resolver:shrinkwrap-resolver-depchain:pom is missing. @ line 169, column 17
[FATAL] Non-readable POM /home/jenkins/.m2/repository/org/apache/maven/maven-parent/43/maven-parent-43.pom: input contained no data @ /home/jenkins/.m2/repository/org/apache/maven/maven-parent/43/maven-parent-43.pom
[ERROR] 'dependencies.dependency.version' for org.jboss.shrinkwrap.resolver:shrinkwrap-resolver-depchain:pom is missing. @ line 124, column 17
[WARNING] 'dependencies.dependency.scope' for org.junit:junit-bom:pom must be one of [provided, compile, runtime, test, system] but is 'import'. @ line 43, column 20
[WARNING] 'dependencies.dependency.scope' for org.junit:junit-bom:pom must be one of [provided, compile, runtime, test, system] but is 'import'. @ line 44, column 20
at PluginClassLoader for maven-plugin//hudson.maven.MavenModuleSetBuild$PomParser.invoke(MavenModuleSetBuild.java:1391)
at PluginClassLoader for maven-plugin//hudson.maven.MavenModuleSetBuild$PomParser.invoke(MavenModuleSetBuild.java:1124)
at hudson.FilePath$FileCallableWrapper.call(FilePath.java:3614)
at hudson.remoting.UserRequest.perform(UserRequest.java:225)
at hudson.remoting.UserRequest.perform(UserRequest.java:50)
at hudson.remoting.Request$2.run(Request.java:391)
at hudson.remoting.InterceptingExecutorService.lambda$wrap$0(InterceptingExecutorService.java:81)
at java.base/java.util.concurrent.FutureTask.run(FutureTask.java:264)
at java.base/java.util.concurrent.ThreadPoolExecutor.runWorker(ThreadPoolExecutor.java:1136)
at java.base/java.util.concurrent.ThreadPoolExecutor$Worker.run(ThreadPoolExecutor.java:635)
at java.base/java.lang.Thread.run(Thread.java:840)
Suppressed: hudson.remoting.Channel$CallSiteStackTrace: Remote call to builds37
at hudson.remoting.Channel.attachCallSiteStackTrace(Channel.java:1923)
at hudson.remoting.UserRequest$ExceptionResponse.retrieve(UserRequest.java:384)
at hudson.remoting.Channel.call(Channel.java:1112)
at hudson.FilePath.act(FilePath.java:1228)
at hudson.FilePath.act(FilePath.java:1217)
at PluginClassLoader for maven-plugin//hudson.maven.MavenModuleSetBuild$MavenModuleSetBuildExecution.parsePoms(MavenModuleSetBuild.java:985)
at PluginClassLoader for maven-plugin//hudson.maven.MavenModuleSetBuild$MavenModuleSetBuildExecution.doRun(MavenModuleSetBuild.java:689)
at hudson.model.AbstractBuild$AbstractBuildExecution.run(AbstractBuild.java:527)
at hudson.model.Run.execute(Run.java:1833)
at PluginClassLoader for maven-plugin//hudson.maven.MavenModuleSetBuild.run(MavenModuleSetBuild.java:543)
at hudson.model.ResourceController.execute(ResourceController.java:101)
at hudson.model.Executor.run(Executor.java:446)
Caused by: hudson.remoting.ProxyException: org.apache.maven.project.ProjectBuildingException: Some problems were encountered while processing the POMs:
[FATAL] Non-readable POM /home/jenkins/.m2/repository/org/apache/maven/maven-parent/43/maven-parent-43.pom: input contained no data @ /home/jenkins/.m2/repository/org/apache/maven/maven-parent/43/maven-parent-43.pom
[ERROR] 'dependencies.dependency.version' for org.jboss.shrinkwrap.resolver:shrinkwrap-resolver-depchain:pom is missing. @ line 98, column 17
[FATAL] Non-readable POM /home/jenkins/.m2/repository/org/apache/maven/maven-parent/43/maven-parent-43.pom: input contained no data @ /home/jenkins/.m2/repository/org/apache/maven/maven-parent/43/maven-parent-43.pom
[ERROR] 'dependencies.dependency.version' for org.jboss.shrinkwrap.resolver:shrinkwrap-resolver-depchain:pom is missing. @ line 121, column 17
[FATAL] Non-readable POM /home/jenkins/.m2/repository/org/apache/maven/maven-parent/43/maven-parent-43.pom: input contained no data @ /home/jenkins/.m2/repository/org/apache/maven/maven-parent/43/maven-parent-43.pom
[ERROR] 'dependencies.dependency.version' for org.jboss.shrinkwrap.resolver:shrinkwrap-resolver-depchain:pom is missing. @ line 146, column 17
[FATAL] Non-readable POM /home/jenkins/.m2/repository/org/apache/maven/maven-parent/43/maven-parent-43.pom: input contained no data @ /home/jenkins/.m2/repository/org/apache/maven/maven-parent/43/maven-parent-43.pom
[ERROR] 'dependencies.dependency.version' for org.jboss.shrinkwrap.resolver:shrinkwrap-resolver-depchain:pom is missing. @ line 111, column 21
[FATAL] Non-readable POM /home/jenkins/.m2/repository/org/apache/maven/maven-parent/43/maven-parent-43.pom: input contained no data @ /home/jenkins/.m2/repository/org/apache/maven/maven-parent/43/maven-parent-43.pom
[ERROR] 'dependencies.dependency.version' for org.jboss.shrinkwrap.resolver:shrinkwrap-resolver-depchain:pom is missing. @ line 129, column 17
[FATAL] Non-readable POM /home/jenkins/.m2/repository/org/apache/maven/maven-parent/43/maven-parent-43.pom: input contained no data @ /home/jenkins/.m2/repository/org/apache/maven/maven-parent/43/maven-parent-43.pom
[ERROR] 'dependencies.dependency.version' for org.jboss.shrinkwrap.resolver:shrinkwrap-resolver-depchain:pom is missing. @ line 129, column 17
[FATAL] Non-readable POM /home/jenkins/.m2/repository/org/apache/maven/maven-parent/43/maven-parent-43.pom: input contained no data @ /home/jenkins/.m2/repository/org/apache/maven/maven-parent/43/maven-parent-43.pom
[ERROR] 'dependencies.dependency.version' for org.jboss.shrinkwrap.resolver:shrinkwrap-resolver-depchain:pom is missing. @ line 125, column 17
[FATAL] Non-readable POM /home/jenkins/.m2/repository/org/apache/maven/maven-parent/43/maven-parent-43.pom: input contained no data @ /home/jenkins/.m2/repository/org/apache/maven/maven-parent/43/maven-parent-43.pom
[ERROR] 'dependencies.dependency.version' for org.jboss.shrinkwrap.resolver:shrinkwrap-resolver-depchain:pom is missing. @ line 154, column 17
[FATAL] Non-readable POM /home/jenkins/.m2/repository/org/apache/maven/maven-parent/43/maven-parent-43.pom: input contained no data @ /home/jenkins/.m2/repository/org/apache/maven/maven-parent/43/maven-parent-43.pom
[ERROR] 'dependencies.dependency.version' for org.jboss.shrinkwrap.resolver:shrinkwrap-resolver-depchain:pom is missing. @ line 112, column 17
[WARNING] 'build.plugins.plugin.version' for org.codehaus.mojo:build-helper-maven-plugin is missing. @ line 42, column 15
[WARNING] 'build.plugins.plugin.version' for org.codehaus.mojo:build-helper-maven-plugin is missing. @ line 45, column 15
[FATAL] Non-readable POM /home/jenkins/.m2/repository/org/apache/maven/maven-parent/43/maven-parent-43.pom: input contained no data @ /home/jenkins/.m2/repository/org/apache/maven/maven-parent/43/maven-parent-43.pom
[ERROR] 'dependencies.dependency.version' for org.jboss.shrinkwrap.resolver:shrinkwrap-resolver-depchain:pom is missing. @ line 77, column 17
[FATAL] Non-readable POM /home/jenkins/.m2/repository/org/apache/maven/maven-parent/43/maven-parent-43.pom: input contained no data @ /home/jenkins/.m2/repository/org/apache/maven/maven-parent/43/maven-parent-43.pom
[ERROR] 'dependencies.dependency.version' for org.jboss.shrinkwrap.resolver:shrinkwrap-resolver-depchain:pom is missing. @ line 186, column 17
[FATAL] Non-readable POM /home/jenkins/.m2/repository/org/apache/maven/maven-parent/43/maven-parent-43.pom: input contained no data @ /home/jenkins/.m2/repository/org/apache/maven/maven-parent/43/maven-parent-43.pom
[ERROR] 'dependencies.dependency.version' for org.jboss.shrinkwrap.resolver:shrinkwrap-resolver-depchain:pom is missing. @ line 169, column 17
[FATAL] Non-readable POM /home/jenkins/.m2/repository/org/apache/maven/maven-parent/43/maven-parent-43.pom: input contained no data @ /home/jenkins/.m2/repository/org/apache/maven/maven-parent/43/maven-parent-43.pom
[ERROR] 'dependencies.dependency.version' for org.jboss.shrinkwrap.resolver:shrinkwrap-resolver-depchain:pom is missing. @ line 124, column 17
[WARNING] 'dependencies.dependency.scope' for org.junit:junit-bom:pom must be one of [provided, compile, runtime, test, system] but is 'import'. @ line 43, column 20
[WARNING] 'dependencies.dependency.scope' for org.junit:junit-bom:pom must be one of [provided, compile, runtime, test, system] but is 'import'. @ line 44, column 20
at PluginClassLoader for maven-plugin//org.apache.maven.project.DefaultProjectBuilder.build(DefaultProjectBuilder.java:397)
at PluginClassLoader for maven-plugin//hudson.maven.MavenEmbedder.buildProjects(MavenEmbedder.java:370)
at PluginClassLoader for maven-plugin//hudson.maven.MavenEmbedder.readProjects(MavenEmbedder.java:340)
at PluginClassLoader for maven-plugin//hudson.maven.MavenModuleSetBuild$PomParser.invoke(MavenModuleSetBuild.java:1330)
... 10 more
Build failed in Jenkins: TomEE » master-build-full #2315
Posted by Apache Jenkins Server <je...@builds.apache.org>.
See <https://ci-builds.apache.org/job/Tomee/job/master-build-full/2315/display/redirect>
Changes:
------------------------------------------
Started by user Richard Zowalla
Running as SYSTEM
[EnvInject] - Loading node environment variables.
Building remotely on builds37 (ubuntu) in workspace <https://ci-builds.apache.org/job/Tomee/job/master-build-full/ws/>
The recommended git tool is: NONE
No credentials specified
> git rev-parse --resolve-git-dir <https://ci-builds.apache.org/job/Tomee/job/master-build-full/ws/.git> # timeout=10
Fetching changes from the remote Git repository
> git config remote.origin.url https://github.com/apache/tomee # timeout=10
Cleaning workspace
> git rev-parse --verify HEAD # timeout=10
Resetting working tree
> git reset --hard # timeout=10
> git clean -fdx # timeout=10
Fetching upstream changes from https://github.com/apache/tomee
> git --version # timeout=10
> git --version # 'git version 2.34.1'
> git fetch --tags --force --progress -- https://github.com/apache/tomee +refs/heads/*:refs/remotes/origin/* # timeout=10
> git rev-parse refs/remotes/origin/main^{commit} # timeout=10
Checking out Revision 0fb057efe6e322538a8c30ddfa7401a4c0835793 (refs/remotes/origin/main)
> git config core.sparsecheckout # timeout=10
> git checkout -f 0fb057efe6e322538a8c30ddfa7401a4c0835793 # timeout=10
Commit message: "Require a secret for stop requests on the admin port (#3087)"
> git rev-list --no-walk 0fb057efe6e322538a8c30ddfa7401a4c0835793 # timeout=10
Parsing POMs
ERROR: Failed to parse POMs
hudson.remoting.ProxyException: hudson.maven.MavenModuleSetBuild$MavenExecutionException: org.apache.maven.project.ProjectBuildingException: Some problems were encountered while processing the POMs:
[FATAL] Non-readable POM /home/jenkins/.m2/repository/org/apache/apache/40/apache-40.pom: input contained no data @ /home/jenkins/.m2/repository/org/apache/apache/40/apache-40.pom
at PluginClassLoader for maven-plugin//hudson.maven.MavenModuleSetBuild$PomParser.invoke(MavenModuleSetBuild.java:1391)
at PluginClassLoader for maven-plugin//hudson.maven.MavenModuleSetBuild$PomParser.invoke(MavenModuleSetBuild.java:1124)
at hudson.FilePath$FileCallableWrapper.call(FilePath.java:3614)
at hudson.remoting.UserRequest.perform(UserRequest.java:225)
at hudson.remoting.UserRequest.perform(UserRequest.java:50)
at hudson.remoting.Request$2.run(Request.java:391)
at hudson.remoting.InterceptingExecutorService.lambda$wrap$0(InterceptingExecutorService.java:81)
at java.base/java.util.concurrent.FutureTask.run(FutureTask.java:264)
at java.base/java.util.concurrent.ThreadPoolExecutor.runWorker(ThreadPoolExecutor.java:1136)
at java.base/java.util.concurrent.ThreadPoolExecutor$Worker.run(ThreadPoolExecutor.java:635)
at java.base/java.lang.Thread.run(Thread.java:840)
Suppressed: hudson.remoting.Channel$CallSiteStackTrace: Remote call to builds37
at hudson.remoting.Channel.attachCallSiteStackTrace(Channel.java:1923)
at hudson.remoting.UserRequest$ExceptionResponse.retrieve(UserRequest.java:384)
at hudson.remoting.Channel.call(Channel.java:1112)
at hudson.FilePath.act(FilePath.java:1228)
at hudson.FilePath.act(FilePath.java:1217)
at PluginClassLoader for maven-plugin//hudson.maven.MavenModuleSetBuild$MavenModuleSetBuildExecution.parsePoms(MavenModuleSetBuild.java:985)
at PluginClassLoader for maven-plugin//hudson.maven.MavenModuleSetBuild$MavenModuleSetBuildExecution.doRun(MavenModuleSetBuild.java:689)
at hudson.model.AbstractBuild$AbstractBuildExecution.run(AbstractBuild.java:527)
at hudson.model.Run.execute(Run.java:1833)
at PluginClassLoader for maven-plugin//hudson.maven.MavenModuleSetBuild.run(MavenModuleSetBuild.java:543)
at hudson.model.ResourceController.execute(ResourceController.java:101)
at hudson.model.Executor.run(Executor.java:446)
Caused by: hudson.remoting.ProxyException: org.apache.maven.project.ProjectBuildingException: Some problems were encountered while processing the POMs:
[FATAL] Non-readable POM /home/jenkins/.m2/repository/org/apache/apache/40/apache-40.pom: input contained no data @ /home/jenkins/.m2/repository/org/apache/apache/40/apache-40.pom
at PluginClassLoader for maven-plugin//org.apache.maven.project.DefaultProjectBuilder.build(DefaultProjectBuilder.java:397)
at PluginClassLoader for maven-plugin//hudson.maven.MavenEmbedder.buildProjects(MavenEmbedder.java:370)
at PluginClassLoader for maven-plugin//hudson.maven.MavenEmbedder.readProjects(MavenEmbedder.java:340)
at PluginClassLoader for maven-plugin//hudson.maven.MavenModuleSetBuild$PomParser.invoke(MavenModuleSetBuild.java:1330)
... 10 more
Build failed in Jenkins: TomEE » master-build-full #2314
Posted by Apache Jenkins Server <je...@builds.apache.org>.
See <https://ci-builds.apache.org/job/Tomee/job/master-build-full/2314/display/redirect>
Changes:
------------------------------------------
Started by user Richard Zowalla
Running as SYSTEM
[EnvInject] - Loading node environment variables.
Building remotely on builds37 (ubuntu) in workspace <https://ci-builds.apache.org/job/Tomee/job/master-build-full/ws/>
The recommended git tool is: NONE
No credentials specified
Cloning the remote Git repository
Cloning repository https://github.com/apache/tomee
> git init <https://ci-builds.apache.org/job/Tomee/job/master-build-full/ws/> # timeout=10
Fetching upstream changes from https://github.com/apache/tomee
> git --version # timeout=10
> git --version # 'git version 2.34.1'
> git fetch --tags --force --progress -- https://github.com/apache/tomee +refs/heads/*:refs/remotes/origin/* # timeout=10
> git config remote.origin.url https://github.com/apache/tomee # timeout=10
> git config --add remote.origin.fetch +refs/heads/*:refs/remotes/origin/* # timeout=10
Avoid second fetch
> git rev-parse refs/remotes/origin/main^{commit} # timeout=10
Checking out Revision 0fb057efe6e322538a8c30ddfa7401a4c0835793 (refs/remotes/origin/main)
> git config core.sparsecheckout # timeout=10
> git checkout -f 0fb057efe6e322538a8c30ddfa7401a4c0835793 # timeout=10
Commit message: "Require a secret for stop requests on the admin port (#3087)"
> git rev-list --no-walk 0fb057efe6e322538a8c30ddfa7401a4c0835793 # timeout=10
Parsing POMs
ERROR: Failed to parse POMs
hudson.remoting.ProxyException: hudson.maven.MavenModuleSetBuild$MavenExecutionException: org.apache.maven.project.ProjectBuildingException: Some problems were encountered while processing the POMs:
[FATAL] Non-readable POM /home/jenkins/.m2/repository/org/apache/apache/40/apache-40.pom: input contained no data @ /home/jenkins/.m2/repository/org/apache/apache/40/apache-40.pom
at PluginClassLoader for maven-plugin//hudson.maven.MavenModuleSetBuild$PomParser.invoke(MavenModuleSetBuild.java:1391)
at PluginClassLoader for maven-plugin//hudson.maven.MavenModuleSetBuild$PomParser.invoke(MavenModuleSetBuild.java:1124)
at hudson.FilePath$FileCallableWrapper.call(FilePath.java:3614)
at hudson.remoting.UserRequest.perform(UserRequest.java:225)
at hudson.remoting.UserRequest.perform(UserRequest.java:50)
at hudson.remoting.Request$2.run(Request.java:391)
at hudson.remoting.InterceptingExecutorService.lambda$wrap$0(InterceptingExecutorService.java:81)
at java.base/java.util.concurrent.FutureTask.run(FutureTask.java:264)
at java.base/java.util.concurrent.ThreadPoolExecutor.runWorker(ThreadPoolExecutor.java:1136)
at java.base/java.util.concurrent.ThreadPoolExecutor$Worker.run(ThreadPoolExecutor.java:635)
at java.base/java.lang.Thread.run(Thread.java:840)
Suppressed: hudson.remoting.Channel$CallSiteStackTrace: Remote call to builds37
at hudson.remoting.Channel.attachCallSiteStackTrace(Channel.java:1923)
at hudson.remoting.UserRequest$ExceptionResponse.retrieve(UserRequest.java:384)
at hudson.remoting.Channel.call(Channel.java:1112)
at hudson.FilePath.act(FilePath.java:1228)
at hudson.FilePath.act(FilePath.java:1217)
at PluginClassLoader for maven-plugin//hudson.maven.MavenModuleSetBuild$MavenModuleSetBuildExecution.parsePoms(MavenModuleSetBuild.java:985)
at PluginClassLoader for maven-plugin//hudson.maven.MavenModuleSetBuild$MavenModuleSetBuildExecution.doRun(MavenModuleSetBuild.java:689)
at hudson.model.AbstractBuild$AbstractBuildExecution.run(AbstractBuild.java:527)
at hudson.model.Run.execute(Run.java:1833)
at PluginClassLoader for maven-plugin//hudson.maven.MavenModuleSetBuild.run(MavenModuleSetBuild.java:543)
at hudson.model.ResourceController.execute(ResourceController.java:101)
at hudson.model.Executor.run(Executor.java:446)
Caused by: hudson.remoting.ProxyException: org.apache.maven.project.ProjectBuildingException: Some problems were encountered while processing the POMs:
[FATAL] Non-readable POM /home/jenkins/.m2/repository/org/apache/apache/40/apache-40.pom: input contained no data @ /home/jenkins/.m2/repository/org/apache/apache/40/apache-40.pom
at PluginClassLoader for maven-plugin//org.apache.maven.project.DefaultProjectBuilder.build(DefaultProjectBuilder.java:397)
at PluginClassLoader for maven-plugin//hudson.maven.MavenEmbedder.buildProjects(MavenEmbedder.java:370)
at PluginClassLoader for maven-plugin//hudson.maven.MavenEmbedder.readProjects(MavenEmbedder.java:340)
at PluginClassLoader for maven-plugin//hudson.maven.MavenModuleSetBuild$PomParser.invoke(MavenModuleSetBuild.java:1330)
... 10 more
Build failed in Jenkins: TomEE » master-build-full #2313
Posted by Apache Jenkins Server <je...@builds.apache.org>.
See <https://ci-builds.apache.org/job/Tomee/job/master-build-full/2313/display/redirect?page=changes>
Changes:
[github] Update the systemd service example (#3085)
[github] Register the MP-JWT filter only for the MP-JWT auth method (#3067)
[github] Resolve MP-JWT security constraints per resource class (#3068)
[github] Log webapp jars skipped by the scan exclusion list (#3069)
[github] Do not map the caller principal to a role by name in getLogicalRoles (#3070)
[github] Keep Debian package configuration read-only for the service group (#3071)
[github] Bind the LiveReload connector to loopback and check the websocket origin (#3072)
[github] Validate stored parameters in TomEEPbkdf2PasswordHash (#3073)
[github] Verify Tomcat user identity store passwords with the realm CredentialHandler (#3074)
[github] Make only_from authoritative for server services (#3075)
[github] Warn that the Static3DES password cipher only obfuscates (#3076)
[github] Passivate stateful beans to a private directory by default (#3077)
[github] Warn when tomee-maven-plugin sends credentials over plain HTTP (#3078)
[github] Reject archive entries escaping the target in tomee-maven-plugin (#3079)
[github] TOMEE-4729 - Restore MP-JWT security state for asynchronous requests (#3080)
[github] Keep RAFPassivater files in a private temp directory (#3082)
[github] Do not return EJB exception messages from the default JAX-RS mapper (#3083)
[github] Clear the WS-Security caller identity after the JAX-WS request (#3084)
[github] Require a secret for stop requests on the admin port (#3087)
------------------------------------------
Started by user Richard Zowalla
Running as SYSTEM
[EnvInject] - Loading node environment variables.
Building remotely on builds37 (ubuntu) in workspace <https://ci-builds.apache.org/job/Tomee/job/master-build-full/ws/>
The recommended git tool is: NONE
No credentials specified
> git rev-parse --resolve-git-dir <https://ci-builds.apache.org/job/Tomee/job/master-build-full/ws/.git> # timeout=10
Fetching changes from the remote Git repository
> git config remote.origin.url https://github.com/apache/tomee # timeout=10
Cleaning workspace
> git rev-parse --verify HEAD # timeout=10
Resetting working tree
> git reset --hard # timeout=10
> git clean -fdx # timeout=10
Fetching upstream changes from https://github.com/apache/tomee
> git --version # timeout=10
> git --version # 'git version 2.34.1'
> git fetch --tags --force --progress -- https://github.com/apache/tomee +refs/heads/*:refs/remotes/origin/* # timeout=10
> git rev-parse refs/remotes/origin/main^{commit} # timeout=10
Checking out Revision 0fb057efe6e322538a8c30ddfa7401a4c0835793 (refs/remotes/origin/main)
> git config core.sparsecheckout # timeout=10
> git checkout -f 0fb057efe6e322538a8c30ddfa7401a4c0835793 # timeout=10
Commit message: "Require a secret for stop requests on the admin port (#3087)"
> git rev-list --no-walk fca9dbddff1d704d03bcfc77bf8e90e3a9aa24f6 # timeout=10
Parsing POMs
ERROR: Failed to parse POMs
hudson.remoting.ProxyException: hudson.maven.MavenModuleSetBuild$MavenExecutionException: org.apache.maven.project.ProjectBuildingException: Some problems were encountered while processing the POMs:
[FATAL] Non-readable POM /home/jenkins/.m2/repository/org/apache/apache/40/apache-40.pom: input contained no data @ /home/jenkins/.m2/repository/org/apache/apache/40/apache-40.pom
at PluginClassLoader for maven-plugin//hudson.maven.MavenModuleSetBuild$PomParser.invoke(MavenModuleSetBuild.java:1391)
at PluginClassLoader for maven-plugin//hudson.maven.MavenModuleSetBuild$PomParser.invoke(MavenModuleSetBuild.java:1124)
at hudson.FilePath$FileCallableWrapper.call(FilePath.java:3614)
at hudson.remoting.UserRequest.perform(UserRequest.java:225)
at hudson.remoting.UserRequest.perform(UserRequest.java:50)
at hudson.remoting.Request$2.run(Request.java:391)
at hudson.remoting.InterceptingExecutorService.lambda$wrap$0(InterceptingExecutorService.java:81)
at java.base/java.util.concurrent.FutureTask.run(FutureTask.java:264)
at java.base/java.util.concurrent.ThreadPoolExecutor.runWorker(ThreadPoolExecutor.java:1136)
at java.base/java.util.concurrent.ThreadPoolExecutor$Worker.run(ThreadPoolExecutor.java:635)
at java.base/java.lang.Thread.run(Thread.java:840)
Suppressed: hudson.remoting.Channel$CallSiteStackTrace: Remote call to builds37
at hudson.remoting.Channel.attachCallSiteStackTrace(Channel.java:1923)
at hudson.remoting.UserRequest$ExceptionResponse.retrieve(UserRequest.java:384)
at hudson.remoting.Channel.call(Channel.java:1112)
at hudson.FilePath.act(FilePath.java:1228)
at hudson.FilePath.act(FilePath.java:1217)
at PluginClassLoader for maven-plugin//hudson.maven.MavenModuleSetBuild$MavenModuleSetBuildExecution.parsePoms(MavenModuleSetBuild.java:985)
at PluginClassLoader for maven-plugin//hudson.maven.MavenModuleSetBuild$MavenModuleSetBuildExecution.doRun(MavenModuleSetBuild.java:689)
at hudson.model.AbstractBuild$AbstractBuildExecution.run(AbstractBuild.java:527)
at hudson.model.Run.execute(Run.java:1833)
at PluginClassLoader for maven-plugin//hudson.maven.MavenModuleSetBuild.run(MavenModuleSetBuild.java:543)
at hudson.model.ResourceController.execute(ResourceController.java:101)
at hudson.model.Executor.run(Executor.java:446)
Caused by: hudson.remoting.ProxyException: org.apache.maven.project.ProjectBuildingException: Some problems were encountered while processing the POMs:
[FATAL] Non-readable POM /home/jenkins/.m2/repository/org/apache/apache/40/apache-40.pom: input contained no data @ /home/jenkins/.m2/repository/org/apache/apache/40/apache-40.pom
at PluginClassLoader for maven-plugin//org.apache.maven.project.DefaultProjectBuilder.build(DefaultProjectBuilder.java:397)
at PluginClassLoader for maven-plugin//hudson.maven.MavenEmbedder.buildProjects(MavenEmbedder.java:370)
at PluginClassLoader for maven-plugin//hudson.maven.MavenEmbedder.readProjects(MavenEmbedder.java:340)
at PluginClassLoader for maven-plugin//hudson.maven.MavenModuleSetBuild$PomParser.invoke(MavenModuleSetBuild.java:1330)
... 10 more
Build failed in Jenkins: TomEE » master-build-full #2312
Posted by Apache Jenkins Server <je...@builds.apache.org>.
See <https://ci-builds.apache.org/job/Tomee/job/master-build-full/2312/display/redirect>
Changes:
------------------------------------------
Started by timer
Running as SYSTEM
[EnvInject] - Loading node environment variables.
Building remotely on builds37 (ubuntu) in workspace <https://ci-builds.apache.org/job/Tomee/job/master-build-full/ws/>
The recommended git tool is: NONE
No credentials specified
> git rev-parse --resolve-git-dir <https://ci-builds.apache.org/job/Tomee/job/master-build-full/ws/.git> # timeout=10
Fetching changes from the remote Git repository
> git config remote.origin.url https://github.com/apache/tomee # timeout=10
Cleaning workspace
> git rev-parse --verify HEAD # timeout=10
Resetting working tree
> git reset --hard # timeout=10
> git clean -fdx # timeout=10
Fetching upstream changes from https://github.com/apache/tomee
> git --version # timeout=10
> git --version # 'git version 2.34.1'
> git fetch --tags --force --progress -- https://github.com/apache/tomee +refs/heads/*:refs/remotes/origin/* # timeout=10
> git rev-parse refs/remotes/origin/main^{commit} # timeout=10
Checking out Revision fca9dbddff1d704d03bcfc77bf8e90e3a9aa24f6 (refs/remotes/origin/main)
> git config core.sparsecheckout # timeout=10
> git checkout -f fca9dbddff1d704d03bcfc77bf8e90e3a9aa24f6 # timeout=10
Commit message: "Cover all HTTP methods in generated JAX-WS webservice contexts (#3066)"
> git rev-list --no-walk fca9dbddff1d704d03bcfc77bf8e90e3a9aa24f6 # timeout=10
Parsing POMs
ERROR: Failed to parse POMs
hudson.remoting.ProxyException: hudson.maven.MavenModuleSetBuild$MavenExecutionException: org.apache.maven.project.ProjectBuildingException: Some problems were encountered while processing the POMs:
[FATAL] Non-readable POM /home/jenkins/.m2/repository/org/apache/apache/40/apache-40.pom: input contained no data @ /home/jenkins/.m2/repository/org/apache/apache/40/apache-40.pom
at PluginClassLoader for maven-plugin//hudson.maven.MavenModuleSetBuild$PomParser.invoke(MavenModuleSetBuild.java:1391)
at PluginClassLoader for maven-plugin//hudson.maven.MavenModuleSetBuild$PomParser.invoke(MavenModuleSetBuild.java:1124)
at hudson.FilePath$FileCallableWrapper.call(FilePath.java:3614)
at hudson.remoting.UserRequest.perform(UserRequest.java:225)
at hudson.remoting.UserRequest.perform(UserRequest.java:50)
at hudson.remoting.Request$2.run(Request.java:391)
at hudson.remoting.InterceptingExecutorService.lambda$wrap$0(InterceptingExecutorService.java:81)
at java.base/java.util.concurrent.FutureTask.run(FutureTask.java:264)
at java.base/java.util.concurrent.ThreadPoolExecutor.runWorker(ThreadPoolExecutor.java:1136)
at java.base/java.util.concurrent.ThreadPoolExecutor$Worker.run(ThreadPoolExecutor.java:635)
at java.base/java.lang.Thread.run(Thread.java:840)
Suppressed: hudson.remoting.Channel$CallSiteStackTrace: Remote call to builds37
at hudson.remoting.Channel.attachCallSiteStackTrace(Channel.java:1923)
at hudson.remoting.UserRequest$ExceptionResponse.retrieve(UserRequest.java:384)
at hudson.remoting.Channel.call(Channel.java:1112)
at hudson.FilePath.act(FilePath.java:1228)
at hudson.FilePath.act(FilePath.java:1217)
at PluginClassLoader for maven-plugin//hudson.maven.MavenModuleSetBuild$MavenModuleSetBuildExecution.parsePoms(MavenModuleSetBuild.java:985)
at PluginClassLoader for maven-plugin//hudson.maven.MavenModuleSetBuild$MavenModuleSetBuildExecution.doRun(MavenModuleSetBuild.java:689)
at hudson.model.AbstractBuild$AbstractBuildExecution.run(AbstractBuild.java:527)
at hudson.model.Run.execute(Run.java:1833)
at PluginClassLoader for maven-plugin//hudson.maven.MavenModuleSetBuild.run(MavenModuleSetBuild.java:543)
at hudson.model.ResourceController.execute(ResourceController.java:101)
at hudson.model.Executor.run(Executor.java:446)
Caused by: hudson.remoting.ProxyException: org.apache.maven.project.ProjectBuildingException: Some problems were encountered while processing the POMs:
[FATAL] Non-readable POM /home/jenkins/.m2/repository/org/apache/apache/40/apache-40.pom: input contained no data @ /home/jenkins/.m2/repository/org/apache/apache/40/apache-40.pom
at PluginClassLoader for maven-plugin//org.apache.maven.project.DefaultProjectBuilder.build(DefaultProjectBuilder.java:397)
at PluginClassLoader for maven-plugin//hudson.maven.MavenEmbedder.buildProjects(MavenEmbedder.java:370)
at PluginClassLoader for maven-plugin//hudson.maven.MavenEmbedder.readProjects(MavenEmbedder.java:340)
at PluginClassLoader for maven-plugin//hudson.maven.MavenModuleSetBuild$PomParser.invoke(MavenModuleSetBuild.java:1330)
... 10 more
Jenkins build is still unstable: TomEE » master-build-full #2311
Posted by Apache Jenkins Server <je...@builds.apache.org>.
See <https://ci-builds.apache.org/job/Tomee/job/master-build-full/2311/display/redirect>
Jenkins build is unstable: TomEE » master-build-full #2310
Posted by Apache Jenkins Server <je...@builds.apache.org>.
See <https://ci-builds.apache.org/job/Tomee/job/master-build-full/2310/display/redirect>
Build failed in Jenkins: TomEE » master-build-full #2309
Posted by Apache Jenkins Server <je...@builds.apache.org>.
See <https://ci-builds.apache.org/job/Tomee/job/master-build-full/2309/display/redirect>
Changes:
------------------------------------------
Started by timer
Running as SYSTEM
[EnvInject] - Loading node environment variables.
FATAL: java.io.IOException: Unexpected termination of the channel
java.io.EOFException
at java.base/java.io.ObjectInputStream$PeekInputStream.readFully(ObjectInputStream.java:2915)
at java.base/java.io.ObjectInputStream$BlockDataInputStream.readShort(ObjectInputStream.java:3410)
at java.base/java.io.ObjectInputStream.readStreamHeader(ObjectInputStream.java:954)
at java.base/java.io.ObjectInputStream.<init>(ObjectInputStream.java:392)
at hudson.remoting.ObjectInputStreamEx.<init>(ObjectInputStreamEx.java:50)
at hudson.remoting.Command.readFrom(Command.java:141)
at hudson.remoting.Command.readFrom(Command.java:127)
at hudson.remoting.AbstractSynchronousByteArrayCommandTransport.read(AbstractSynchronousByteArrayCommandTransport.java:35)
at hudson.remoting.SynchronousCommandTransport$ReaderThread.run(SynchronousCommandTransport.java:62)
Caused: java.io.IOException: Unexpected termination of the channel
at hudson.remoting.SynchronousCommandTransport$ReaderThread.run(SynchronousCommandTransport.java:80)
Also: hudson.remoting.Channel$CallSiteStackTrace: Remote call to builds37
at hudson.remoting.Channel.attachCallSiteStackTrace(Channel.java:1923)
at hudson.remoting.Request.call(Request.java:204)
at hudson.remoting.Channel.call(Channel.java:1111)
at hudson.FilePath.act(FilePath.java:1319)
at PluginClassLoader for envinject//org.jenkinsci.plugins.envinject.service.EnvironmentVariablesNodeLoader.gatherEnvVarsForNode(EnvironmentVariablesNodeLoader.java:61)
at PluginClassLoader for envinject//org.jenkinsci.plugins.envinject.EnvInjectListener.loadEnvironmentVariablesNode(EnvInjectListener.java:78)
at PluginClassLoader for envinject//org.jenkinsci.plugins.envinject.EnvInjectListener.setUpEnvironment(EnvInjectListener.java:42)
at hudson.model.AbstractBuild$AbstractBuildExecution.createLauncher(AbstractBuild.java:617)
at hudson.model.AbstractBuild$AbstractBuildExecution.run(AbstractBuild.java:486)
at hudson.model.Run.execute(Run.java:1833)
at PluginClassLoader for maven-plugin//hudson.maven.MavenModuleSetBuild.run(MavenModuleSetBuild.java:543)
at hudson.model.ResourceController.execute(ResourceController.java:101)
at hudson.model.Executor.run(Executor.java:446)
Caused: hudson.remoting.RequestAbortedException
at hudson.remoting.Request.abort(Request.java:358)
at hudson.remoting.Channel.terminate(Channel.java:1196)
at hudson.remoting.SynchronousCommandTransport$ReaderThread.run(SynchronousCommandTransport.java:95)
ERROR: builds37 is offline; cannot locate jdk_17_latest
ERROR: builds37 is offline; cannot locate maven_3_latest
ERROR: builds37 is offline; cannot locate jdk_17_latest
ERROR: builds37 is offline; cannot locate maven_3_latest
ERROR: builds37 is offline; cannot locate jdk_17_latest
ERROR: builds37 is offline; cannot locate maven_3_latest
Jenkins build is unstable: TomEE » master-build-full #2308
Posted by Apache Jenkins Server <je...@builds.apache.org>.
See <https://ci-builds.apache.org/job/Tomee/job/master-build-full/2308/display/redirect?page=changes>
Build failed in Jenkins: TomEE » master-build-full #2307
Posted by Apache Jenkins Server <je...@builds.apache.org>.
See <https://ci-builds.apache.org/job/Tomee/job/master-build-full/2307/display/redirect>
Changes:
------------------------------------------
Started by timer
Running as SYSTEM
[EnvInject] - Loading node environment variables.
Building remotely on builds37 (ubuntu) in workspace <https://ci-builds.apache.org/job/Tomee/job/master-build-full/ws/>
The recommended git tool is: NONE
No credentials specified
> git rev-parse --resolve-git-dir <https://ci-builds.apache.org/job/Tomee/job/master-build-full/ws/.git> # timeout=10
Fetching changes from the remote Git repository
> git config remote.origin.url https://github.com/apache/tomee # timeout=10
Cleaning workspace
> git rev-parse --verify HEAD # timeout=10
Resetting working tree
> git reset --hard # timeout=10
> git clean -fdx # timeout=10
Fetching upstream changes from https://github.com/apache/tomee
> git --version # timeout=10
> git --version # 'git version 2.34.1'
> git fetch --tags --force --progress -- https://github.com/apache/tomee +refs/heads/*:refs/remotes/origin/* # timeout=10
> git rev-parse refs/remotes/origin/main^{commit} # timeout=10
Checking out Revision 976cf7ec918960b7e5fa5189766cb9b18e54ad86 (refs/remotes/origin/main)
> git config core.sparsecheckout # timeout=10
> git checkout -f 976cf7ec918960b7e5fa5189766cb9b18e54ad86 # timeout=10
Commit message: "Minor: Regenerated BOMs for 4268dd644dd0b2730337cd57d6e26992af594c35 (#3037)"
> git rev-list --no-walk 976cf7ec918960b7e5fa5189766cb9b18e54ad86 # timeout=10
Parsing POMs
ERROR: Failed to parse POMs
hudson.remoting.ProxyException: hudson.maven.MavenModuleSetBuild$MavenExecutionException: org.apache.maven.project.ProjectBuildingException: Some problems were encountered while processing the POMs:
[FATAL] Non-readable POM /home/jenkins/.m2/repository/org/apache/apache/40/apache-40.pom: input contained no data @ /home/jenkins/.m2/repository/org/apache/apache/40/apache-40.pom
at PluginClassLoader for maven-plugin//hudson.maven.MavenModuleSetBuild$PomParser.invoke(MavenModuleSetBuild.java:1391)
at PluginClassLoader for maven-plugin//hudson.maven.MavenModuleSetBuild$PomParser.invoke(MavenModuleSetBuild.java:1124)
at hudson.FilePath$FileCallableWrapper.call(FilePath.java:3614)
at hudson.remoting.UserRequest.perform(UserRequest.java:225)
at hudson.remoting.UserRequest.perform(UserRequest.java:50)
at hudson.remoting.Request$2.run(Request.java:391)
at hudson.remoting.InterceptingExecutorService.lambda$wrap$0(InterceptingExecutorService.java:81)
at java.base/java.util.concurrent.FutureTask.run(FutureTask.java:264)
at java.base/java.util.concurrent.ThreadPoolExecutor.runWorker(ThreadPoolExecutor.java:1136)
at java.base/java.util.concurrent.ThreadPoolExecutor$Worker.run(ThreadPoolExecutor.java:635)
at java.base/java.lang.Thread.run(Thread.java:840)
Suppressed: hudson.remoting.Channel$CallSiteStackTrace: Remote call to builds37
at hudson.remoting.Channel.attachCallSiteStackTrace(Channel.java:1923)
at hudson.remoting.UserRequest$ExceptionResponse.retrieve(UserRequest.java:384)
at hudson.remoting.Channel.call(Channel.java:1112)
at hudson.FilePath.act(FilePath.java:1228)
at hudson.FilePath.act(FilePath.java:1217)
at PluginClassLoader for maven-plugin//hudson.maven.MavenModuleSetBuild$MavenModuleSetBuildExecution.parsePoms(MavenModuleSetBuild.java:985)
at PluginClassLoader for maven-plugin//hudson.maven.MavenModuleSetBuild$MavenModuleSetBuildExecution.doRun(MavenModuleSetBuild.java:689)
at hudson.model.AbstractBuild$AbstractBuildExecution.run(AbstractBuild.java:527)
at hudson.model.Run.execute(Run.java:1833)
at PluginClassLoader for maven-plugin//hudson.maven.MavenModuleSetBuild.run(MavenModuleSetBuild.java:543)
at hudson.model.ResourceController.execute(ResourceController.java:101)
at hudson.model.Executor.run(Executor.java:446)
Caused by: hudson.remoting.ProxyException: org.apache.maven.project.ProjectBuildingException: Some problems were encountered while processing the POMs:
[FATAL] Non-readable POM /home/jenkins/.m2/repository/org/apache/apache/40/apache-40.pom: input contained no data @ /home/jenkins/.m2/repository/org/apache/apache/40/apache-40.pom
at PluginClassLoader for maven-plugin//org.apache.maven.project.DefaultProjectBuilder.build(DefaultProjectBuilder.java:397)
at PluginClassLoader for maven-plugin//hudson.maven.MavenEmbedder.buildProjects(MavenEmbedder.java:370)
at PluginClassLoader for maven-plugin//hudson.maven.MavenEmbedder.readProjects(MavenEmbedder.java:340)
at PluginClassLoader for maven-plugin//hudson.maven.MavenModuleSetBuild$PomParser.invoke(MavenModuleSetBuild.java:1330)
... 10 more
Jenkins build is unstable: TomEE » master-build-full #2306
Posted by Apache Jenkins Server <je...@builds.apache.org>.
See <https://ci-builds.apache.org/job/Tomee/job/master-build-full/2306/display/redirect?page=changes>
Build failed in Jenkins: TomEE » master-build-full #2305
Posted by Apache Jenkins Server <je...@builds.apache.org>.
See <https://ci-builds.apache.org/job/Tomee/job/master-build-full/2305/display/redirect?page=changes>
Changes:
[github] TOMEE-2044 - let KeepAliveServer find the ServicePool of a plain service (#3012)
[github] TOMEE-4720 - Bump org.yaml:snakeyaml from 2.6 to 2.7 (#3023)
[github] TOMEE-4719 - Bump org.bitbucket.b_c:jose4j from 0.9.6 to 0.9.7 (#3017)
[github] Bump maven.version from 3.9.16 to 3.10.0 (#3029)
[github] Bump org.apache.maven.plugins:maven-plugin-plugin from 3.15.2 to 3.16.0 (#3018)
[github] Bump org.bouncycastle:bcmail-jdk18on from 1.85 to 1.86 (#3033)
[github] Bump joda-time:joda-time from 2.14.3 to 2.15.0 (#3031)
[github] Bump org.slf4j:slf4j-simple from 2.0.18 to 2.0.20 (#3026)
[github] Bump org.easymock:easymock from 5.6.0 to 5.7.0 (#3024)
[github] Bump com.nimbusds:nimbus-jose-jwt from 10.9.1 to 10.10 (#3020)
[github] TOMEE-4726 - Bump org.apache.commons:commons-lang3 from 3.20.0 to 3.21.0 (#3050)
[github] TOMEE-4672 - Bump org.bouncycastle:bcpkix-jdk18on from 1.85 to 1.86 (#3045)
[github] Bump org.apache:apache from 39 to 40 (#3044)
[github] Bump org.apache.maven.plugins:maven-failsafe-plugin from 3.5.6 to 3.6.0 (#3056)
[github] Bump org.apache.maven.plugins:maven-compiler-plugin from 3.15.0 to 3.16.0 (#3041)
[github] Bump org.codehaus.mojo:build-helper-maven-plugin from 3.6.1 to 3.6.2 (#3055)
[github] Bump org.apache.felix:maven-bundle-plugin from 6.1.0 to 6.2.0 (#3051)
[github] Bump org.codehaus.mojo:templating-maven-plugin from 3.1.0 to 3.1.1 (#3043)
[github] Bump org.hibernate.validator:hibernate-validator from 9.1.3.Final to 9.1.4.Final (#3048)
------------------------------------------
Started by timer
Running as SYSTEM
[EnvInject] - Loading node environment variables.
Building remotely on builds37 (ubuntu) in workspace <https://ci-builds.apache.org/job/Tomee/job/master-build-full/ws/>
The recommended git tool is: NONE
No credentials specified
> git rev-parse --resolve-git-dir <https://ci-builds.apache.org/job/Tomee/job/master-build-full/ws/.git> # timeout=10
Fetching changes from the remote Git repository
> git config remote.origin.url https://github.com/apache/tomee # timeout=10
Cleaning workspace
> git rev-parse --verify HEAD # timeout=10
Resetting working tree
> git reset --hard # timeout=10
> git clean -fdx # timeout=10
Fetching upstream changes from https://github.com/apache/tomee
> git --version # timeout=10
> git --version # 'git version 2.34.1'
> git fetch --tags --force --progress -- https://github.com/apache/tomee +refs/heads/*:refs/remotes/origin/* # timeout=10
> git rev-parse refs/remotes/origin/main^{commit} # timeout=10
Checking out Revision 33ca5bd02ffeb0a67ee0a9c8a443a0c5712b2c5b (refs/remotes/origin/main)
> git config core.sparsecheckout # timeout=10
> git checkout -f 33ca5bd02ffeb0a67ee0a9c8a443a0c5712b2c5b # timeout=10
Commit message: "Bump org.hibernate.validator:hibernate-validator from 9.1.3.Final to 9.1.4.Final (#3048)"
> git rev-list --no-walk b1b9db9e40716509d52158c9408064a73d42e83e # timeout=10
Parsing POMs
ERROR: Failed to parse POMs
hudson.remoting.ProxyException: hudson.maven.MavenModuleSetBuild$MavenExecutionException: org.apache.maven.project.ProjectBuildingException: Some problems were encountered while processing the POMs:
[FATAL] Non-readable POM /home/jenkins/.m2/repository/org/apache/apache/40/apache-40.pom: input contained no data @ /home/jenkins/.m2/repository/org/apache/apache/40/apache-40.pom
at PluginClassLoader for maven-plugin//hudson.maven.MavenModuleSetBuild$PomParser.invoke(MavenModuleSetBuild.java:1391)
at PluginClassLoader for maven-plugin//hudson.maven.MavenModuleSetBuild$PomParser.invoke(MavenModuleSetBuild.java:1124)
at hudson.FilePath$FileCallableWrapper.call(FilePath.java:3614)
at hudson.remoting.UserRequest.perform(UserRequest.java:225)
at hudson.remoting.UserRequest.perform(UserRequest.java:50)
at hudson.remoting.Request$2.run(Request.java:391)
at hudson.remoting.InterceptingExecutorService.lambda$wrap$0(InterceptingExecutorService.java:81)
at java.base/java.util.concurrent.FutureTask.run(FutureTask.java:264)
at java.base/java.util.concurrent.ThreadPoolExecutor.runWorker(ThreadPoolExecutor.java:1136)
at java.base/java.util.concurrent.ThreadPoolExecutor$Worker.run(ThreadPoolExecutor.java:635)
at java.base/java.lang.Thread.run(Thread.java:840)
Suppressed: hudson.remoting.Channel$CallSiteStackTrace: Remote call to builds37
at hudson.remoting.Channel.attachCallSiteStackTrace(Channel.java:1923)
at hudson.remoting.UserRequest$ExceptionResponse.retrieve(UserRequest.java:384)
at hudson.remoting.Channel.call(Channel.java:1112)
at hudson.FilePath.act(FilePath.java:1228)
at hudson.FilePath.act(FilePath.java:1217)
at PluginClassLoader for maven-plugin//hudson.maven.MavenModuleSetBuild$MavenModuleSetBuildExecution.parsePoms(MavenModuleSetBuild.java:985)
at PluginClassLoader for maven-plugin//hudson.maven.MavenModuleSetBuild$MavenModuleSetBuildExecution.doRun(MavenModuleSetBuild.java:689)
at hudson.model.AbstractBuild$AbstractBuildExecution.run(AbstractBuild.java:527)
at hudson.model.Run.execute(Run.java:1833)
at PluginClassLoader for maven-plugin//hudson.maven.MavenModuleSetBuild.run(MavenModuleSetBuild.java:543)
at hudson.model.ResourceController.execute(ResourceController.java:101)
at hudson.model.Executor.run(Executor.java:446)
Caused by: hudson.remoting.ProxyException: org.apache.maven.project.ProjectBuildingException: Some problems were encountered while processing the POMs:
[FATAL] Non-readable POM /home/jenkins/.m2/repository/org/apache/apache/40/apache-40.pom: input contained no data @ /home/jenkins/.m2/repository/org/apache/apache/40/apache-40.pom
at PluginClassLoader for maven-plugin//org.apache.maven.project.DefaultProjectBuilder.build(DefaultProjectBuilder.java:397)
at PluginClassLoader for maven-plugin//hudson.maven.MavenEmbedder.buildProjects(MavenEmbedder.java:370)
at PluginClassLoader for maven-plugin//hudson.maven.MavenEmbedder.readProjects(MavenEmbedder.java:340)
at PluginClassLoader for maven-plugin//hudson.maven.MavenModuleSetBuild$PomParser.invoke(MavenModuleSetBuild.java:1330)
... 10 more