You are viewing a plain text version of this content. The canonical link for it is here.
Posted to notifications@directory.apache.org by Apache Jenkins Server <je...@builds.apache.org> on 2020/06/03 22:02:13 UTC

Build failed in Jenkins: dir-fortress-core-docker-apacheds-test #114

See <https://builds.apache.org/job/dir-fortress-core-docker-apacheds-test/114/display/redirect?page=changes>

Changes:

[smckinney] FC-283 - Remove property files from quickstart doc

[smckinney] FC-283 - Remove property files from quickstart doc


------------------------------------------
[...truncated 155.57 KB...]
2020-06-03 21:57:052 INFO  UserDAO:1794 - deleteResetFlag user [jtsTU5User6] no such attribute:pwdReset
2020-06-03 21:57:053 INFO  UserDAO:1794 - deleteResetFlag user [jtsTU5User6] no such attribute:pwdReset
2020-06-03 21:57:054 INFO  UserDAO:1794 - deleteResetFlag user [jtsTU5User6] no such attribute:pwdReset
2020-06-03 21:57:055 INFO  UserDAO:1794 - deleteResetFlag user [jtsTU5User6] no such attribute:pwdReset
2020-06-03 21:57:056 INFO  UserDAO:1794 - deleteResetFlag user [jtsTU5User6] no such attribute:pwdReset
2020-06-03 21:57:057 INFO  UserDAO:1794 - deleteResetFlag user [jtsTU5User6] no such attribute:pwdReset
2020-06-03 21:57:058 INFO  UserDAO:1794 - deleteResetFlag user [jtsTU5User6] no such attribute:pwdReset
2020-06-03 21:58:000 INFO  UserDAO:1794 - deleteResetFlag user [jtsTU5User6] no such attribute:pwdReset
2020-06-03 21:58:001 INFO  UserDAO:1794 - deleteResetFlag user [jtsTU5User6] no such attribute:pwdReset
2020-06-03 21:58:002 INFO  UserDAO:1794 - deleteResetFlag user [jtsTU5User6] no such attribute:pwdReset
2020-06-03 21:58:003 INFO  UserDAO:1794 - deleteResetFlag user [jtsTU5User6] no such attribute:pwdReset
2020-06-03 21:58:004 INFO  UserDAO:1794 - deleteResetFlag user [jtsTU5User6] no such attribute:pwdReset
2020-06-03 21:58:005 INFO  UserDAO:1794 - deleteResetFlag user [jtsTU5User6] no such attribute:pwdReset
2020-06-03 21:58:006 INFO  UserDAO:1794 - deleteResetFlag user [jtsTU5User6] no such attribute:pwdReset
2020-06-03 21:58:007 INFO  UserDAO:1794 - deleteResetFlag user [jtsTU5User6] no such attribute:pwdReset
2020-06-03 21:58:008 INFO  UserDAO:1794 - deleteResetFlag user [jtsTU5User6] no such attribute:pwdReset
2020-06-03 21:58:010 INFO  UserDAO:1794 - deleteResetFlag user [jtsTU5User6] no such attribute:pwdReset
2020-06-03 21:58:011 INFO  UserDAO:1794 - deleteResetFlag user [jtsTU5User6] no such attribute:pwdReset
2020-06-03 21:58:012 INFO  UserDAO:1794 - deleteResetFlag user [jtsTU5User6] no such attribute:pwdReset
2020-06-03 21:58:013 INFO  UserDAO:1794 - deleteResetFlag user [jtsTU5User6] no such attribute:pwdReset
2020-06-03 21:58:014 INFO  UserDAO:1794 - deleteResetFlag user [jtsTU5User6] no such attribute:pwdReset
2020-06-03 21:58:015 INFO  UserDAO:1794 - deleteResetFlag user [jtsTU5User6] no such attribute:pwdReset
2020-06-03 21:58:016 INFO  UserDAO:1794 - deleteResetFlag user [jtsTU5User6] no such attribute:pwdReset
2020-06-03 21:58:017 INFO  UserDAO:1794 - deleteResetFlag user [jtsTU5User6] no such attribute:pwdReset
2020-06-03 21:58:019 INFO  UserDAO:1794 - deleteResetFlag user [jtsTU5User6] no such attribute:pwdReset
2020-06-03 21:58:020 INFO  UserDAO:1794 - deleteResetFlag user [jtsTU5User6] no such attribute:pwdReset
2020-06-03 21:58:021 INFO  UserDAO:1794 - deleteResetFlag user [jtsTU5User6] no such attribute:pwdReset
2020-06-03 21:58:022 INFO  UserDAO:1794 - deleteResetFlag user [jtsTU5User6] no such attribute:pwdReset
2020-06-03 21:58:023 INFO  UserDAO:1794 - deleteResetFlag user [jtsTU5User6] no such attribute:pwdReset
2020-06-03 21:58:024 INFO  UserDAO:1794 - deleteResetFlag user [jtsTU5User6] no such attribute:pwdReset
2020-06-03 21:58:025 INFO  UserDAO:1794 - deleteResetFlag user [jtsTU5User6] no such attribute:pwdReset
2020-06-03 21:58:026 INFO  UserDAO:1794 - deleteResetFlag user [jtsTU5User6] no such attribute:pwdReset
2020-06-03 21:58:027 INFO  UserDAO:1794 - deleteResetFlag user [jtsTU5User6] no such attribute:pwdReset
2020-06-03 21:58:028 INFO  UserDAO:1794 - deleteResetFlag user [jtsTU5User6] no such attribute:pwdReset
2020-06-03 21:58:029 INFO  UserDAO:1794 - deleteResetFlag user [jtsTU5User6] no such attribute:pwdReset
2020-06-03 21:58:030 INFO  UserDAO:1794 - deleteResetFlag user [jtsTU5User6] no such attribute:pwdReset
2020-06-03 21:58:032 INFO  UserDAO:1794 - deleteResetFlag user [jtsTU5User6] no such attribute:pwdReset
2020-06-03 21:58:033 INFO  UserDAO:1794 - deleteResetFlag user [jtsTU5User6] no such attribute:pwdReset
2020-06-03 21:58:034 INFO  UserDAO:1794 - deleteResetFlag user [jtsTU5User6] no such attribute:pwdReset
2020-06-03 21:58:035 INFO  UserDAO:1794 - deleteResetFlag user [jtsTU5User6] no such attribute:pwdReset
2020-06-03 21:58:036 INFO  UserDAO:1794 - deleteResetFlag user [jtsTU5User6] no such attribute:pwdReset
2020-06-03 21:58:037 INFO  UserDAO:1794 - deleteResetFlag user [jtsTU5User6] no such attribute:pwdReset
2020-06-03 21:58:038 INFO  UserDAO:1794 - deleteResetFlag user [jtsTU5User6] no such attribute:pwdReset
2020-06-03 21:58:039 INFO  UserDAO:1794 - deleteResetFlag user [jtsTU5User6] no such attribute:pwdReset
2020-06-03 21:58:041 INFO  UserDAO:1794 - deleteResetFlag user [jtsTU5User6] no such attribute:pwdReset
2020-06-03 21:58:042 INFO  UserDAO:1794 - deleteResetFlag user [jtsTU5User6] no such attribute:pwdReset
2020-06-03 21:58:043 INFO  UserDAO:1794 - deleteResetFlag user [jtsTU5User6] no such attribute:pwdReset
2020-06-03 21:58:044 INFO  UserDAO:1794 - deleteResetFlag user [jtsTU5User6] no such attribute:pwdReset
2020-06-03 21:58:045 INFO  UserDAO:1794 - deleteResetFlag user [jtsTU5User6] no such attribute:pwdReset
2020-06-03 21:58:046 INFO  UserDAO:1794 - deleteResetFlag user [jtsTU5User6] no such attribute:pwdReset
2020-06-03 21:58:048 INFO  UserDAO:1794 - deleteResetFlag user [jtsTU5User6] no such attribute:pwdReset
2020-06-03 21:58:049 INFO  UserDAO:1794 - deleteResetFlag user [jtsTU5User6] no such attribute:pwdReset
2020-06-03 21:58:050 INFO  UserDAO:1794 - deleteResetFlag user [jtsTU5User6] no such attribute:pwdReset
2020-06-03 21:58:051 INFO  UserDAO:1794 - deleteResetFlag user [jtsTU5User6] no such attribute:pwdReset
2020-06-03 21:58:052 INFO  UserDAO:1794 - deleteResetFlag user [jtsTU5User6] no such attribute:pwdReset
2020-06-03 21:58:053 INFO  UserDAO:1794 - deleteResetFlag user [jtsTU5User6] no such attribute:pwdReset
2020-06-03 21:58:054 INFO  UserDAO:1794 - deleteResetFlag user [jtsTU5User6] no such attribute:pwdReset
2020-06-03 21:58:055 INFO  UserDAO:1794 - deleteResetFlag user [jtsTU5User6] no such attribute:pwdReset
2020-06-03 21:58:056 INFO  UserDAO:1794 - deleteResetFlag user [jtsTU5User6] no such attribute:pwdReset
2020-06-03 21:58:058 INFO  UserDAO:1794 - deleteResetFlag user [jtsTU5User6] no such attribute:pwdReset
2020-06-03 21:58:059 INFO  UserDAO:1794 - deleteResetFlag user [jtsTU5User6] no such attribute:pwdReset
2020-06-03 21:59:000 INFO  UserDAO:1794 - deleteResetFlag user [jtsTU5User6] no such attribute:pwdReset
2020-06-03 21:59:001 INFO  UserDAO:1794 - deleteResetFlag user [jtsTU5User6] no such attribute:pwdReset
2020-06-03 21:59:002 INFO  UserDAO:1794 - deleteResetFlag user [jtsTU5User6] no such attribute:pwdReset
2020-06-03 21:59:003 INFO  UserDAO:1794 - deleteResetFlag user [jtsTU5User6] no such attribute:pwdReset
2020-06-03 21:59:004 INFO  UserDAO:1794 - deleteResetFlag user [jtsTU5User6] no such attribute:pwdReset
2020-06-03 21:59:005 INFO  UserDAO:1794 - deleteResetFlag user [jtsTU5User6] no such attribute:pwdReset
2020-06-03 21:59:007 INFO  UserDAO:1794 - deleteResetFlag user [jtsTU5User6] no such attribute:pwdReset
2020-06-03 21:59:008 INFO  UserDAO:1794 - deleteResetFlag user [jtsTU5User6] no such attribute:pwdReset
2020-06-03 21:59:009 INFO  UserDAO:1794 - deleteResetFlag user [jtsTU5User6] no such attribute:pwdReset
2020-06-03 21:59:010 INFO  UserDAO:1794 - deleteResetFlag user [jtsTU5User6] no such attribute:pwdReset
2020-06-03 21:59:011 INFO  UserDAO:1794 - deleteResetFlag user [jtsTU5User6] no such attribute:pwdReset
2020-06-03 21:59:012 INFO  UserDAO:1794 - deleteResetFlag user [jtsTU5User6] no such attribute:pwdReset
2020-06-03 21:59:013 INFO  UserDAO:1794 - deleteResetFlag user [jtsTU5User6] no such attribute:pwdReset
2020-06-03 21:59:015 INFO  UserDAO:1794 - deleteResetFlag user [jtsTU5User6] no such attribute:pwdReset
2020-06-03 21:59:016 INFO  UserDAO:1794 - deleteResetFlag user [jtsTU5User6] no such attribute:pwdReset
2020-06-03 21:59:016 INFO  LogUtil:64 - PWLEN7 PLCY TP1 USR TU5
2020-06-03 21:59:016 INFO  LogUtil:64 - PWLEN8 PLCY TP1 USR TU5
2020-06-03 21:59:016 INFO  LogUtil:64 - PWEXP7 PLCY TP1 USR TU5
2020-06-03 21:59:019 INFO  UserDAO:1794 - deleteResetFlag user [jtsTU5User9] no such attribute:pwdReset
2020-06-03 21:59:019 INFO  LogUtil:64 - org.apache.directory.fortress.core.impl.TestUtils.sleep for len=2000
2020-06-03 21:59:021 INFO  LogUtil:64 - org.apache.directory.fortress.core.impl.TestUtils.sleep for len=1000
2020-06-03 21:59:022 ERROR PswdPolicyMgrImplTest:532 - expireWarning caught SecurityException rc=1017, msg=checkPwPolicies for userId [jtsTU5User9] PASSWORD HAS EXPIRED
org.apache.directory.fortress.core.PasswordException: checkPwPolicies for userId [jtsTU5User9] PASSWORD HAS EXPIRED
	at org.apache.directory.fortress.core.impl.UserDAO.checkPassword(UserDAO.java:848)
	at org.apache.directory.fortress.core.impl.UserP.authenticate(UserP.java:419)
	at org.apache.directory.fortress.core.impl.UserP.createSession(UserP.java:578)
	at org.apache.directory.fortress.core.impl.UserP.createSession(UserP.java:497)
	at org.apache.directory.fortress.core.impl.AccessMgrImpl.createSession(AccessMgrImpl.java:115)
	at org.apache.directory.fortress.core.impl.PswdPolicyMgrImplTest.expireWarning(PswdPolicyMgrImplTest.java:513)
	at org.apache.directory.fortress.core.impl.PswdPolicyMgrImplTest.testExpireWarning(PswdPolicyMgrImplTest.java:460)
	at sun.reflect.NativeMethodAccessorImpl.invoke0(Native Method)
	at sun.reflect.NativeMethodAccessorImpl.invoke(NativeMethodAccessorImpl.java:62)
	at sun.reflect.DelegatingMethodAccessorImpl.invoke(DelegatingMethodAccessorImpl.java:43)
	at java.lang.reflect.Method.invoke(Method.java:498)
	at junit.framework.TestCase.runTest(TestCase.java:176)
	at junit.framework.TestCase.runBare(TestCase.java:141)
	at junit.framework.TestResult$1.protect(TestResult.java:122)
	at junit.framework.TestResult.runProtected(TestResult.java:142)
	at junit.framework.TestResult.run(TestResult.java:125)
	at junit.framework.TestCase.run(TestCase.java:129)
	at junit.framework.TestSuite.runTest(TestSuite.java:252)
	at junit.framework.TestSuite.run(TestSuite.java:247)
	at org.junit.internal.runners.JUnit38ClassRunner.run(JUnit38ClassRunner.java:86)
	at org.apache.maven.surefire.junit4.JUnit4Provider.execute(JUnit4Provider.java:283)
	at org.apache.maven.surefire.junit4.JUnit4Provider.executeWithRerun(JUnit4Provider.java:173)
	at org.apache.maven.surefire.junit4.JUnit4Provider.executeTestSet(JUnit4Provider.java:153)
	at org.apache.maven.surefire.junit4.JUnit4Provider.invoke(JUnit4Provider.java:128)
	at org.apache.maven.surefire.booter.ForkedBooter.invokeProviderInSameClassLoader(ForkedBooter.java:203)
	at org.apache.maven.surefire.booter.ForkedBooter.runSuitesInProcess(ForkedBooter.java:155)
	at org.apache.maven.surefire.booter.ForkedBooter.main(ForkedBooter.java:103)
2020-06-03 21:59:022 INFO  LogUtil:64 - PWGRACE9 PLCY TP1 USR TU5
2020-06-03 21:59:024 INFO  UserDAO:1794 - deleteResetFlag user [jtsTU5User11] no such attribute:pwdReset
2020-06-03 21:59:024 INFO  LogUtil:64 - org.apache.directory.fortress.core.impl.TestUtils.sleep for len=6000
2020-06-03 21:59:030 INFO  LogUtil:64 - org.apache.directory.fortress.core.impl.TestUtils.sleep for len=1000
2020-06-03 21:59:032 INFO  LogUtil:64 - org.apache.directory.fortress.core.impl.TestUtils.sleep for len=1000
2020-06-03 21:59:033 INFO  LogUtil:64 - org.apache.directory.fortress.core.impl.TestUtils.sleep for len=1000
2020-06-03 21:59:035 INFO  LogUtil:64 - org.apache.directory.fortress.core.impl.TestUtils.sleep for len=1000
2020-06-03 21:59:036 INFO  LogUtil:64 - org.apache.directory.fortress.core.impl.TestUtils.sleep for len=1000
2020-06-03 21:59:038 INFO  LogUtil:64 - org.apache.directory.fortress.core.impl.TestUtils.sleep for len=1000
2020-06-03 21:59:039 INFO  LogUtil:64 - org.apache.directory.fortress.core.impl.TestUtils.sleep for len=1000
2020-06-03 21:59:041 INFO  LogUtil:64 - org.apache.directory.fortress.core.impl.TestUtils.sleep for len=1000
2020-06-03 21:59:042 INFO  LogUtil:64 - org.apache.directory.fortress.core.impl.TestUtils.sleep for len=1000
2020-06-03 21:59:044 INFO  LogUtil:64 - org.apache.directory.fortress.core.impl.TestUtils.sleep for len=1000
2020-06-03 21:59:046 INFO  LogUtil:64 - org.apache.directory.fortress.core.impl.TestUtils.sleep for len=1000
2020-06-03 21:59:047 INFO  LogUtil:64 - PWGRACE10 PLCY TP1 USR TU5
2020-06-03 21:59:048 INFO  UserDAO:1794 - deleteResetFlag user [jtsTU5User12] no such attribute:pwdReset
2020-06-03 21:59:048 INFO  LogUtil:64 - org.apache.directory.fortress.core.impl.TestUtils.sleep for len=5000
2020-06-03 21:59:053 INFO  LogUtil:64 - org.apache.directory.fortress.core.impl.TestUtils.sleep for len=1000
2020-06-03 21:59:055 INFO  LogUtil:64 - org.apache.directory.fortress.core.impl.TestUtils.sleep for len=1000
2020-06-03 21:59:057 INFO  LogUtil:64 - org.apache.directory.fortress.core.impl.TestUtils.sleep for len=1000
2020-06-03 21:59:058 INFO  LogUtil:64 - org.apache.directory.fortress.core.impl.TestUtils.sleep for len=1000
2020-06-03 22:00:000 INFO  LogUtil:64 - org.apache.directory.fortress.core.impl.TestUtils.sleep for len=1000
2020-06-03 22:00:001 INFO  LogUtil:64 - org.apache.directory.fortress.core.impl.TestUtils.sleep for len=1000
2020-06-03 22:00:002 INFO  LogUtil:64 - PWMAXFAILK11 PLCY TP1 USR TU5
2020-06-03 22:00:003 INFO  LogUtil:64 - org.apache.directory.fortress.core.impl.TestUtils.sleep for len=1000
2020-06-03 22:00:005 INFO  LogUtil:64 - org.apache.directory.fortress.core.impl.TestUtils.sleep for len=1000
2020-06-03 22:00:006 INFO  LogUtil:64 - org.apache.directory.fortress.core.impl.TestUtils.sleep for len=1000
2020-06-03 22:00:008 INFO  LogUtil:64 - org.apache.directory.fortress.core.impl.TestUtils.sleep for len=1000
2020-06-03 22:00:009 INFO  LogUtil:64 - org.apache.directory.fortress.core.impl.TestUtils.sleep for len=1000
2020-06-03 22:00:011 INFO  LogUtil:64 - org.apache.directory.fortress.core.impl.TestUtils.sleep for len=1000
2020-06-03 22:00:013 INFO  LogUtil:64 - org.apache.directory.fortress.core.impl.TestUtils.sleep for len=1000
2020-06-03 22:00:014 INFO  LogUtil:64 - org.apache.directory.fortress.core.impl.TestUtils.sleep for len=1000
2020-06-03 22:00:016 INFO  LogUtil:64 - org.apache.directory.fortress.core.impl.TestUtils.sleep for len=1000
2020-06-03 22:00:017 INFO  LogUtil:64 - org.apache.directory.fortress.core.impl.TestUtils.sleep for len=1000
2020-06-03 22:00:019 INFO  LogUtil:64 - PWMAXFAIL12 PLCY TP1 USR TU5
2020-06-03 22:00:020 INFO  LogUtil:64 - org.apache.directory.fortress.core.impl.TestUtils.sleep for len=1000
2020-06-03 22:00:022 INFO  LogUtil:64 - org.apache.directory.fortress.core.impl.TestUtils.sleep for len=1000
2020-06-03 22:00:023 INFO  LogUtil:64 - org.apache.directory.fortress.core.impl.TestUtils.sleep for len=1000
2020-06-03 22:00:025 INFO  LogUtil:64 - org.apache.directory.fortress.core.impl.TestUtils.sleep for len=1000
2020-06-03 22:00:026 INFO  LogUtil:64 - org.apache.directory.fortress.core.impl.TestUtils.sleep for len=1000
2020-06-03 22:00:029 INFO  LogUtil:64 - PWDURATION13 PLCY TP1 USR TU5
2020-06-03 22:00:030 INFO  LogUtil:64 - org.apache.directory.fortress.core.impl.TestUtils.sleep for len=1000
2020-06-03 22:00:031 INFO  LogUtil:64 - org.apache.directory.fortress.core.impl.TestUtils.sleep for len=1000
2020-06-03 22:00:033 INFO  LogUtil:64 - org.apache.directory.fortress.core.impl.TestUtils.sleep for len=1000
2020-06-03 22:00:034 INFO  LogUtil:64 - org.apache.directory.fortress.core.impl.TestUtils.sleep for len=4000
2020-06-03 22:00:038 INFO  LogUtil:64 - org.apache.directory.fortress.core.impl.TestUtils.sleep for len=1000
2020-06-03 22:00:040 INFO  LogUtil:64 - PWDURATION14 PLCY TP1 USR TU5
2020-06-03 22:00:041 INFO  LogUtil:64 - org.apache.directory.fortress.core.impl.TestUtils.sleep for len=1000
2020-06-03 22:00:042 INFO  LogUtil:64 - org.apache.directory.fortress.core.impl.TestUtils.sleep for len=1000
2020-06-03 22:00:044 INFO  LogUtil:64 - org.apache.directory.fortress.core.impl.TestUtils.sleep for len=1000
2020-06-03 22:00:046 INFO  LogUtil:64 - org.apache.directory.fortress.core.impl.TestUtils.sleep for len=1000
2020-06-03 22:00:047 INFO  LogUtil:64 - org.apache.directory.fortress.core.impl.TestUtils.sleep for len=1000
2020-06-03 22:00:048 INFO  LogUtil:64 - org.apache.directory.fortress.core.impl.TestUtils.sleep for len=5000
2020-06-03 22:00:053 INFO  LogUtil:64 - org.apache.directory.fortress.core.impl.TestUtils.sleep for len=1000
2020-06-03 22:00:055 INFO  LogUtil:64 - PWLOCK15 PLCY TP1 USR TU5
2020-06-03 22:00:056 INFO  LogUtil:64 - org.apache.directory.fortress.core.impl.TestUtils.sleep for len=1000
2020-06-03 22:00:058 INFO  LogUtil:64 - org.apache.directory.fortress.core.impl.TestUtils.sleep for len=1000
2020-06-03 22:01:000 INFO  LogUtil:64 - org.apache.directory.fortress.core.impl.TestUtils.sleep for len=1000
2020-06-03 22:01:002 INFO  LogUtil:64 - PWLOCK16 PLCY TP1 USR TU5
2020-06-03 22:01:003 INFO  LogUtil:64 - org.apache.directory.fortress.core.impl.TestUtils.sleep for len=1000
2020-06-03 22:01:005 INFO  LogUtil:64 - org.apache.directory.fortress.core.impl.TestUtils.sleep for len=1000
2020-06-03 22:01:007 INFO  LogUtil:64 - org.apache.directory.fortress.core.impl.TestUtils.sleep for len=1000
2020-06-03 22:01:008 INFO  LogUtil:64 - PWINTERVAL17 PLCY TP1 USR TU5
2020-06-03 22:01:010 INFO  LogUtil:64 - org.apache.directory.fortress.core.impl.TestUtils.sleep for len=1000
2020-06-03 22:01:011 INFO  LogUtil:64 - org.apache.directory.fortress.core.impl.TestUtils.sleep for len=1000
2020-06-03 22:01:013 INFO  LogUtil:64 - org.apache.directory.fortress.core.impl.TestUtils.sleep for len=1000
2020-06-03 22:01:014 INFO  LogUtil:64 - org.apache.directory.fortress.core.impl.TestUtils.sleep for len=1000
2020-06-03 22:01:016 INFO  LogUtil:64 - org.apache.directory.fortress.core.impl.TestUtils.sleep for len=1000
2020-06-03 22:01:017 INFO  LogUtil:64 - org.apache.directory.fortress.core.impl.TestUtils.sleep for len=5000
2020-06-03 22:01:019 ERROR DefaultLdapConnectionFactory:68 - unable to bind connection: ERR_04202 A value is missing on some RDN
2020-06-03 22:01:022 INFO  LogUtil:64 - org.apache.directory.fortress.core.impl.TestUtils.sleep for len=1000
2020-06-03 22:01:023 INFO  LogUtil:64 - org.apache.directory.fortress.core.impl.TestUtils.sleep for len=1000
2020-06-03 22:01:025 INFO  LogUtil:64 - org.apache.directory.fortress.core.impl.TestUtils.sleep for len=1000
2020-06-03 22:01:026 INFO  LogUtil:64 - org.apache.directory.fortress.core.impl.TestUtils.sleep for len=1000
2020-06-03 22:01:028 INFO  LogUtil:64 - org.apache.directory.fortress.core.impl.TestUtils.sleep for len=1000
2020-06-03 22:01:029 INFO  LogUtil:64 - org.apache.directory.fortress.core.impl.TestUtils.sleep for len=1000
2020-06-03 22:01:030 INFO  LogUtil:64 - org.apache.directory.fortress.core.impl.TestUtils.sleep for len=5000
2020-06-03 22:01:035 INFO  LogUtil:64 - org.apache.directory.fortress.core.impl.TestUtils.sleep for len=1000
2020-06-03 22:01:037 INFO  LogUtil:64 - PWINTERVAL18 PLCY TP1 USR TU5
2020-06-03 22:01:038 INFO  LogUtil:64 - org.apache.directory.fortress.core.impl.TestUtils.sleep for len=1000
2020-06-03 22:01:039 INFO  LogUtil:64 - org.apache.directory.fortress.core.impl.TestUtils.sleep for len=1000
2020-06-03 22:01:040 INFO  LogUtil:64 - org.apache.directory.fortress.core.impl.TestUtils.sleep for len=7000
2020-06-03 22:01:047 INFO  LogUtil:64 - org.apache.directory.fortress.core.impl.TestUtils.sleep for len=1000
2020-06-03 22:01:048 INFO  LogUtil:64 - org.apache.directory.fortress.core.impl.TestUtils.sleep for len=1000
2020-06-03 22:01:050 INFO  LogUtil:64 - org.apache.directory.fortress.core.impl.TestUtils.sleep for len=1000
2020-06-03 22:01:051 INFO  LogUtil:64 - org.apache.directory.fortress.core.impl.TestUtils.sleep for len=7000
2020-06-03 22:01:058 INFO  LogUtil:64 - org.apache.directory.fortress.core.impl.TestUtils.sleep for len=1000
2020-06-03 22:01:059 INFO  LogUtil:64 - PWMUST19 PLCY TP1 USR TU5
2020-06-03 22:02:002 INFO  LogUtil:64 - org.apache.directory.fortress.core.impl.TestUtils.sleep for len=1000
2020-06-03 22:02:003 INFO  LogUtil:64 - PWMUST20 PLCY TP1 USR TU5
2020-06-03 22:02:004 INFO  LogUtil:64 - org.apache.directory.fortress.core.impl.TestUtils.sleep for len=1000
2020-06-03 22:02:005 INFO  LogUtil:64 - PWALLOW21 PLCY TP1 USR TU5
2020-06-03 22:02:006 INFO  LogUtil:64 - org.apache.directory.fortress.core.impl.TestUtils.sleep for len=1000
2020-06-03 22:02:007 INFO  LogUtil:64 - PWALLOW22 PLCY TP1 USR TU5
2020-06-03 22:02:008 INFO  UserDAO:1794 - deleteResetFlag user [jtsTU5User24] no such attribute:pwdReset
2020-06-03 22:02:008 INFO  LogUtil:64 - PWSAFEW23 PLCY TP1 USR TU5
2020-06-03 22:02:009 INFO  LogUtil:64 - org.apache.directory.fortress.core.impl.TestUtils.sleep for len=1000
2020-06-03 22:02:010 INFO  LogUtil:64 - PWSAFE24 PLCY TP1 USR TU5
2020-06-03 22:02:011 INFO  UserDAO:1794 - deleteResetFlag user [jtsTU5User26] no such attribute:pwdReset
NUMBER OF ADDS: 1146
NUMBER OF BINDS: 1125
NUMBER OF DELETES: 0
NUMBER OF MODS: 4244
NUMBER OF READS: 20168
NUMBER OF SEARCHES: 7081
Tests run: 128, Failures: 1, Errors: 0, Skipped: 0, Time elapsed: 3,651.912 sec <<< FAILURE! - in org.apache.directory.fortress.core.impl.FortressJUnitTest
testExpireWarning(org.apache.directory.fortress.core.impl.PswdPolicyMgrImplTest)  Time elapsed: 5.276 sec  <<< FAILURE!
junit.framework.AssertionFailedError: checkPwPolicies for userId [jtsTU5User9] PASSWORD HAS EXPIRED
	at junit.framework.Assert.fail(Assert.java:57)
	at junit.framework.TestCase.fail(TestCase.java:227)
	at org.apache.directory.fortress.core.impl.PswdPolicyMgrImplTest.expireWarning(PswdPolicyMgrImplTest.java:535)
	at org.apache.directory.fortress.core.impl.PswdPolicyMgrImplTest.testExpireWarning(PswdPolicyMgrImplTest.java:460)


Results :

Failed tests: 
  PswdPolicyMgrImplTest.testExpireWarning:460->expireWarning:535 checkPwPolicies for userId [jtsTU5User9] PASSWORD HAS EXPIRED

Tests run: 128, Failures: 1, Errors: 0, Skipped: 0

[INFO] ------------------------------------------------------------------------
[INFO] BUILD FAILURE
[INFO] ------------------------------------------------------------------------
[INFO] Total time:  01:00 h
[INFO] Finished at: 2020-06-03T22:02:12Z
[INFO] ------------------------------------------------------------------------
[ERROR] Failed to execute goal org.apache.maven.plugins:maven-surefire-plugin:2.18.1:test (default-test) on project fortress-core: There are test failures.
[ERROR] 
[ERROR] Please refer to <https://builds.apache.org/job/dir-fortress-core-docker-apacheds-test/ws/target/surefire-reports> for the individual test results.
[ERROR] -> [Help 1]
[ERROR] 
[ERROR] To see the full stack trace of the errors, re-run Maven with the -e switch.
[ERROR] Re-run Maven using the -X switch to enable full debug logging.
[ERROR] 
[ERROR] For more information about the errors and possible solutions, please read the following articles:
[ERROR] [Help 1] http://cwiki.apache.org/confluence/display/MAVEN/MojoFailureException
Build step 'Execute shell' marked build as failure