You are viewing a plain text version of this content. The canonical link for it is here.
Posted to notifications@directory.apache.org by Apache Jenkins Server <je...@builds.apache.org> on 2014/04/06 06:18:57 UTC
Build failed in Jenkins: dir-apacheds-ubuntu-deploy #1309
See <https://builds.apache.org/job/dir-apacheds-ubuntu-deploy/1309/>
------------------------------------------
[...truncated 4318 lines...]
[INFO] Copying 0 resource
[INFO] Copying 3 resources
[INFO]
[INFO] --- maven-compiler-plugin:3.1:compile (default-compile) @ apacheds-protocol-kerberos ---
[INFO] Changes detected - recompiling the module!
[INFO] Compiling 33 source files to <https://builds.apache.org/job/dir-apacheds-ubuntu-deploy/ws/trunk/protocol-kerberos/target/classes>
[INFO]
[INFO] --- maven-resources-plugin:2.6:testResources (default-testResources) @ apacheds-protocol-kerberos ---
[INFO] Using 'UTF-8' encoding to copy filtered resources.
[INFO] Copying 2 resources
[INFO] Copying 3 resources
[INFO]
[INFO] --- maven-compiler-plugin:3.1:testCompile (default-testCompile) @ apacheds-protocol-kerberos ---
[INFO] Changes detected - recompiling the module!
[INFO] Compiling 11 source files to <https://builds.apache.org/job/dir-apacheds-ubuntu-deploy/ws/trunk/protocol-kerberos/target/test-classes>
[INFO]
[INFO] --- maven-surefire-plugin:2.15:test (default-test) @ apacheds-protocol-kerberos ---
[INFO] Surefire report directory: <https://builds.apache.org/job/dir-apacheds-ubuntu-deploy/ws/trunk/protocol-kerberos/target/surefire-reports>
-------------------------------------------------------
T E S T S
-------------------------------------------------------
Running org.apache.directory.server.kerberos.protocol.TicketGrantingEncryptionTypeTest
Tests run: 6, Failures: 0, Errors: 0, Skipped: 1, Time elapsed: 0.88 sec - in org.apache.directory.server.kerberos.protocol.TicketGrantingEncryptionTypeTest
Running org.apache.directory.server.kerberos.protocol.TicketGrantingServiceTest
Tests run: 37, Failures: 0, Errors: 0, Skipped: 2, Time elapsed: 0.152 sec - in org.apache.directory.server.kerberos.protocol.TicketGrantingServiceTest
Running org.apache.directory.server.kerberos.protocol.AuthenticationEncryptionTypeTest
Tests run: 4, Failures: 0, Errors: 0, Skipped: 1, Time elapsed: 0.043 sec - in org.apache.directory.server.kerberos.protocol.AuthenticationEncryptionTypeTest
Running org.apache.directory.server.kerberos.protocol.EncTktInSkeyTest
Tests run: 1, Failures: 0, Errors: 0, Skipped: 0, Time elapsed: 0.013 sec - in org.apache.directory.server.kerberos.protocol.EncTktInSkeyTest
Running org.apache.directory.server.kerberos.protocol.TicketGrantingPolicyTest
Tests run: 12, Failures: 0, Errors: 0, Skipped: 0, Time elapsed: 0.166 sec - in org.apache.directory.server.kerberos.protocol.TicketGrantingPolicyTest
Running org.apache.directory.server.kerberos.protocol.AuthenticationServiceTest
Tests run: 30, Failures: 0, Errors: 0, Skipped: 0, Time elapsed: 0.3 sec - in org.apache.directory.server.kerberos.protocol.AuthenticationServiceTest
Running org.apache.directory.server.kerberos.protocol.PreAuthenticationTest
Tests run: 4, Failures: 0, Errors: 0, Skipped: 0, Time elapsed: 0.032 sec - in org.apache.directory.server.kerberos.protocol.PreAuthenticationTest
Running org.apache.directory.server.kerberos.protocol.AuthenticationPolicyTest
Tests run: 7, Failures: 0, Errors: 0, Skipped: 0, Time elapsed: 0.006 sec - in org.apache.directory.server.kerberos.protocol.AuthenticationPolicyTest
Results :
Tests run: 101, Failures: 0, Errors: 0, Skipped: 4
[JENKINS] Recording test results
[INFO]
[INFO] --- maven-bundle-plugin:2.3.7:bundle (default-bundle) @ apacheds-protocol-kerberos ---
[WARNING] Bundle org.apache.directory.server:apacheds-protocol-kerberos:bundle:2.0.0-M17-SNAPSHOT : Split package org/apache/directory/server/kerberos/protocol/codec
Use directive -split-package:=(merge-first|merge-last|error|first) on Export/Private Package instruction to get rid of this warning
Package found in [Jar:., Jar:apacheds-kerberos-codec]
Reference from <https://builds.apache.org/job/dir-apacheds-ubuntu-deploy/ws/trunk/kerberos-codec/target/apacheds-kerberos-codec-2.0.0-M17-SNAPSHOT.jar>
Classpath [Jar:., Jar:apacheds-core-api, Jar:commons-lang, Jar:commons-io, Jar:apacheds-core-constants, Jar:api-i18n, Jar:api-ldap-client-api, Jar:commons-pool, Jar:api-ldap-codec-core, Jar:api-ldap-extras-aci, Jar:api-ldap-extras-util, Jar:api-ldap-schema-data, Jar:api-util, Jar:apacheds-i18n, Jar:apacheds-kerberos-codec, Jar:api-asn1-ber, Jar:apacheds-protocol-shared, Jar:apacheds-core-shared, Jar:api-ldap-extras-codec-api, Jar:mavibot, Jar:api-asn1-api, Jar:api-ldap-model, Jar:antlr, Jar:commons-collections, Jar:mina-core, Jar:ehcache-core, Jar:annotations, Jar:slf4j-api, Jar:log4j]
[INFO]
[INFO] --- maven-site-plugin:3.3:attach-descriptor (attach-descriptor) @ apacheds-protocol-kerberos ---
[INFO]
[INFO] --- tools-maven-plugin:1.4:verify-legal-files (verify-legal-files) @ apacheds-protocol-kerberos ---
[INFO] Checking legal files in: apacheds-protocol-kerberos-2.0.0-M17-SNAPSHOT.jar
[WARNING] Failed to getClass for org.apache.maven.plugin.source.SourceJarMojo
[INFO]
[INFO] --- maven-source-plugin:2.2.1:jar (attach-sources) @ apacheds-protocol-kerberos ---
[INFO] Building jar: <https://builds.apache.org/job/dir-apacheds-ubuntu-deploy/ws/trunk/protocol-kerberos/target/apacheds-protocol-kerberos-2.0.0-M17-SNAPSHOT-sources.jar>
[INFO]
[INFO] --- maven-install-plugin:2.4:install (default-install) @ apacheds-protocol-kerberos ---
[INFO] Installing <https://builds.apache.org/job/dir-apacheds-ubuntu-deploy/ws/trunk/protocol-kerberos/target/apacheds-protocol-kerberos-2.0.0-M17-SNAPSHOT.jar> to /home/jenkins/jenkins-slave/maven-repositories/1/org/apache/directory/server/apacheds-protocol-kerberos/2.0.0-M17-SNAPSHOT/apacheds-protocol-kerberos-2.0.0-M17-SNAPSHOT.jar
[INFO] Installing <https://builds.apache.org/job/dir-apacheds-ubuntu-deploy/ws/trunk/protocol-kerberos/pom.xml> to /home/jenkins/jenkins-slave/maven-repositories/1/org/apache/directory/server/apacheds-protocol-kerberos/2.0.0-M17-SNAPSHOT/apacheds-protocol-kerberos-2.0.0-M17-SNAPSHOT.pom
[INFO] Installing <https://builds.apache.org/job/dir-apacheds-ubuntu-deploy/ws/trunk/protocol-kerberos/target/apacheds-protocol-kerberos-2.0.0-M17-SNAPSHOT-sources.jar> to /home/jenkins/jenkins-slave/maven-repositories/1/org/apache/directory/server/apacheds-protocol-kerberos/2.0.0-M17-SNAPSHOT/apacheds-protocol-kerberos-2.0.0-M17-SNAPSHOT-sources.jar
[INFO]
[INFO] --- maven-bundle-plugin:2.3.7:install (default-install) @ apacheds-protocol-kerberos ---
[WARNING] Exception while updating local OBR: Unable to read repository xml: file:/home/jenkins/jenkins-slave/maven-repositories/1/repository.xml
org.apache.maven.plugin.MojoExecutionException: Unable to read repository xml: file:/home/jenkins/jenkins-slave/maven-repositories/1/repository.xml
at org.apache.felix.obrplugin.ObrUpdate.parseRepositoryXml(ObrUpdate.java:324)
at org.apache.felix.obrplugin.ObrInstall.execute(ObrInstall.java:141)
at org.apache.maven.plugin.DefaultBuildPluginManager.executeMojo(DefaultBuildPluginManager.java:101)
at org.apache.maven.lifecycle.internal.MojoExecutor.execute(MojoExecutor.java:209)
at org.apache.maven.lifecycle.internal.MojoExecutor.execute(MojoExecutor.java:153)
at org.apache.maven.lifecycle.internal.MojoExecutor.execute(MojoExecutor.java:145)
at org.apache.maven.lifecycle.internal.LifecycleModuleBuilder.buildProject(LifecycleModuleBuilder.java:84)
at org.apache.maven.lifecycle.internal.LifecycleModuleBuilder.buildProject(LifecycleModuleBuilder.java:59)
at org.apache.maven.lifecycle.internal.LifecycleStarter.singleThreadedBuild(LifecycleStarter.java:183)
at org.apache.maven.lifecycle.internal.LifecycleStarter.execute(LifecycleStarter.java:161)
at org.apache.maven.DefaultMaven.doExecute(DefaultMaven.java:320)
at org.apache.maven.DefaultMaven.execute(DefaultMaven.java:156)
at org.jvnet.hudson.maven3.launcher.Maven3Launcher.main(Maven3Launcher.java:117)
at sun.reflect.NativeMethodAccessorImpl.invoke0(Native Method)
at sun.reflect.NativeMethodAccessorImpl.invoke(NativeMethodAccessorImpl.java:57)
at sun.reflect.DelegatingMethodAccessorImpl.invoke(DelegatingMethodAccessorImpl.java:43)
at java.lang.reflect.Method.invoke(Method.java:606)
at org.codehaus.plexus.classworlds.launcher.Launcher.launchStandard(Launcher.java:329)
at org.codehaus.plexus.classworlds.launcher.Launcher.launch(Launcher.java:239)
at org.jvnet.hudson.maven3.agent.Maven3Main.launch(Maven3Main.java:178)
at sun.reflect.NativeMethodAccessorImpl.invoke0(Native Method)
at sun.reflect.NativeMethodAccessorImpl.invoke(NativeMethodAccessorImpl.java:57)
at sun.reflect.DelegatingMethodAccessorImpl.invoke(DelegatingMethodAccessorImpl.java:43)
at java.lang.reflect.Method.invoke(Method.java:606)
at hudson.maven.Maven3Builder.call(Maven3Builder.java:134)
at hudson.maven.Maven3Builder.call(Maven3Builder.java:69)
at hudson.remoting.UserRequest.perform(UserRequest.java:118)
at hudson.remoting.UserRequest.perform(UserRequest.java:48)
at hudson.remoting.Request$2.run(Request.java:328)
at hudson.remoting.InterceptingExecutorService$1.call(InterceptingExecutorService.java:72)
at java.util.concurrent.FutureTask$Sync.innerRun(FutureTask.java:334)
at java.util.concurrent.FutureTask.run(FutureTask.java:166)
at java.util.concurrent.ThreadPoolExecutor.runWorker(ThreadPoolExecutor.java:1145)
at java.util.concurrent.ThreadPoolExecutor$Worker.run(ThreadPoolExecutor.java:615)
at java.lang.Thread.run(Thread.java:724)
Caused by: org.xmlpull.v1.XmlPullParserException: unexpected type (position:END_DOCUMENT null@3:1 in java.io.InputStreamReader@1d43185)
at org.kxml2.io.KXmlParser.exception(Unknown Source)
at org.kxml2.io.KXmlParser.nextTag(Unknown Source)
at org.apache.felix.bundlerepository.impl.PullParser.parseRepository(PullParser.java:43)
at org.apache.felix.bundlerepository.impl.DataModelHelperImpl.repository(DataModelHelperImpl.java:147)
at org.apache.felix.bundlerepository.impl.DataModelHelperImpl.repository(DataModelHelperImpl.java:118)
at org.apache.felix.obrplugin.ObrUpdate.parseRepositoryXml(ObrUpdate.java:316)
... 34 more
[INFO]
[INFO] --- maven-deploy-plugin:2.7:deploy (default-deploy) @ apacheds-protocol-kerberos ---
Downloading: https://repository.apache.org/content/repositories/snapshots/org/apache/directory/server/apacheds-protocol-kerberos/2.0.0-M17-SNAPSHOT/maven-metadata.xml
[WARNING] Could not transfer metadata org.apache.directory.server:apacheds-protocol-kerberos:2.0.0-M17-SNAPSHOT/maven-metadata.xml from/to apache.snapshots.https (https://repository.apache.org/content/repositories/snapshots): Failed to transfer file: https://repository.apache.org/content/repositories/snapshots/org/apache/directory/server/apacheds-protocol-kerberos/2.0.0-M17-SNAPSHOT/maven-metadata.xml. Return code is: 502, ReasonPhrase:Proxy Error.
[JENKINS] Archiving disabled
[INFO] ------------------------------------------------------------------------
[INFO] Reactor Summary:
[INFO]
[INFO] ApacheDS .......................................... SUCCESS [24.336s]
[INFO] ApacheDS I18n ..................................... SUCCESS [12.518s]
[INFO] ApacheDS Core Constants ........................... SUCCESS [6.403s]
[INFO] ApacheDS Core API ................................. SUCCESS [33.259s]
[INFO] ApacheDS Core Shared .............................. SUCCESS [12.821s]
[INFO] ApacheDS Interceptors ............................. SUCCESS [4.892s]
[INFO] ApacheDS AdministrativePoint Interceptor .......... SUCCESS [8.699s]
[INFO] ApacheDS Authentication Interceptor ............... SUCCESS [13.364s]
[INFO] ApacheDS Authorization Interceptor ................ SUCCESS [11.730s]
[INFO] ApacheDS ChangeLog Interceptor .................... SUCCESS [10.968s]
[INFO] ApacheDS Collective Attribute Interceptor ......... SUCCESS [7.994s]
[INFO] ApacheDS Event Interceptor ........................ SUCCESS [7.597s]
[INFO] ApacheDS Exception Interceptor .................... SUCCESS [8.744s]
[INFO] ApacheDS Journal Interceptor ...................... SUCCESS [7.384s]
[INFO] ApacheDS Normalization Interceptor ................ SUCCESS [11.979s]
[INFO] ApacheDS Operational Attribute Interceptor ........ SUCCESS [8.018s]
[INFO] ApacheDS Referral Interceptor ..................... SUCCESS [8.543s]
[INFO] ApacheDS Schema Interceptor ....................... SUCCESS [12.388s]
[INFO] ApacheDS Subtree Interceptor ...................... SUCCESS [12.766s]
[INFO] ApacheDS Triggers Interceptor ..................... SUCCESS [8.126s]
[INFO] ApacheDS Core ..................................... SUCCESS [11.734s]
[INFO] ApacheDS Core AVL ................................. SUCCESS [13.042s]
[INFO] ApacheDS Generalized (X) DBM Partition ............ SUCCESS [16.845s]
[INFO] ApacheDS LDIF Partition ........................... SUCCESS [19.145s]
[INFO] ApacheDS JDBM Partition ........................... SUCCESS [59.245s]
[INFO] ApacheDS Mavibot Partition ........................ SUCCESS [15.533s]
[INFO] ApacheDS Core Annotations ......................... SUCCESS [1:00.188s]
[INFO] ApacheDS Core JNDI ................................ SUCCESS [10.925s]
[INFO] ApacheDS Protocol Kerberos Codec .................. SUCCESS [25.110s]
[INFO] ApacheDS Interceptors for Kerberos ................ SUCCESS [11.596s]
[INFO] ApacheDS Protocol Dhcp ............................ SUCCESS [10.654s]
[INFO] ApacheDS Protocol Shared .......................... SUCCESS [9.013s]
[INFO] ApacheDS Protocol Dns ............................. SUCCESS [12.376s]
[INFO] ApacheDS Protocol Kerberos ........................ FAILURE [39.786s]
[INFO] ApacheDS Protocol Ldap ............................ SKIPPED
[INFO] ApacheDS Protocol Ntp ............................. SKIPPED
[INFO] Apacheds Server Annotations ....................... SKIPPED
[INFO] ApacheDS Server Config ............................ SKIPPED
[INFO] ApacheDS Server JNDI .............................. SKIPPED
[INFO] ApacheDS Test Framework ........................... SKIPPED
[INFO] ApacheDS All ...................................... SKIPPED
[INFO] ApacheDS Logger Interceptor ....................... SKIPPED
[INFO] ApacheDS Password Hashing Interceptor ............. SKIPPED
[INFO] ApacheDS Core Integration ......................... SKIPPED
[INFO] ApacheDS Protocol Kerberos Test ................... SKIPPED
[INFO] ApacheDS Server Integration ....................... SKIPPED
[INFO] ApacheDS DirectoryService-WebApp bridge ........... SKIPPED
[INFO] ApacheDS Jetty HTTP Server Integration ............ SKIPPED
[INFO] ApacheDS Service Builder .......................... SKIPPED
[INFO] Apache Directory LDAP Client API test ............. SKIPPED
[INFO] kerberos-client ................................... SKIPPED
[INFO] ApacheDS Service .................................. SKIPPED
[INFO] ApacheDS Wrapper .................................. SKIPPED
[INFO] ApacheDS Installers Maven Plugin .................. SKIPPED
[INFO] ApacheDS Installers ............................... SKIPPED
[INFO] ------------------------------------------------------------------------
[INFO] BUILD FAILURE
[INFO] ------------------------------------------------------------------------
[INFO] Total time: 10:56.416s
[INFO] Finished at: Sun Apr 06 04:17:08 UTC 2014
[INFO] Final Memory: 66M/208M
[INFO] ------------------------------------------------------------------------
[JENKINS] Archiving disabled
[JENKINS] Archiving disabled
[JENKINS] Archiving disabled
[JENKINS] Archiving disabled
[JENKINS] Archiving disabled
[JENKINS] Archiving disabled
[JENKINS] Archiving disabled
[JENKINS] Archiving disabled
[JENKINS] Archiving disabled
[JENKINS] Archiving disabled
[JENKINS] Archiving disabled
[JENKINS] Archiving disabled
[JENKINS] Archiving disabled
[JENKINS] Archiving disabled
[JENKINS] Archiving disabled
[JENKINS] Archiving disabled
[JENKINS] Archiving disabled
[JENKINS] Archiving disabled
[JENKINS] Archiving disabled
[JENKINS] Archiving disabled
[JENKINS] Archiving disabled
[JENKINS] Archiving disabled
[JENKINS] Archiving disabled
[JENKINS] Archiving disabled
[JENKINS] Archiving disabled
[JENKINS] Archiving disabled
[JENKINS] Archiving disabled
[JENKINS] Archiving disabled
[JENKINS] Archiving disabled
[JENKINS] Archiving disabled
[JENKINS] Archiving disabled
[JENKINS] Archiving disabled
[JENKINS] Archiving disabled
[JENKINS] Archiving disabled
[JENKINS] Archiving disabled
[JENKINS] Archiving disabled
[JENKINS] Archiving disabled
[JENKINS] Archiving disabled
[JENKINS] Archiving disabled
[JENKINS] Archiving disabled
[JENKINS] Archiving disabled
[JENKINS] Archiving disabled
[JENKINS] Archiving disabled
[JENKINS] Archiving disabled
[JENKINS] Archiving disabled
[JENKINS] Archiving disabled
[JENKINS] Archiving disabled
[JENKINS] Archiving disabled
[JENKINS] Archiving disabled
[JENKINS] Archiving disabled
[JENKINS] Archiving disabled
[JENKINS] Archiving disabled
[JENKINS] Archiving disabled
[JENKINS] Archiving disabled
[JENKINS] Archiving disabled
Waiting for Jenkins to finish collecting data
[ERROR] Failed to execute goal org.apache.maven.plugins:maven-deploy-plugin:2.7:deploy (default-deploy) on project apacheds-protocol-kerberos: Failed to retrieve remote metadata org.apache.directory.server:apacheds-protocol-kerberos:2.0.0-M17-SNAPSHOT/maven-metadata.xml: Could not transfer metadata org.apache.directory.server:apacheds-protocol-kerberos:2.0.0-M17-SNAPSHOT/maven-metadata.xml from/to apache.snapshots.https (https://repository.apache.org/content/repositories/snapshots): Failed to transfer file: https://repository.apache.org/content/repositories/snapshots/org/apache/directory/server/apacheds-protocol-kerberos/2.0.0-M17-SNAPSHOT/maven-metadata.xml. Return code is: 502, ReasonPhrase:Proxy Error. -> [Help 1]
[ERROR]
[ERROR] To see the full stack trace of the errors, re-run Maven with the -e switch.
[ERROR] Re-run Maven using the -X switch to enable full debug logging.
[ERROR]
[ERROR] For more information about the errors and possible solutions, please read the following articles:
[ERROR] [Help 1] http://cwiki.apache.org/confluence/display/MAVEN/MojoExecutionException
[ERROR]
[ERROR] After correcting the problems, you can resume the build with the command
[ERROR] mvn <goals> -rf :apacheds-protocol-kerberos
channel stopped
Jenkins build is back to stable : dir-apacheds-ubuntu-deploy #1311
Posted by Apache Jenkins Server <je...@builds.apache.org>.
See <https://builds.apache.org/job/dir-apacheds-ubuntu-deploy/1311/>
Jenkins build is unstable: dir-apacheds-ubuntu-deploy #1310
Posted by Apache Jenkins Server <je...@builds.apache.org>.
See <https://builds.apache.org/job/dir-apacheds-ubuntu-deploy/1310/>