You are viewing a plain text version of this content. The canonical link for it is here.
Posted to builds@beam.apache.org by Apache Jenkins Server <je...@builds.apache.org> on 2022/09/27 08:21:04 UTC
Build failed in Jenkins: beam_PerformanceTests_HadoopFormat #4989
See <https://ci-beam.apache.org/job/beam_PerformanceTests_HadoopFormat/4989/display/redirect?page=changes>
Changes:
[noreply] Changes CoGroupByKey typehint from List to Iterable (#22984)
[noreply] Fix TextSource incorrect handling in channels that return short reads.
------------------------------------------
[...truncated 371.74 KB...]
> Task :runners:google-cloud-dataflow-java:****:legacy-****:shadowJar FROM-CACHE
Custom actions are attached to task ':runners:google-cloud-dataflow-java:****:legacy-****:shadowJar'.
Build cache key for task ':runners:google-cloud-dataflow-java:****:legacy-****:shadowJar' is 83d87221e66fe578c537cf1a835f986e
Task ':runners:google-cloud-dataflow-java:****:legacy-****:shadowJar' is not up-to-date because:
No history is available.
Loaded cache entry for task ':runners:google-cloud-dataflow-java:****:legacy-****:shadowJar' with cache key 83d87221e66fe578c537cf1a835f986e
:runners:google-cloud-dataflow-java:****:legacy-****:shadowJar (Thread[Execution **** Thread 3,5,main]) completed. Took 0.346 secs.
work action resolve beam-runners-google-cloud-dataflow-java-legacy-****.jar (project :runners:google-cloud-dataflow-java:****:legacy-****) (Thread[Execution **** Thread 4,5,main]) started.
work action null (Thread[Execution **** Thread 4,5,main]) completed. Took 0.0 secs.
work action resolve beam-runners-google-cloud-dataflow-java-legacy-****.jar (project :runners:google-cloud-dataflow-java:****:legacy-****) (Thread[Execution **** Thread 6,5,main]) started.
work action null (Thread[Execution **** Thread 6,5,main]) completed. Took 0.0 secs.
> Task :sdks:java:io:google-cloud-platform:compileTestJava FROM-CACHE
Custom actions are attached to task ':sdks:java:io:google-cloud-platform:compileTestJava'.
Build cache key for task ':sdks:java:io:google-cloud-platform:compileTestJava' is bfd4a3c6934b85d31877f70f407f0ce3
Task ':sdks:java:io:google-cloud-platform:compileTestJava' is not up-to-date because:
No history is available.
Loaded cache entry for task ':sdks:java:io:google-cloud-platform:compileTestJava' with cache key bfd4a3c6934b85d31877f70f407f0ce3
:sdks:java:io:google-cloud-platform:compileTestJava (Thread[included builds,5,main]) completed. Took 0.715 secs.
Resolve mutations for :sdks:java:io:google-cloud-platform:testClasses (Thread[Execution **** Thread 3,5,main]) started.
Resolve mutations for :sdks:java:io:google-cloud-platform:testClasses (Thread[Execution **** Thread 3,5,main]) completed. Took 0.0 secs.
:sdks:java:io:google-cloud-platform:testClasses (Thread[Execution **** Thread 6,5,main]) started.
> Task :sdks:java:io:google-cloud-platform:testClasses
Skipping task ':sdks:java:io:google-cloud-platform:testClasses' as it has no actions.
:sdks:java:io:google-cloud-platform:testClasses (Thread[Execution **** Thread 6,5,main]) completed. Took 0.0 secs.
Resolve mutations for :sdks:java:io:google-cloud-platform:testJar (Thread[included builds,5,main]) started.
Resolve mutations for :sdks:java:io:google-cloud-platform:testJar (Thread[included builds,5,main]) completed. Took 0.0 secs.
:sdks:java:io:google-cloud-platform:testJar (Thread[Execution **** Thread 3,5,main]) started.
> Task :sdks:java:io:google-cloud-platform:testJar
Caching disabled for task ':sdks:java:io:google-cloud-platform:testJar' because:
Not worth caching
Task ':sdks:java:io:google-cloud-platform:testJar' is not up-to-date because:
No history is available.
:sdks:java:io:google-cloud-platform:testJar (Thread[Execution **** Thread 3,5,main]) completed. Took 0.296 secs.
work action resolve beam-sdks-java-io-google-cloud-platform-tests.jar (project :sdks:java:io:google-cloud-platform) (Thread[Execution **** Thread 6,5,main]) started.
work action null (Thread[Execution **** Thread 6,5,main]) completed. Took 0.0 secs.
Resolve mutations for :runners:google-cloud-dataflow-java:compileTestJava (Thread[included builds,5,main]) started.
Resolve mutations for :runners:google-cloud-dataflow-java:compileTestJava (Thread[included builds,5,main]) completed. Took 0.0 secs.
:runners:google-cloud-dataflow-java:compileTestJava (Thread[Execution **** Thread 3,5,main]) started.
> Task :runners:google-cloud-dataflow-java:compileTestJava FROM-CACHE
Custom actions are attached to task ':runners:google-cloud-dataflow-java:compileTestJava'.
Build cache key for task ':runners:google-cloud-dataflow-java:compileTestJava' is 4a13c219208d4e75d66650a5ee5dd31a
Task ':runners:google-cloud-dataflow-java:compileTestJava' is not up-to-date because:
No history is available.
Loaded cache entry for task ':runners:google-cloud-dataflow-java:compileTestJava' with cache key 4a13c219208d4e75d66650a5ee5dd31a
:runners:google-cloud-dataflow-java:compileTestJava (Thread[Execution **** Thread 3,5,main]) completed. Took 0.464 secs.
Resolve mutations for :runners:google-cloud-dataflow-java:testClasses (Thread[included builds,5,main]) started.
Resolve mutations for :runners:google-cloud-dataflow-java:testClasses (Thread[included builds,5,main]) completed. Took 0.0 secs.
:runners:google-cloud-dataflow-java:testClasses (Thread[Execution **** Thread 4,5,main]) started.
> Task :runners:google-cloud-dataflow-java:testClasses UP-TO-DATE
Skipping task ':runners:google-cloud-dataflow-java:testClasses' as it has no actions.
:runners:google-cloud-dataflow-java:testClasses (Thread[Execution **** Thread 4,5,main]) completed. Took 0.0 secs.
Resolve mutations for :runners:google-cloud-dataflow-java:testJar (Thread[Execution **** Thread 3,5,main]) started.
Resolve mutations for :runners:google-cloud-dataflow-java:testJar (Thread[Execution **** Thread 3,5,main]) completed. Took 0.0 secs.
:runners:google-cloud-dataflow-java:testJar (Thread[included builds,5,main]) started.
> Task :runners:google-cloud-dataflow-java:testJar
Caching disabled for task ':runners:google-cloud-dataflow-java:testJar' because:
Not worth caching
Task ':runners:google-cloud-dataflow-java:testJar' is not up-to-date because:
No history is available.
file or directory '<https://ci-beam.apache.org/job/beam_PerformanceTests_HadoopFormat/ws/src/runners/google-cloud-dataflow-java/build/resources/test',> not found
:runners:google-cloud-dataflow-java:testJar (Thread[included builds,5,main]) completed. Took 0.031 secs.
work action resolve beam-runners-google-cloud-dataflow-java-tests.jar (project :runners:google-cloud-dataflow-java) (Thread[Execution **** Thread 7,5,main]) started.
work action null (Thread[Execution **** Thread 7,5,main]) completed. Took 0.0 secs.
Resolve mutations for :sdks:java:io:hadoop-format:compileTestJava (Thread[Execution **** Thread 6,5,main]) started.
Resolve mutations for :sdks:java:io:hadoop-format:compileTestJava (Thread[Execution **** Thread 6,5,main]) completed. Took 0.0 secs.
:sdks:java:io:hadoop-format:compileTestJava (Thread[included builds,5,main]) started.
This JVM does not support getting OS memory, so no OS memory status updates will be broadcast
> Task :sdks:java:io:hadoop-format:compileTestJava
Custom actions are attached to task ':sdks:java:io:hadoop-format:compileTestJava'.
Build cache key for task ':sdks:java:io:hadoop-format:compileTestJava' is c77ad94b8131d52c5999d6219f7e3902
Task ':sdks:java:io:hadoop-format:compileTestJava' is not up-to-date because:
No history is available.
The input changes require a full rebuild for incremental task ':sdks:java:io:hadoop-format:compileTestJava'.
Full recompilation is required because no incremental change information is available. This is usually caused by clean builds or changing compiler arguments.
Compiling with toolchain '/usr/lib/jvm/java-8-openjdk-amd64'.
Starting process 'Gradle Worker Daemon 1'. Working directory: /home/jenkins/.gradle/****s Command: /usr/lib/jvm/java-8-openjdk-amd64/bin/java -Djava.security.manager=****.org.gradle.process.internal.****.child.BootstrapSecurityManager -Xbootclasspath/p:/home/jenkins/.gradle/caches/modules-2/files-2.1/com.google.errorprone/javac/9+181-r4173-1/bdf4c0aa7d540ee1f7bf14d47447aea4bbf450c5/javac-9+181-r4173-1.jar -Xmx512m -Dfile.encoding=UTF-8 -Duser.country=US -Duser.language=en -Duser.variant -cp /home/jenkins/.gradle/caches/7.5.1/****Main/gradle-****.jar ****.org.gradle.process.internal.****.GradleWorkerMain 'Gradle Worker Daemon 1'
Successfully started process 'Gradle Worker Daemon 1'
Started Gradle **** daemon (0.414 secs) with fork options DaemonForkOptions{executable=/usr/lib/jvm/java-8-openjdk-amd64/bin/java, minHeapSize=null, maxHeapSize=null, jvmArgs=[-Xbootclasspath/p:/home/jenkins/.gradle/caches/modules-2/files-2.1/com.google.errorprone/javac/9+181-r4173-1/bdf4c0aa7d540ee1f7bf14d47447aea4bbf450c5/javac-9+181-r4173-1.jar], keepAliveMode=SESSION}.
Compiling with JDK Java compiler API.
Note: Some input files use or override a deprecated API.
Note: Recompile with -Xlint:deprecation for details.
Class dependency analysis for incremental compilation took 0.044 secs.
Created classpath snapshot for incremental compilation in 1.024 secs.
Stored cache entry for task ':sdks:java:io:hadoop-format:compileTestJava' with cache key c77ad94b8131d52c5999d6219f7e3902
:sdks:java:io:hadoop-format:compileTestJava (Thread[included builds,5,main]) completed. Took 9.52 secs.
Resolve mutations for :sdks:java:io:hadoop-format:testClasses (Thread[Execution **** Thread 4,5,main]) started.
Resolve mutations for :sdks:java:io:hadoop-format:testClasses (Thread[Execution **** Thread 4,5,main]) completed. Took 0.0 secs.
:sdks:java:io:hadoop-format:testClasses (Thread[Execution **** Thread 5,5,main]) started.
> Task :sdks:java:io:hadoop-format:testClasses
Skipping task ':sdks:java:io:hadoop-format:testClasses' as it has no actions.
:sdks:java:io:hadoop-format:testClasses (Thread[Execution **** Thread 5,5,main]) completed. Took 0.0 secs.
Resolve mutations for :sdks:java:io:hadoop-format:integrationTest (Thread[included builds,5,main]) started.
Resolve mutations for :sdks:java:io:hadoop-format:integrationTest (Thread[included builds,5,main]) completed. Took 0.0 secs.
:sdks:java:io:hadoop-format:integrationTest (Thread[Execution **** Thread 3,5,main]) started.
producer locations for task group 0 (Thread[included builds,5,main]) started.
producer locations for task group 0 (Thread[included builds,5,main]) completed. Took 0.0 secs.
> Task :sdks:java:io:hadoop-format:integrationTest
Custom actions are attached to task ':sdks:java:io:hadoop-format:integrationTest'.
Build cache key for task ':sdks:java:io:hadoop-format:integrationTest' is 74c767879723819ba4dfc9ae63e959ee
Task ':sdks:java:io:hadoop-format:integrationTest' is not up-to-date because:
Task.upToDateWhen is false.
Starting process 'Gradle Test Executor 2'. Working directory: <https://ci-beam.apache.org/job/beam_PerformanceTests_HadoopFormat/ws/src/sdks/java/io/hadoop-format> Command: /usr/lib/jvm/java-8-openjdk-amd64/bin/java -DbeamTestPipelineOptions=["--tempRoot=gs://temp-storage-for-perf-tests","--project=apache-beam-testing","--runner=DataflowRunner","--numberOfRecords=600000","--bigQueryDataset=beam_performance","--bigQueryTable=hadoopformatioit_results","--influxMeasurement=hadoopformatioit_results","--influxDatabase=beam_test_metrics","--influxHost=http://10.128.0.96:8086","--postgresUsername=postgres","--postgresPassword=uuinkks","--postgresDatabaseName=postgres","--postgresServerName=34.69.36.105","--postgresSsl=false","--postgresPort=5432","--numWorkers=5","--autoscalingAlgorithm=NONE","--****HarnessContainerImage=","--dataflowWorkerJar=<https://ci-beam.apache.org/job/beam_PerformanceTests_HadoopFormat/ws/src/runners/google-cloud-dataflow-java/****/legacy-****/build/libs/beam-runners-google-cloud-dataflow-java-legacy-****-2.43.0-SNAPSHOT.jar","--region=us-central1"]> -Djava.security.manager=****.org.gradle.process.internal.****.child.BootstrapSecurityManager -Dorg.gradle.internal.****.tmpdir=<https://ci-beam.apache.org/job/beam_PerformanceTests_HadoopFormat/ws/src/sdks/java/io/hadoop-format/build/tmp/integrationTest/work> -Dorg.gradle.native=false -Xmx2g -Dfile.encoding=UTF-8 -Duser.country=US -Duser.language=en -Duser.variant -ea -cp /home/jenkins/.gradle/caches/7.5.1/****Main/gradle-****.jar ****.org.gradle.process.internal.****.GradleWorkerMain 'Gradle Test Executor 2'
Successfully started process 'Gradle Test Executor 2'
Gradle Test Executor 2 started executing tests.
> Task :sdks:java:io:hadoop-format:integrationTest
org.apache.beam.sdk.io.hadoop.format.HadoopFormatIOIT STANDARD_ERROR
SLF4J: Class path contains multiple SLF4J bindings.
SLF4J: Found binding in [jar:<https://ci-beam.apache.org/job/beam_PerformanceTests_HadoopFormat/ws/src/runners/google-cloud-dataflow-java/****/legacy-****/build/libs/beam-runners-google-cloud-dataflow-java-legacy-****-2.43.0-SNAPSHOT.jar!/org/slf4j/impl/StaticLoggerBinder.class]>
SLF4J: Found binding in [jar:file:/home/jenkins/.gradle/caches/modules-2/files-2.1/org.slf4j/slf4j-jdk14/1.7.30/d35953dd2fe54ebe39fdf18cfd82fe6eb35b25ed/slf4j-jdk14-1.7.30.jar!/org/slf4j/impl/StaticLoggerBinder.class]
SLF4J: Found binding in [jar:file:/home/jenkins/.gradle/caches/modules-2/files-2.1/org.slf4j/slf4j-reload4j/1.7.36/db708f7d959dee1857ac524636e85ecf2e1781c1/slf4j-reload4j-1.7.36.jar!/org/slf4j/impl/StaticLoggerBinder.class]
SLF4J: Found binding in [jar:file:/home/jenkins/.gradle/caches/modules-2/files-2.1/ch.qos.logback/logback-classic/1.1.3/d90276fff414f06cb375f2057f6778cd63c6082f/logback-classic-1.1.3.jar!/org/slf4j/impl/StaticLoggerBinder.class]
SLF4J: Found binding in [jar:file:/home/jenkins/.gradle/caches/modules-2/files-2.1/org.slf4j/slf4j-simple/1.7.30/e606eac955f55ecf1d8edcccba04eb8ac98088dd/slf4j-simple-1.7.30.jar!/org/slf4j/impl/StaticLoggerBinder.class]
SLF4J: Found binding in [jar:file:/home/jenkins/.gradle/caches/modules-2/files-2.1/org.slf4j/slf4j-log4j12/1.7.30/c21f55139d8141d2231214fb1feaf50a1edca95e/slf4j-log4j12-1.7.30.jar!/org/slf4j/impl/StaticLoggerBinder.class]
SLF4J: See http://www.slf4j.org/codes.html#multiple_bindings for an explanation.
SLF4J: Actual binding is of type [org.slf4j.impl.JDK14LoggerFactory]
Sep 27, 2022 8:19:59 AM org.apache.beam.sdk.io.common.IOITHelper executeWithRetry
WARNING: Attempt #1 of 3 failed: The connection attempt failed..
Sep 27, 2022 8:19:59 AM org.apache.beam.sdk.io.common.IOITHelper executeWithRetry
WARNING: Retrying in 2000 ms.
Sep 27, 2022 8:20:11 AM org.apache.beam.sdk.io.common.IOITHelper executeWithRetry
WARNING: Attempt #2 of 3 failed: The connection attempt failed..
Sep 27, 2022 8:20:11 AM org.apache.beam.sdk.io.common.IOITHelper executeWithRetry
WARNING: Retrying in 4000 ms.
Sep 27, 2022 8:20:25 AM org.apache.beam.sdk.io.common.IOITHelper executeWithRetry
WARNING: Attempt #3 of 3 failed: The connection attempt failed..
Sep 27, 2022 8:20:35 AM org.apache.beam.sdk.io.common.IOITHelper executeWithRetry
WARNING: Attempt #1 of 3 failed: The connection attempt failed..
Sep 27, 2022 8:20:35 AM org.apache.beam.sdk.io.common.IOITHelper executeWithRetry
WARNING: Retrying in 2000 ms.
Sep 27, 2022 8:20:47 AM org.apache.beam.sdk.io.common.IOITHelper executeWithRetry
WARNING: Attempt #2 of 3 failed: The connection attempt failed..
Sep 27, 2022 8:20:47 AM org.apache.beam.sdk.io.common.IOITHelper executeWithRetry
WARNING: Retrying in 4000 ms.
Sep 27, 2022 8:21:01 AM org.apache.beam.sdk.io.common.IOITHelper executeWithRetry
WARNING: Attempt #3 of 3 failed: The connection attempt failed..
Gradle Test Executor 2 finished executing tests.
> Task :sdks:java:io:hadoop-format:integrationTest FAILED
org.apache.beam.sdk.io.hadoop.format.HadoopFormatIOIT > classMethod FAILED
org.postgresql.util.PSQLException: The connection attempt failed.
at org.postgresql.core.v3.ConnectionFactoryImpl.openConnectionImpl(ConnectionFactoryImpl.java:315)
at org.postgresql.core.ConnectionFactory.openConnection(ConnectionFactory.java:51)
at org.postgresql.jdbc.PgConnection.<init>(PgConnection.java:225)
at org.postgresql.Driver.makeConnection(Driver.java:465)
at org.postgresql.Driver.connect(Driver.java:264)
at java.sql.DriverManager.getConnection(DriverManager.java:664)
at java.sql.DriverManager.getConnection(DriverManager.java:247)
at org.postgresql.ds.common.BaseDataSource.getConnection(BaseDataSource.java:103)
at org.postgresql.ds.common.BaseDataSource.getConnection(BaseDataSource.java:87)
at org.apache.beam.sdk.io.common.DatabaseTestHelper.createTable(DatabaseTestHelper.java:89)
at org.apache.beam.sdk.io.common.DatabaseTestHelper.createTable(DatabaseTestHelper.java:97)
at org.apache.beam.sdk.io.hadoop.format.HadoopFormatIOIT.createTable(HadoopFormatIOIT.java:148)
at org.apache.beam.sdk.io.common.IOITHelper.executeWithRetry(IOITHelper.java:86)
at org.apache.beam.sdk.io.common.IOITHelper.executeWithRetry(IOITHelper.java:66)
at org.apache.beam.sdk.io.hadoop.format.HadoopFormatIOIT.setUp(HadoopFormatIOIT.java:143)
Caused by:
java.net.SocketTimeoutException: connect timed out
at java.net.PlainSocketImpl.socketConnect(Native Method)
at java.net.AbstractPlainSocketImpl.doConnect(AbstractPlainSocketImpl.java:350)
at java.net.AbstractPlainSocketImpl.connectToAddress(AbstractPlainSocketImpl.java:206)
at java.net.AbstractPlainSocketImpl.connect(AbstractPlainSocketImpl.java:188)
at java.net.SocksSocketImpl.connect(SocksSocketImpl.java:392)
at java.net.Socket.connect(Socket.java:607)
at org.postgresql.core.PGStream.createSocket(PGStream.java:231)
at org.postgresql.core.PGStream.<init>(PGStream.java:95)
at org.postgresql.core.v3.ConnectionFactoryImpl.tryConnect(ConnectionFactoryImpl.java:98)
at org.postgresql.core.v3.ConnectionFactoryImpl.openConnectionImpl(ConnectionFactoryImpl.java:213)
... 14 more
org.apache.beam.sdk.io.hadoop.format.HadoopFormatIOIT > classMethod FAILED
org.postgresql.util.PSQLException: The connection attempt failed.
at org.postgresql.core.v3.ConnectionFactoryImpl.openConnectionImpl(ConnectionFactoryImpl.java:315)
at org.postgresql.core.ConnectionFactory.openConnection(ConnectionFactory.java:51)
at org.postgresql.jdbc.PgConnection.<init>(PgConnection.java:225)
at org.postgresql.Driver.makeConnection(Driver.java:465)
at org.postgresql.Driver.connect(Driver.java:264)
at java.sql.DriverManager.getConnection(DriverManager.java:664)
at java.sql.DriverManager.getConnection(DriverManager.java:247)
at org.postgresql.ds.common.BaseDataSource.getConnection(BaseDataSource.java:103)
at org.postgresql.ds.common.BaseDataSource.getConnection(BaseDataSource.java:87)
at org.apache.beam.sdk.io.common.DatabaseTestHelper.deleteTable(DatabaseTestHelper.java:105)
at org.apache.beam.sdk.io.hadoop.format.HadoopFormatIOIT.deleteTable(HadoopFormatIOIT.java:191)
at org.apache.beam.sdk.io.common.IOITHelper.executeWithRetry(IOITHelper.java:86)
at org.apache.beam.sdk.io.common.IOITHelper.executeWithRetry(IOITHelper.java:66)
at org.apache.beam.sdk.io.hadoop.format.HadoopFormatIOIT.tearDown(HadoopFormatIOIT.java:184)
Caused by:
java.net.SocketTimeoutException: connect timed out
at java.net.PlainSocketImpl.socketConnect(Native Method)
at java.net.AbstractPlainSocketImpl.doConnect(AbstractPlainSocketImpl.java:350)
at java.net.AbstractPlainSocketImpl.connectToAddress(AbstractPlainSocketImpl.java:206)
at java.net.AbstractPlainSocketImpl.connect(AbstractPlainSocketImpl.java:188)
at java.net.SocksSocketImpl.connect(SocksSocketImpl.java:392)
at java.net.Socket.connect(Socket.java:607)
at org.postgresql.core.PGStream.createSocket(PGStream.java:231)
at org.postgresql.core.PGStream.<init>(PGStream.java:95)
at org.postgresql.core.v3.ConnectionFactoryImpl.tryConnect(ConnectionFactoryImpl.java:98)
at org.postgresql.core.v3.ConnectionFactoryImpl.openConnectionImpl(ConnectionFactoryImpl.java:213)
... 13 more
2 tests completed, 2 failed
Finished generating test XML results (0.019 secs) into: <https://ci-beam.apache.org/job/beam_PerformanceTests_HadoopFormat/ws/src/sdks/java/io/hadoop-format/build/test-results/integrationTest>
Generating HTML test report...
Finished generating test html results (0.024 secs) into: <https://ci-beam.apache.org/job/beam_PerformanceTests_HadoopFormat/ws/src/sdks/java/io/hadoop-format/build/reports/tests/integrationTest>
:sdks:java:io:hadoop-format:integrationTest (Thread[Execution **** Thread 3,5,main]) completed. Took 1 mins 17.142 secs.
FAILURE: Build failed with an exception.
* What went wrong:
Execution failed for task ':sdks:java:io:hadoop-format:integrationTest'.
> There were failing tests. See the report at: file://<https://ci-beam.apache.org/job/beam_PerformanceTests_HadoopFormat/ws/src/sdks/java/io/hadoop-format/build/reports/tests/integrationTest/index.html>
* Try:
> Run with --stacktrace option to get the stack trace.
> Run with --debug option to get more log output.
* Get more help at https://help.gradle.org
Deprecated Gradle features were used in this build, making it incompatible with Gradle 8.0.
You can use '--warning-mode all' to show the individual deprecation warnings and determine if they come from your own scripts or plugins.
See https://docs.gradle.org/7.5.1/userguide/command_line_interface.html#sec:command_line_warnings
BUILD FAILED in 1m 56s
156 actionable tasks: 94 executed, 60 from cache, 2 up-to-date
Publishing build scan...
https://gradle.com/s/e7x7se47jqc4u
Stopped 1 **** daemon(s).
Build step 'Invoke Gradle script' changed build result to FAILURE
Build step 'Invoke Gradle script' marked build as failure
---------------------------------------------------------------------
To unsubscribe, e-mail: builds-unsubscribe@beam.apache.org
For additional commands, e-mail: builds-help@beam.apache.org
Jenkins build is back to normal : beam_PerformanceTests_HadoopFormat #4990
Posted by Apache Jenkins Server <je...@builds.apache.org>.
See <https://ci-beam.apache.org/job/beam_PerformanceTests_HadoopFormat/4990/display/redirect?page=changes>
---------------------------------------------------------------------
To unsubscribe, e-mail: builds-unsubscribe@beam.apache.org
For additional commands, e-mail: builds-help@beam.apache.org