You are viewing a plain text version of this content. The canonical link for it is here.
Posted to builds@beam.apache.org by Apache Jenkins Server <je...@builds.apache.org> on 2019/04/25 17:43:40 UTC

Build failed in Jenkins: beam_PostCommit_Python3_Verify #657

See <https://builds.apache.org/job/beam_PostCommit_Python3_Verify/657/display/redirect?page=changes>

Changes:

[amaliujia] [BEAM-7070] JOIN condition should accept field access

[amaliujia] [sql] ignore Nexmark SQL queries that has non equal join.

[amaliujia] [sql] generalize RexInputRef and RexFieldAccess in JOIN.

------------------------------------------
[...truncated 177.06 KB...]
  'Python 3 support for the Apache Beam SDK is not yet fully supported. '
<https://builds.apache.org/job/beam_PostCommit_Python3_Verify/ws/src/build/gradleenv/83406599/lib/python3.5/site-packages/setuptools/dist.py>:472: UserWarning: Normalizing '2.13.0.dev' to '2.13.0.dev0'
  normalized_version,
warning: no files found matching 'README.md'
warning: no files found matching 'NOTICE'
warning: no files found matching 'LICENSE'
writing manifest file 'apache_beam.egg-info/SOURCES.txt'
<https://builds.apache.org/job/beam_PostCommit_Python3_Verify/ws/src/sdks/python/apache_beam/__init__.py>:84: UserWarning: Running the Apache Beam SDK on Python 3 is not yet fully supported. You may encounter buggy behavior or missing features.
  'Running the Apache Beam SDK on Python 3 is not yet fully supported. '
<https://builds.apache.org/job/beam_PostCommit_Python3_Verify/ws/src/sdks/python/apache_beam/io/gcp/datastore/v1/datastoreio.py>:50: UserWarning: Datastore IO will support Python 3 after replacing googledatastore by google-cloud-datastore, see: BEAM-4543.
  warnings.warn('Datastore IO will support Python 3 after replacing '
<https://builds.apache.org/job/beam_PostCommit_Python3_Verify/ws/src/sdks/python/apache_beam/io/vcfio.py>:47: UserWarning: VCF IO will support Python 3 after migration to Nucleus, see: BEAM-5628.
  warnings.warn("VCF IO will support Python 3 after migration to Nucleus, "
<https://builds.apache.org/job/beam_PostCommit_Python3_Verify/ws/src/sdks/python/apache_beam/io/gcp/bigquery.py>:983: BeamDeprecationWarning: options is deprecated since First stable release. References to <pipeline>.options will not be supported
Found: https://console.cloud.google.com/dataflow/jobsDetail/locations/us-central1/jobs/2019-04-25_09_50_29-15719279595486717256?project=apache-beam-testing.
Found: https://console.cloud.google.com/dataflow/jobsDetail/locations/us-central1/jobs/2019-04-25_10_06_27-8067995285411236946?project=apache-beam-testing.
  method_to_use = self._compute_method(p, p.options)
Found: https://console.cloud.google.com/dataflow/jobsDetail/locations/us-central1/jobs/2019-04-25_10_14_34-1730420432694003919?project=apache-beam-testing.
Found: https://console.cloud.google.com/dataflow/jobsDetail/locations/us-central1/jobs/2019-04-25_09_50_26-1833513485354431498?project=apache-beam-testing.
Found: https://console.cloud.google.com/dataflow/jobsDetail/locations/us-central1/jobs/2019-04-25_10_10_42-9536253085178259978?project=apache-beam-testing.
<https://builds.apache.org/job/beam_PostCommit_Python3_Verify/ws/src/sdks/python/apache_beam/runners/dataflow/dataflow_runner.py>:605: BeamDeprecationWarning: BigQuerySink is deprecated since 2.11.0. Use WriteToBigQuery instead.
  kms_key=transform.kms_key))
Found: https://console.cloud.google.com/dataflow/jobsDetail/locations/us-central1/jobs/2019-04-25_09_50_29-10082826785191461219?project=apache-beam-testing.
<https://builds.apache.org/job/beam_PostCommit_Python3_Verify/ws/src/sdks/python/apache_beam/io/gcp/bigquery.py>:983: BeamDeprecationWarning: options is deprecated since First stable release. References to <pipeline>.options will not be supported
  method_to_use = self._compute_method(p, p.options)
Found: https://console.cloud.google.com/dataflow/jobsDetail/locations/us-central1/jobs/2019-04-25_10_04_08-15130002281663809072?project=apache-beam-testing.
Found: https://console.cloud.google.com/dataflow/jobsDetail/locations/us-central1/jobs/2019-04-25_10_11_52-5534976352137627582?project=apache-beam-testing.
<https://builds.apache.org/job/beam_PostCommit_Python3_Verify/ws/src/sdks/python/apache_beam/io/gcp/bigquery_file_loads.py>:529: BeamDeprecationWarning: options is deprecated since First stable release. References to <pipeline>.options will not be supported
  or p.options.view_as(GoogleCloudOptions).temp_location)
Found: https://console.cloud.google.com/dataflow/jobsDetail/locations/us-central1/jobs/2019-04-25_09_50_26-14495784064233348034?project=apache-beam-testing.
Found: https://console.cloud.google.com/dataflow/jobsDetail/locations/us-central1/jobs/2019-04-25_10_10_06-17510709022189541776?project=apache-beam-testing.
Found: https://console.cloud.google.com/dataflow/jobsDetail/locations/us-central1/jobs/2019-04-25_10_17_41-2293478865348232489?project=apache-beam-testing.
Found: https://console.cloud.google.com/dataflow/jobsDetail/locations/us-central1/jobs/2019-04-25_09_50_27-1923347354965277440?project=apache-beam-testing.
<https://builds.apache.org/job/beam_PostCommit_Python3_Verify/ws/src/sdks/python/apache_beam/io/fileio_test.py>:215: FutureWarning: MatchAll is experimental.
  | 'GetPath' >> beam.Map(lambda metadata: metadata.path))
Found: https://console.cloud.google.com/dataflow/jobsDetail/locations/us-central1/jobs/2019-04-25_09_59_21-7517129350990545225?project=apache-beam-testing.
<https://builds.apache.org/job/beam_PostCommit_Python3_Verify/ws/src/sdks/python/apache_beam/io/fileio_test.py>:226: FutureWarning: MatchAll is experimental.
  | 'Checksums' >> beam.Map(compute_hash))
Found: https://console.cloud.google.com/dataflow/jobsDetail/locations/us-central1/jobs/2019-04-25_10_07_35-4771714614102006113?project=apache-beam-testing.
<https://builds.apache.org/job/beam_PostCommit_Python3_Verify/ws/src/sdks/python/apache_beam/io/fileio_test.py>:226: FutureWarning: ReadMatches is experimental.
  | 'Checksums' >> beam.Map(compute_hash))
Found: https://console.cloud.google.com/dataflow/jobsDetail/locations/us-central1/jobs/2019-04-25_09_50_25-7267821065005084125?project=apache-beam-testing.
Found: https://console.cloud.google.com/dataflow/jobsDetail/locations/us-central1/jobs/2019-04-25_09_59_26-8328673777830434101?project=apache-beam-testing.
Found: https://console.cloud.google.com/dataflow/jobsDetail/locations/us-central1/jobs/2019-04-25_10_07_51-3675323424932861424?project=apache-beam-testing.
Found: https://console.cloud.google.com/dataflow/jobsDetail/locations/us-central1/jobs/2019-04-25_10_16_32-1660338131392037914?project=apache-beam-testing.
<https://builds.apache.org/job/beam_PostCommit_Python3_Verify/ws/src/sdks/python/apache_beam/runners/dataflow/dataflow_runner.py>:605: BeamDeprecationWarning: BigQuerySink is deprecated since 2.11.0. Use WriteToBigQuery instead.
  kms_key=transform.kms_key))
<https://builds.apache.org/job/beam_PostCommit_Python3_Verify/ws/src/sdks/python/apache_beam/io/gcp/big_query_query_to_table_pipeline.py>:73: BeamDeprecationWarning: BigQuerySink is deprecated since 2.11.0. Use WriteToBigQuery instead.
  kms_key=kms_key))
Found: https://console.cloud.google.com/dataflow/jobsDetail/locations/us-central1/jobs/2019-04-25_09_50_30-11489911038740621855?project=apache-beam-testing.
Found: https://console.cloud.google.com/dataflow/jobsDetail/locations/us-central1/jobs/2019-04-25_09_59_57-15442774655960349951?project=apache-beam-testing.
Found: https://console.cloud.google.com/dataflow/jobsDetail/locations/us-central1/jobs/2019-04-25_10_09_53-11524540145089416001?project=apache-beam-testing.
<https://builds.apache.org/job/beam_PostCommit_Python3_Verify/ws/src/sdks/python/apache_beam/io/gcp/bigquery.py>:983: BeamDeprecationWarning: options is deprecated since First stable release. References to <pipeline>.options will not be supported
  method_to_use = self._compute_method(p, p.options)
<https://builds.apache.org/job/beam_PostCommit_Python3_Verify/ws/src/sdks/python/apache_beam/io/gcp/bigquery_file_loads.py>:529: BeamDeprecationWarning: options is deprecated since First stable release. References to <pipeline>.options will not be supported
  or p.options.view_as(GoogleCloudOptions).temp_location)
Found: https://console.cloud.google.com/dataflow/jobsDetail/locations/us-central1/jobs/2019-04-25_09_50_26-401838585977634985?project=apache-beam-testing.
Found: https://console.cloud.google.com/dataflow/jobsDetail/locations/us-central1/jobs/2019-04-25_10_00_17-11414206050092053845?project=apache-beam-testing.
Found: https://console.cloud.google.com/dataflow/jobsDetail/locations/us-central1/jobs/2019-04-25_10_08_16-10294341238209238765?project=apache-beam-testing.
test_datastore_wordcount_it (apache_beam.examples.cookbook.datastore_wordcount_it_test.DatastoreWordCountIT) ... SKIP: This test still needs to be fixed on Python 3TODO: BEAM-4543
test_avro_it (apache_beam.examples.fastavro_it_test.FastavroIT) ... SKIP: This test still needs to be fixed on Python 3TODO: BEAM-6522
test_autocomplete_it (apache_beam.examples.complete.autocomplete_test.AutocompleteTest) ... ok
test_bigquery_tornadoes_it (apache_beam.examples.cookbook.bigquery_tornadoes_it_test.BigqueryTornadoesIT) ... ok
test_streaming_wordcount_it (apache_beam.examples.streaming_wordcount_it_test.StreamingWordCountIT) ... ok
test_wordcount_fnapi_it (apache_beam.examples.wordcount_it_test.WordCountIT) ... ok
test_leader_board_it (apache_beam.examples.complete.game.leader_board_it_test.LeaderBoardIT) ... ok
test_game_stats_it (apache_beam.examples.complete.game.game_stats_it_test.GameStatsIT) ... ok
test_datastore_write_limit (apache_beam.io.gcp.datastore_write_it_test.DatastoreWriteIT) ... SKIP: This test still needs to be fixed on Python 3TODO: BEAM-4543
test_copy (apache_beam.io.gcp.gcsio_integration_test.GcsIOIntegrationTest) ... ok
test_copy_batch (apache_beam.io.gcp.gcsio_integration_test.GcsIOIntegrationTest) ... ok
test_copy_batch_kms (apache_beam.io.gcp.gcsio_integration_test.GcsIOIntegrationTest) ... ok
test_copy_batch_rewrite_token (apache_beam.io.gcp.gcsio_integration_test.GcsIOIntegrationTest) ... ok
test_copy_kms (apache_beam.io.gcp.gcsio_integration_test.GcsIOIntegrationTest) ... ok
test_copy_rewrite_token (apache_beam.io.gcp.gcsio_integration_test.GcsIOIntegrationTest) ... ok
test_wordcount_it (apache_beam.examples.wordcount_it_test.WordCountIT) ... ok
test_bigquery_read_1M_python (apache_beam.io.gcp.bigquery_io_read_it_test.BigqueryIOReadIT) ... ok
test_user_score_it (apache_beam.examples.complete.game.user_score_it_test.UserScoreIT) ... ok
test_hourly_team_score_it (apache_beam.examples.complete.game.hourly_team_score_it_test.HourlyTeamScoreIT) ... ok
test_transform_on_gcs (apache_beam.io.fileio_test.MatchIntegrationTest) ... ok
test_parquetio_it (apache_beam.io.parquetio_it_test.TestParquetIT) ... ok
test_job_python_from_python_it (apache_beam.transforms.external_test_it.ExternalTransformIT) ... ok
test_multiple_destinations_transform (apache_beam.io.gcp.bigquery_file_loads_test.BigQueryFileLoadsIT) ... ok
test_one_job_fails_all_jobs_fail (apache_beam.io.gcp.bigquery_file_loads_test.BigQueryFileLoadsIT) ... ok
test_multiple_destinations_transform (apache_beam.io.gcp.bigquery_test.BigQueryStreamingInsertTransformIntegrationTests) ... ok
test_value_provider_transform (apache_beam.io.gcp.bigquery_test.BigQueryStreamingInsertTransformIntegrationTests) ... ok
test_streaming_data_only (apache_beam.io.gcp.pubsub_integration_test.PubSubIntegrationTest) ... ok
test_streaming_with_attributes (apache_beam.io.gcp.pubsub_integration_test.PubSubIntegrationTest) ... ok
test_big_query_legacy_sql (apache_beam.io.gcp.big_query_query_to_table_it_test.BigQueryQueryToTableIT) ... ok
test_big_query_new_types (apache_beam.io.gcp.big_query_query_to_table_it_test.BigQueryQueryToTableIT) ... SKIP: This test still needs to be fixed on Python 3TODO: BEAM-6769
test_big_query_standard_sql (apache_beam.io.gcp.big_query_query_to_table_it_test.BigQueryQueryToTableIT) ... ok
test_big_query_standard_sql_kms_key_native (apache_beam.io.gcp.big_query_query_to_table_it_test.BigQueryQueryToTableIT) ... ok
test_metrics_fnapi_it (apache_beam.runners.dataflow.dataflow_exercise_metrics_pipeline_test.ExerciseMetricsPipelineTest) ... ok
test_metrics_it (apache_beam.runners.dataflow.dataflow_exercise_metrics_pipeline_test.ExerciseMetricsPipelineTest) ... ok

----------------------------------------------------------------------
XML: <https://builds.apache.org/job/beam_PostCommit_Python3_Verify/ws/src/sdks/python/nosetests.xml>
----------------------------------------------------------------------
Ran 34 tests in 2158.856s

OK (SKIP=4)

> Task :beam-sdks-python-test-suites-dataflow-py3:validatesRunnerBatchTests
>>> RUNNING integration tests with pipeline options: --runner=TestDataflowRunner --project=apache-beam-testing --staging_location=gs://temp-storage-for-end-to-end-tests/staging-it --temp_location=gs://temp-storage-for-end-to-end-tests/temp-it --output=gs://temp-storage-for-end-to-end-tests/py-it-cloud/output --sdk_location=<https://builds.apache.org/job/beam_PostCommit_Python3_Verify/ws/src/sdks/python/test-suites/dataflow/py3/build/apache-beam.tar.gz> --requirements_file=postcommit_requirements.txt --num_workers=1 --sleep_secs=20 --dataflow_worker_jar=<https://builds.apache.org/job/beam_PostCommit_Python3_Verify/ws/src/runners/google-cloud-dataflow-java/worker/build/libs/beam-runners-google-cloud-dataflow-java-fn-api-worker-2.13.0-SNAPSHOT.jar> --kms_key_name=projects/apache-beam-testing/locations/global/keyRings/beam-it/cryptoKeys/test --dataflow_kms_key=projects/apache-beam-testing/locations/global/keyRings/beam-it/cryptoKeys/test
>>>   test options: --nocapture --processes=8 --process-timeout=4500 --attr=ValidatesRunner
running nosetests
running egg_info
writing entry points to apache_beam.egg-info/entry_points.txt
writing top-level names to apache_beam.egg-info/top_level.txt
writing apache_beam.egg-info/PKG-INFO
writing dependency_links to apache_beam.egg-info/dependency_links.txt
writing requirements to apache_beam.egg-info/requires.txt
reading manifest file 'apache_beam.egg-info/SOURCES.txt'
reading manifest template 'MANIFEST.in'
setup.py:174: UserWarning: Python 3 support for the Apache Beam SDK is not yet fully supported. You may encounter buggy behavior or missing features.
  'Python 3 support for the Apache Beam SDK is not yet fully supported. '
<https://builds.apache.org/job/beam_PostCommit_Python3_Verify/ws/src/build/gradleenv/83406599/lib/python3.5/site-packages/setuptools/dist.py>:472: UserWarning: Normalizing '2.13.0.dev' to '2.13.0.dev0'
  normalized_version,
warning: no files found matching 'README.md'
warning: no files found matching 'NOTICE'
warning: no files found matching 'LICENSE'
writing manifest file 'apache_beam.egg-info/SOURCES.txt'
<https://builds.apache.org/job/beam_PostCommit_Python3_Verify/ws/src/sdks/python/apache_beam/__init__.py>:84: UserWarning: Running the Apache Beam SDK on Python 3 is not yet fully supported. You may encounter buggy behavior or missing features.
  'Running the Apache Beam SDK on Python 3 is not yet fully supported. '
<https://builds.apache.org/job/beam_PostCommit_Python3_Verify/ws/src/sdks/python/apache_beam/io/gcp/datastore/v1/datastoreio.py>:50: UserWarning: Datastore IO will support Python 3 after replacing googledatastore by google-cloud-datastore, see: BEAM-4543.
  warnings.warn('Datastore IO will support Python 3 after replacing '
<https://builds.apache.org/job/beam_PostCommit_Python3_Verify/ws/src/sdks/python/apache_beam/io/vcfio.py>:47: UserWarning: VCF IO will support Python 3 after migration to Nucleus, see: BEAM-5628.
  warnings.warn("VCF IO will support Python 3 after migration to Nucleus, "
Found: https://console.cloud.google.com/dataflow/jobsDetail/locations/us-central1/jobs/2019-04-25_10_26_28-13628067158161982610?project=apache-beam-testing.
Found: https://console.cloud.google.com/dataflow/jobsDetail/locations/us-central1/jobs/2019-04-25_10_35_09-74156008038078072?project=apache-beam-testing.
Found: https://console.cloud.google.com/dataflow/jobsDetail/locations/us-central1/jobs/2019-04-25_10_26_33-5615312957780168304?project=apache-beam-testing.
Found: https://console.cloud.google.com/dataflow/jobsDetail/locations/us-central1/jobs/2019-04-25_10_26_30-10112244049118338659?project=apache-beam-testing.
Found: https://console.cloud.google.com/dataflow/jobsDetail/locations/us-central1/jobs/2019-04-25_10_35_40-6211105587309478444?project=apache-beam-testing.
Found: https://console.cloud.google.com/dataflow/jobsDetail/locations/us-central1/jobs/2019-04-25_10_26_30-4793285617151932635?project=apache-beam-testing.
Found: https://console.cloud.google.com/dataflow/jobsDetail/locations/us-central1/jobs/2019-04-25_10_35_30-5967572129979506178?project=apache-beam-testing.
Found: https://console.cloud.google.com/dataflow/jobsDetail/locations/us-central1/jobs/2019-04-25_10_26_29-11069756260105665508?project=apache-beam-testing.
Found: https://console.cloud.google.com/dataflow/jobsDetail/locations/us-central1/jobs/2019-04-25_10_33_58-1998801805985121555?project=apache-beam-testing.
Found: https://console.cloud.google.com/dataflow/jobsDetail/locations/us-central1/jobs/2019-04-25_10_26_30-1878831711761528761?project=apache-beam-testing.
Found: https://console.cloud.google.com/dataflow/jobsDetail/locations/us-central1/jobs/2019-04-25_10_35_01-13686944416826177543?project=apache-beam-testing.
Found: https://console.cloud.google.com/dataflow/jobsDetail/locations/us-central1/jobs/2019-04-25_10_26_32-1287118259760627918?project=apache-beam-testing.
Found: https://console.cloud.google.com/dataflow/jobsDetail/locations/us-central1/jobs/2019-04-25_10_35_36-15111558230476408293?project=apache-beam-testing.
Found: https://console.cloud.google.com/dataflow/jobsDetail/locations/us-central1/jobs/2019-04-25_10_26_32-10397617301238542611?project=apache-beam-testing.
Found: https://console.cloud.google.com/dataflow/jobsDetail/locations/us-central1/jobs/2019-04-25_10_35_26-10174910219191791806?project=apache-beam-testing.
test_as_list_and_as_dict_side_inputs (apache_beam.transforms.sideinputs_test.SideInputsTest) ... ERROR
test_read_metrics (apache_beam.transforms.ptransform_test.PTransformTest) ... ok
test_undeclared_outputs (apache_beam.transforms.ptransform_test.PTransformTest) ... ok
test_flatten_multiple_pcollections_having_multiple_consumers (apache_beam.transforms.ptransform_test.PTransformTest) ... ok
test_as_list_twice (apache_beam.transforms.sideinputs_test.SideInputsTest) ... ok
test_par_do_with_multiple_outputs_and_using_yield (apache_beam.transforms.ptransform_test.PTransformTest) ... ok
test_as_dict_twice (apache_beam.transforms.sideinputs_test.SideInputsTest) ... ok
test_par_do_with_multiple_outputs_and_using_return (apache_beam.transforms.ptransform_test.PTransformTest) ... ok
test_multiple_empty_outputs (apache_beam.transforms.ptransform_test.PTransformTest) ... ok
test_as_singleton_with_different_defaults (apache_beam.transforms.sideinputs_test.SideInputsTest) ... ok
test_default_value_singleton_side_input (apache_beam.transforms.sideinputs_test.SideInputsTest) ... ok
test_as_singleton_without_unique_labels (apache_beam.transforms.sideinputs_test.SideInputsTest) ... ok
test_empty_singleton_side_input (apache_beam.transforms.sideinputs_test.SideInputsTest) ... ok
test_flattened_side_input (apache_beam.transforms.sideinputs_test.SideInputsTest) ... ok
test_iterable_side_input (apache_beam.transforms.sideinputs_test.SideInputsTest) ... ok
test_multi_valued_singleton_side_input (apache_beam.transforms.sideinputs_test.SideInputsTest) ... ok

======================================================================
ERROR: test_as_list_and_as_dict_side_inputs (apache_beam.transforms.sideinputs_test.SideInputsTest)
----------------------------------------------------------------------
Traceback (most recent call last):
  File "<https://builds.apache.org/job/beam_PostCommit_Python3_Verify/ws/src/sdks/python/apache_beam/transforms/sideinputs_test.py",> line 205, in test_as_list_and_as_dict_side_inputs
    pipeline.run()
  File "<https://builds.apache.org/job/beam_PostCommit_Python3_Verify/ws/src/sdks/python/apache_beam/testing/test_pipeline.py",> line 107, in run
    else test_runner_api))
  File "<https://builds.apache.org/job/beam_PostCommit_Python3_Verify/ws/src/sdks/python/apache_beam/pipeline.py",> line 406, in run
    self._options).run(False)
  File "<https://builds.apache.org/job/beam_PostCommit_Python3_Verify/ws/src/sdks/python/apache_beam/pipeline.py",> line 419, in run
    return self.runner.run_pipeline(self, self._options)
  File "<https://builds.apache.org/job/beam_PostCommit_Python3_Verify/ws/src/sdks/python/apache_beam/runners/dataflow/test_dataflow_runner.py",> line 53, in run_pipeline
    pipeline, options)
  File "<https://builds.apache.org/job/beam_PostCommit_Python3_Verify/ws/src/sdks/python/apache_beam/runners/dataflow/dataflow_runner.py",> line 413, in run_pipeline
    self.dataflow_client.create_job(self.job), self)
  File "<https://builds.apache.org/job/beam_PostCommit_Python3_Verify/ws/src/sdks/python/apache_beam/utils/retry.py",> line 195, in wrapper
    return fun(*args, **kwargs)
  File "<https://builds.apache.org/job/beam_PostCommit_Python3_Verify/ws/src/sdks/python/apache_beam/runners/dataflow/internal/apiclient.py",> line 519, in create_job
    self.create_job_description(job)
  File "<https://builds.apache.org/job/beam_PostCommit_Python3_Verify/ws/src/sdks/python/apache_beam/runners/dataflow/internal/apiclient.py",> line 549, in create_job_description
    resources = self._stage_resources(job.options)
  File "<https://builds.apache.org/job/beam_PostCommit_Python3_Verify/ws/src/sdks/python/apache_beam/runners/dataflow/internal/apiclient.py",> line 479, in _stage_resources
    staging_location=google_cloud_options.staging_location)
  File "<https://builds.apache.org/job/beam_PostCommit_Python3_Verify/ws/src/sdks/python/apache_beam/runners/portability/stager.py",> line 167, in stage_job_resources
    requirements_cache_path)
  File "<https://builds.apache.org/job/beam_PostCommit_Python3_Verify/ws/src/sdks/python/apache_beam/utils/retry.py",> line 195, in wrapper
    return fun(*args, **kwargs)
  File "<https://builds.apache.org/job/beam_PostCommit_Python3_Verify/ws/src/sdks/python/apache_beam/runners/portability/stager.py",> line 427, in _populate_requirements_cache
    processes.check_output(cmd_args, stderr=processes.STDOUT)
  File "<https://builds.apache.org/job/beam_PostCommit_Python3_Verify/ws/src/sdks/python/apache_beam/utils/processes.py",> line 91, in check_output
    .format(traceback.format_exc(), args[0][6], error.output))
RuntimeError: Full traceback: Traceback (most recent call last):
  File "<https://builds.apache.org/job/beam_PostCommit_Python3_Verify/ws/src/sdks/python/apache_beam/utils/processes.py",> line 83, in check_output
    out = subprocess.check_output(*args, **kwargs)
  File "/usr/lib/python3.5/subprocess.py", line 626, in check_output
    **kwargs).stdout
  File "/usr/lib/python3.5/subprocess.py", line 708, in run
    output=stdout, stderr=stderr)
subprocess.CalledProcessError: Command '['<https://builds.apache.org/job/beam_PostCommit_Python3_Verify/ws/src/build/gradleenv/83406599/bin/python',> '-m', 'pip', 'download', '--dest', '/tmp/dataflow-requirements-cache', '-r', 'postcommit_requirements.txt', '--exists-action', 'i', '--no-binary', ':all:']' returned non-zero exit status 1
 
 Pip install failed for package: -r         
 Output from execution of subprocess: b'Collecting pyhamcrest (from -r postcommit_requirements.txt (line 1))\n  File was already downloaded /tmp/dataflow-requirements-cache/PyHamcrest-1.9.0.tar.gz\nCollecting mock (from -r postcommit_requirements.txt (line 2))\n  File was already downloaded /tmp/dataflow-requirements-cache/mock-2.0.0.tar.gz\nCollecting setuptools (from pyhamcrest->-r postcommit_requirements.txt (line 1))\n  ERROR: Could not find a version that satisfies the requirement setuptools (from pyhamcrest->-r postcommit_requirements.txt (line 1)) (from versions: none)\nERROR: No matching distribution found for setuptools (from pyhamcrest->-r postcommit_requirements.txt (line 1))\n'
-------------------- >> begin captured logging << --------------------
root: WARNING: Typical end users should not use this worker jar feature. It can only be used when FnAPI is enabled.
root: DEBUG: Connecting using Google Application Default Credentials.
root: INFO: Starting GCS upload to gs://temp-storage-for-end-to-end-tests/staging-it/beamapp-jenkins-0425172552-451944.1556213152.452215/pipeline.pb...
oauth2client.transport: INFO: Attempting refresh to obtain initial access_token
oauth2client.transport: INFO: Attempting refresh to obtain initial access_token
root: INFO: Completed GCS upload to gs://temp-storage-for-end-to-end-tests/staging-it/beamapp-jenkins-0425172552-451944.1556213152.452215/pipeline.pb in 0 seconds.
root: INFO: Starting GCS upload to gs://temp-storage-for-end-to-end-tests/staging-it/beamapp-jenkins-0425172552-451944.1556213152.452215/requirements.txt...
root: INFO: Completed GCS upload to gs://temp-storage-for-end-to-end-tests/staging-it/beamapp-jenkins-0425172552-451944.1556213152.452215/requirements.txt in 0 seconds.
root: INFO: Executing command: ['<https://builds.apache.org/job/beam_PostCommit_Python3_Verify/ws/src/build/gradleenv/83406599/bin/python',> '-m', 'pip', 'download', '--dest', '/tmp/dataflow-requirements-cache', '-r', 'postcommit_requirements.txt', '--exists-action', 'i', '--no-binary', ':all:']
--------------------- >> end captured logging << ---------------------

----------------------------------------------------------------------
XML: <https://builds.apache.org/job/beam_PostCommit_Python3_Verify/ws/src/sdks/python/nosetests.xml>
----------------------------------------------------------------------
Ran 16 tests in 1062.568s

FAILED (errors=1)

> Task :beam-sdks-python-test-suites-dataflow-py3:validatesRunnerBatchTests FAILED

FAILURE: Build failed with an exception.

* Where:
Build file '<https://builds.apache.org/job/beam_PostCommit_Python3_Verify/ws/src/sdks/python/test-suites/dataflow/py3/build.gradle'> line: 67

* What went wrong:
Execution failed for task ':beam-sdks-python-test-suites-dataflow-py3:validatesRunnerBatchTests'.
> Process 'command 'sh'' finished with non-zero exit value 1

* Try:
Run with --stacktrace option to get the stack trace. Run with --info or --debug option to get more log output. Run with --scan to get full insights.

* Get more help at https://help.gradle.org

Deprecated Gradle features were used in this build, making it incompatible with Gradle 6.0.
Use '--warning-mode all' to show the individual deprecation warnings.
See https://docs.gradle.org/5.2.1/userguide/command_line_interface.html#sec:command_line_warnings

BUILD FAILED in 55m 9s
64 actionable tasks: 47 executed, 17 from cache

Publishing build scan...
https://gradle.com/s/xfxj3vvzqgowo

Build step 'Invoke Gradle script' changed build result to FAILURE
Build step 'Invoke Gradle script' marked build as failure

---------------------------------------------------------------------
To unsubscribe, e-mail: builds-unsubscribe@beam.apache.org
For additional commands, e-mail: builds-help@beam.apache.org


Jenkins build is back to normal : beam_PostCommit_Python3_Verify #658

Posted by Apache Jenkins Server <je...@builds.apache.org>.
See <https://builds.apache.org/job/beam_PostCommit_Python3_Verify/658/display/redirect>


---------------------------------------------------------------------
To unsubscribe, e-mail: builds-unsubscribe@beam.apache.org
For additional commands, e-mail: builds-help@beam.apache.org