You are viewing a plain text version of this content. The canonical link for it is here.
Posted to yarn-dev@hadoop.apache.org by Apache Jenkins Server <je...@builds.apache.org> on 2015/05/14 01:40:36 UTC
Failed: YARN-3411 PreCommit Build #7927
Jira: https://issues.apache.org/jira/browse/YARN-3411
Build: https://builds.apache.org/job/PreCommit-YARN-Build/7927/
###################################################################################
########################## LAST 60 LINES OF THE CONSOLE ###########################
[...truncated 59 lines...]
/usr/bin/patch: **** malformed patch at line 1294:
The patch does not appear to apply with p0 to p2
PATCH APPLICATION FAILED
Elapsed time: 0m 0s
-1 overall
| Vote | Subsystem | Runtime | Comment
============================================================================
| 0 | patch | 0m 1s | The patch file was not named according to
| | | | hadoop's naming conventions. Please see
| | | | https://wiki.apache.org/hadoop/HowToContribu
| | | | te for instructions.
| -1 | patch | 0m 0s | The patch command could not apply the
| | | | patch during dryrun.
|| Subsystem || Report/Notes ||
============================================================================
| Patch URL | http://issues.apache.org/jira/secure/attachment/12732709/YARN-3411.poc.7.txt |
| Optional Tests | javadoc javac unit findbugs checkstyle |
| git revision | trunk / 281d47a |
============================================================================
============================================================================
Adding comment to JIRA
============================================================================
============================================================================
Comment added.
778d124ca353443af9cbc83dd500e9bfc3d49d13 logged out
============================================================================
============================================================================
Finished build.
============================================================================
============================================================================
Build step 'Execute shell' marked build as failure
Archiving artifacts
Sending artifact delta relative to PreCommit-YARN-Build #7922
Archived 3 artifacts
Archive block size is 32768
Received 0 blocks and 360202 bytes
Compression is 0.0%
Took 2.4 sec
[description-setter] Could not determine description.
Recording test results
Email was triggered for: Failure
Sending email for trigger: Failure
###################################################################################
############################## FAILED TESTS (if any) ##############################
No tests ran.
Failed: YARN-3583 PreCommit Build #7936
Posted by Apache Jenkins Server <je...@builds.apache.org>.
Jira: https://issues.apache.org/jira/browse/YARN-3583
Build: https://builds.apache.org/job/PreCommit-YARN-Build/7936/
###################################################################################
########################## LAST 60 LINES OF THE CONSOLE ###########################
[...truncated 367 lines...]
| +1 | findbugs | 5m 26s | The patch does not introduce any
| | | | new Findbugs (version 2.0.3)
| | | | warnings.
| +1 | mapreduce tests | 109m 59s | Tests passed in
| | | | hadoop-mapreduce-client-jobclient.
| +1 | yarn tests | 0m 30s | Tests passed in hadoop-yarn-api.
| +1 | yarn tests | 7m 8s | Tests passed in hadoop-yarn-client.
| +1 | yarn tests | 2m 2s | Tests passed in hadoop-yarn-common.
| +1 | yarn tests | 49m 54s | Tests passed in
| | | | hadoop-yarn-server-resourcemanager.
| | | 212m 39s |
|| Subsystem || Report/Notes ||
============================================================================
| Patch URL | http://issues.apache.org/jira/secure/attachment/12732885/0001-YARN-3583.patch |
| Optional Tests | javadoc javac unit findbugs checkstyle |
| git revision | trunk / def9136 |
| whitespace | /home/jenkins/jenkins-slave/workspace/PreCommit-YARN-Build/patchprocess/whitespace.txt |
| hadoop-mapreduce-client-jobclient test log | /home/jenkins/jenkins-slave/workspace/PreCommit-YARN-Build/patchprocess/testrun_hadoop-mapreduce-client-jobclient.txt |
| hadoop-yarn-api test log | /home/jenkins/jenkins-slave/workspace/PreCommit-YARN-Build/patchprocess/testrun_hadoop-yarn-api.txt |
| hadoop-yarn-client test log | /home/jenkins/jenkins-slave/workspace/PreCommit-YARN-Build/patchprocess/testrun_hadoop-yarn-client.txt |
| hadoop-yarn-common test log | /home/jenkins/jenkins-slave/workspace/PreCommit-YARN-Build/patchprocess/testrun_hadoop-yarn-common.txt |
| hadoop-yarn-server-resourcemanager test log | /home/jenkins/jenkins-slave/workspace/PreCommit-YARN-Build/patchprocess/testrun_hadoop-yarn-server-resourcemanager.txt |
| Test Results | https://builds.apache.org/job/PreCommit-YARN-Build/7936/testReport/ |
| Java | 1.7.0_55 |
| uname | Linux asf905.gq1.ygridcore.net 3.13.0-36-lowlatency #63-Ubuntu SMP PREEMPT Wed Sep 3 21:56:12 UTC 2014 x86_64 x86_64 x86_64 GNU/Linux |
============================================================================
============================================================================
Adding comment to JIRA
============================================================================
============================================================================
Comment added.
b192b9bca78dc1e217e7271869ed7f67c273b74a logged out
============================================================================
============================================================================
Finished build.
============================================================================
============================================================================
Build step 'Execute shell' marked build as failure
Archiving artifacts
Sending artifact delta relative to PreCommit-YARN-Build #7922
Archived 60 artifacts
Archive block size is 32768
Received 153 blocks and 25718478 bytes
Compression is 16.3%
Took 7.9 sec
[description-setter] Could not determine description.
Recording test results
Email was triggered for: Failure
Sending email for trigger: Failure
###################################################################################
############################## FAILED TESTS (if any) ##############################
All tests passed
Failed: YARN-3505 PreCommit Build #7935
Posted by Apache Jenkins Server <je...@builds.apache.org>.
Jira: https://issues.apache.org/jira/browse/YARN-3505
Build: https://builds.apache.org/job/PreCommit-YARN-Build/7935/
###################################################################################
########################## LAST 60 LINES OF THE CONSOLE ###########################
[...truncated 327 lines...]
| | | | new Findbugs (version 2.0.3)
| | | | warnings.
| +1 | yarn tests | 0m 25s | Tests passed in hadoop-yarn-api.
| +1 | yarn tests | 1m 57s | Tests passed in hadoop-yarn-common.
| +1 | yarn tests | 0m 24s | Tests passed in
| | | | hadoop-yarn-server-common.
| +1 | yarn tests | 6m 9s | Tests passed in
| | | | hadoop-yarn-server-nodemanager.
| +1 | yarn tests | 53m 12s | Tests passed in
| | | | hadoop-yarn-server-resourcemanager.
| | | 106m 16s |
|| Subsystem || Report/Notes ||
============================================================================
| Patch URL | http://issues.apache.org/jira/secure/attachment/12732825/YARN-3505.6.patch |
| Optional Tests | javadoc javac unit findbugs checkstyle |
| git revision | trunk / def9136 |
| checkstyle | /home/jenkins/jenkins-slave/workspace/PreCommit-YARN-Build/patchprocess/diffcheckstylehadoop-yarn-server-common.txt |
| hadoop-yarn-api test log | /home/jenkins/jenkins-slave/workspace/PreCommit-YARN-Build/patchprocess/testrun_hadoop-yarn-api.txt |
| hadoop-yarn-common test log | /home/jenkins/jenkins-slave/workspace/PreCommit-YARN-Build/patchprocess/testrun_hadoop-yarn-common.txt |
| hadoop-yarn-server-common test log | /home/jenkins/jenkins-slave/workspace/PreCommit-YARN-Build/patchprocess/testrun_hadoop-yarn-server-common.txt |
| hadoop-yarn-server-nodemanager test log | /home/jenkins/jenkins-slave/workspace/PreCommit-YARN-Build/patchprocess/testrun_hadoop-yarn-server-nodemanager.txt |
| hadoop-yarn-server-resourcemanager test log | /home/jenkins/jenkins-slave/workspace/PreCommit-YARN-Build/patchprocess/testrun_hadoop-yarn-server-resourcemanager.txt |
| Test Results | https://builds.apache.org/job/PreCommit-YARN-Build/7935/testReport/ |
| Java | 1.7.0_55 |
| uname | Linux asf907.gq1.ygridcore.net 3.13.0-36-lowlatency #63-Ubuntu SMP PREEMPT Wed Sep 3 21:56:12 UTC 2014 x86_64 x86_64 x86_64 GNU/Linux |
============================================================================
============================================================================
Adding comment to JIRA
============================================================================
============================================================================
Comment added.
004b0fda4963ec1495889c5538e045625e359560 logged out
============================================================================
============================================================================
Finished build.
============================================================================
============================================================================
Build step 'Execute shell' marked build as failure
Archiving artifacts
Sending artifact delta relative to PreCommit-YARN-Build #7922
Archived 61 artifacts
Archive block size is 32768
Received 34 blocks and 35123331 bytes
Compression is 3.1%
Took 9.9 sec
[description-setter] Could not determine description.
Recording test results
Email was triggered for: Failure
Sending email for trigger: Failure
###################################################################################
############################## FAILED TESTS (if any) ##############################
All tests passed
Failed: YARN-2336 PreCommit Build #7934
Posted by Apache Jenkins Server <je...@builds.apache.org>.
Jira: https://issues.apache.org/jira/browse/YARN-2336
Build: https://builds.apache.org/job/PreCommit-YARN-Build/7934/
###################################################################################
########################## LAST 60 LINES OF THE CONSOLE ###########################
[...truncated 284 lines...]
| | | | checkstyle issues (total was 8, now
| | | | 9).
| -1 | whitespace | 0m 1s | The patch has 1 line(s) that end in
| | | | whitespace. Use git apply
| | | | --whitespace=fix.
| +1 | install | 1m 34s | mvn install still works.
| +1 | eclipse:eclipse | 0m 31s | The patch built with
| | | | eclipse:eclipse.
| +1 | findbugs | 1m 14s | The patch does not introduce any
| | | | new Findbugs (version 2.0.3)
| | | | warnings.
| +1 | yarn tests | 54m 52s | Tests passed in
| | | | hadoop-yarn-server-resourcemanager.
| | | 97m 19s |
|| Subsystem || Report/Notes ||
============================================================================
| Patch URL | http://issues.apache.org/jira/secure/attachment/12732860/YARN-2336.007.patch |
| Optional Tests | javadoc javac unit findbugs checkstyle site |
| git revision | trunk / def9136 |
| checkstyle | /home/jenkins/jenkins-slave/workspace/PreCommit-YARN-Build/patchprocess/diffcheckstylehadoop-yarn-server-resourcemanager.txt |
| whitespace | /home/jenkins/jenkins-slave/workspace/PreCommit-YARN-Build/patchprocess/whitespace.txt |
| hadoop-yarn-server-resourcemanager test log | /home/jenkins/jenkins-slave/workspace/PreCommit-YARN-Build/patchprocess/testrun_hadoop-yarn-server-resourcemanager.txt |
| Test Results | https://builds.apache.org/job/PreCommit-YARN-Build/7934/testReport/ |
| Java | 1.7.0_55 |
| uname | Linux asf907.gq1.ygridcore.net 3.13.0-36-lowlatency #63-Ubuntu SMP PREEMPT Wed Sep 3 21:56:12 UTC 2014 x86_64 x86_64 x86_64 GNU/Linux |
============================================================================
============================================================================
Adding comment to JIRA
============================================================================
============================================================================
Comment added.
46d2924f6d5feb197779d1828705062493b5f26d logged out
============================================================================
============================================================================
Finished build.
============================================================================
============================================================================
Build step 'Execute shell' marked build as failure
Archiving artifacts
Sending artifact delta relative to PreCommit-YARN-Build #7922
Archived 27 artifacts
Archive block size is 32768
Received 34 blocks and 12466076 bytes
Compression is 8.2%
Took 6.1 sec
[description-setter] Could not determine description.
Recording test results
Email was triggered for: Failure
Sending email for trigger: Failure
###################################################################################
############################## FAILED TESTS (if any) ##############################
All tests passed
Failed: YARN-3505 PreCommit Build #7933
Posted by Apache Jenkins Server <je...@builds.apache.org>.
Jira: https://issues.apache.org/jira/browse/YARN-3505
Build: https://builds.apache.org/job/PreCommit-YARN-Build/7933/
###################################################################################
########################## LAST 60 LINES OF THE CONSOLE ###########################
[...truncated 334 lines...]
| +1 | yarn tests | 0m 24s | Tests passed in
| | | | hadoop-yarn-server-common.
| +1 | yarn tests | 6m 9s | Tests passed in
| | | | hadoop-yarn-server-nodemanager.
| -1 | yarn tests | 59m 59s | Tests failed in
| | | | hadoop-yarn-server-resourcemanager.
| | | 112m 54s |
Reason | Tests
Timed out tests | org.apache.hadoop.yarn.server.resourcemanager.scheduler.capacity.TestNodeLabelContainerAllocation
|| Subsystem || Report/Notes ||
============================================================================
| Patch URL | http://issues.apache.org/jira/secure/attachment/12732825/YARN-3505.6.patch |
| Optional Tests | javadoc javac unit findbugs checkstyle |
| git revision | trunk / def9136 |
| checkstyle | /home/jenkins/jenkins-slave/workspace/PreCommit-YARN-Build/patchprocess/diffcheckstylehadoop-yarn-server-common.txt |
| hadoop-yarn-api test log | /home/jenkins/jenkins-slave/workspace/PreCommit-YARN-Build/patchprocess/testrun_hadoop-yarn-api.txt |
| hadoop-yarn-common test log | /home/jenkins/jenkins-slave/workspace/PreCommit-YARN-Build/patchprocess/testrun_hadoop-yarn-common.txt |
| hadoop-yarn-server-common test log | /home/jenkins/jenkins-slave/workspace/PreCommit-YARN-Build/patchprocess/testrun_hadoop-yarn-server-common.txt |
| hadoop-yarn-server-nodemanager test log | /home/jenkins/jenkins-slave/workspace/PreCommit-YARN-Build/patchprocess/testrun_hadoop-yarn-server-nodemanager.txt |
| hadoop-yarn-server-resourcemanager test log | /home/jenkins/jenkins-slave/workspace/PreCommit-YARN-Build/patchprocess/testrun_hadoop-yarn-server-resourcemanager.txt |
| Test Results | https://builds.apache.org/job/PreCommit-YARN-Build/7933/testReport/ |
| Java | 1.7.0_55 |
| uname | Linux asf909.gq1.ygridcore.net 3.13.0-36-lowlatency #63-Ubuntu SMP PREEMPT Wed Sep 3 21:56:12 UTC 2014 x86_64 x86_64 x86_64 GNU/Linux |
============================================================================
============================================================================
Adding comment to JIRA
============================================================================
============================================================================
Comment added.
931e405462e611ecd4fdff5dbb1ee35aab05ebee logged out
============================================================================
============================================================================
Finished build.
============================================================================
============================================================================
Build step 'Execute shell' marked build as failure
Archiving artifacts
Sending artifact delta relative to PreCommit-YARN-Build #7922
Archived 61 artifacts
Archive block size is 32768
Received 30 blocks and 35242177 bytes
Compression is 2.7%
Took 9.4 sec
[description-setter] Could not determine description.
Recording test results
Email was triggered for: Failure
Sending email for trigger: Failure
###################################################################################
############################## FAILED TESTS (if any) ##############################
All tests passed
Failed: YARN-3411 PreCommit Build #7932
Posted by Apache Jenkins Server <je...@builds.apache.org>.
Jira: https://issues.apache.org/jira/browse/YARN-3411
Build: https://builds.apache.org/job/PreCommit-YARN-Build/7932/
###################################################################################
########################## LAST 60 LINES OF THE CONSOLE ###########################
[...truncated 326 lines...]
Reason | Tests
FindBugs | module:hadoop-yarn-server-timelineservice
| org.apache.hadoop.yarn.server.timelineservice.storage.EntityColumnDetails.getInBytes() may expose internal representation by returning EntityColumnDetails.inBytes At EntityColumnDetails.java:by returning EntityColumnDetails.inBytes At EntityColumnDetails.java:[line 48]
| org.apache.hadoop.yarn.server.timelineservice.storage.EntityTableDetails.COLUMN_FAMILY_CONFIG_BYTES should be package protected At EntityTableDetails.java: At EntityTableDetails.java:[line 48]
| org.apache.hadoop.yarn.server.timelineservice.storage.EntityTableDetails.COLUMN_FAMILY_INFO_BYTES should be package protected At EntityTableDetails.java: At EntityTableDetails.java:[line 34]
| org.apache.hadoop.yarn.server.timelineservice.storage.EntityTableDetails.COLUMN_FAMILY_METRICS_BYTES should be package protected At EntityTableDetails.java: At EntityTableDetails.java:[line 41]
| org.apache.hadoop.yarn.server.timelineservice.storage.EntityTableDetails.COLUMN_PREFIX_EVENTS_BYTES should be package protected At EntityTableDetails.java: At EntityTableDetails.java:[line 55]
| org.apache.hadoop.yarn.server.timelineservice.storage.EntityTableDetails.COLUMN_PREFIX_IS_RELATED_TO_BYTES should be package protected At EntityTableDetails.java: At EntityTableDetails.java:[line 69]
| org.apache.hadoop.yarn.server.timelineservice.storage.EntityTableDetails.COLUMN_PREFIX_RELATES_TO_BYTES should be package protected At EntityTableDetails.java: At EntityTableDetails.java:[line 62]
| org.apache.hadoop.yarn.server.timelineservice.storage.EntityTableDetails.ROW_KEY_SEPARATOR_BYTES should be package protected At EntityTableDetails.java: At EntityTableDetails.java:[line 79]
Failed unit tests | hadoop.yarn.server.timelineservice.storage.TestHBaseTimelineWriterImpl
| hadoop.yarn.server.timelineservice.storage.TestPhoenixTimelineWriterImpl
|| Subsystem || Report/Notes ||
============================================================================
| Patch URL | http://issues.apache.org/jira/secure/attachment/12732791/YARN-3411-YARN-2928.001.patch |
| Optional Tests | javadoc javac unit findbugs checkstyle |
| git revision | YARN-2928 / b059dd4 |
| javadoc | /home/jenkins/jenkins-slave/workspace/PreCommit-YARN-Build/patchprocess/diffJavadocWarnings.txt |
| Findbugs warnings | /home/jenkins/jenkins-slave/workspace/PreCommit-YARN-Build/patchprocess/newPatchFindbugsWarningshadoop-yarn-server-timelineservice.html |
| hadoop-yarn-server-timelineservice test log | /home/jenkins/jenkins-slave/workspace/PreCommit-YARN-Build/patchprocess/testrun_hadoop-yarn-server-timelineservice.txt |
| Test Results | https://builds.apache.org/job/PreCommit-YARN-Build/7932/testReport/ |
| Java | 1.7.0_55 |
| uname | Linux asf901.gq1.ygridcore.net 3.13.0-36-lowlatency #63-Ubuntu SMP PREEMPT Wed Sep 3 21:56:12 UTC 2014 x86_64 x86_64 x86_64 GNU/Linux |
============================================================================
============================================================================
Adding comment to JIRA
============================================================================
============================================================================
Comment added.
6c88408129f170f8f0726750ca4937c9a657467a logged out
============================================================================
============================================================================
Finished build.
============================================================================
============================================================================
Build step 'Execute shell' marked build as failure
Archiving artifacts
Sending artifact delta relative to PreCommit-YARN-Build #7922
Archived 24 artifacts
Archive block size is 32768
Received 45 blocks and 8535563 bytes
Compression is 14.7%
Took 2.6 sec
[description-setter] Could not determine description.
Recording test results
Email was triggered for: Failure
Sending email for trigger: Failure
###################################################################################
############################## FAILED TESTS (if any) ##############################
3 tests failed.
FAILED: org.apache.hadoop.yarn.server.timelineservice.storage.TestHBaseTimelineWriterImpl.org.apache.hadoop.yarn.server.timelineservice.storage.TestHBaseTimelineWriterImpl
Error Message:
Shutting down
Stack Trace:
java.io.IOException: Shutting down
at org.apache.hadoop.hbase.util.JVMClusterUtil.startup(JVMClusterUtil.java:225)
at org.apache.hadoop.hbase.LocalHBaseCluster.startup(LocalHBaseCluster.java:445)
at org.apache.hadoop.hbase.MiniHBaseCluster.init(MiniHBaseCluster.java:224)
at org.apache.hadoop.hbase.MiniHBaseCluster.<init>(MiniHBaseCluster.java:93)
at org.apache.hadoop.hbase.HBaseTestingUtility.startMiniHBaseCluster(HBaseTestingUtility.java:978)
at org.apache.hadoop.hbase.HBaseTestingUtility.startMiniCluster(HBaseTestingUtility.java:938)
at org.apache.hadoop.hbase.HBaseTestingUtility.startMiniCluster(HBaseTestingUtility.java:812)
at org.apache.hadoop.hbase.HBaseTestingUtility.startMiniCluster(HBaseTestingUtility.java:806)
at org.apache.hadoop.hbase.HBaseTestingUtility.startMiniCluster(HBaseTestingUtility.java:750)
at org.apache.hadoop.yarn.server.timelineservice.storage.TestHBaseTimelineWriterImpl.setupBeforeClass(TestHBaseTimelineWriterImpl.java:67)
FAILED: org.apache.hadoop.yarn.server.timelineservice.storage.TestPhoenixTimelineWriterImpl.org.apache.hadoop.yarn.server.timelineservice.storage.TestPhoenixTimelineWriterImpl
Error Message:
java.io.IOException: Shutting down
Stack Trace:
java.lang.RuntimeException: java.io.IOException: Shutting down
at org.apache.hadoop.hbase.util.JVMClusterUtil.startup(JVMClusterUtil.java:225)
at org.apache.hadoop.hbase.LocalHBaseCluster.startup(LocalHBaseCluster.java:445)
at org.apache.hadoop.hbase.MiniHBaseCluster.init(MiniHBaseCluster.java:224)
at org.apache.hadoop.hbase.MiniHBaseCluster.<init>(MiniHBaseCluster.java:93)
at org.apache.hadoop.hbase.HBaseTestingUtility.startMiniHBaseCluster(HBaseTestingUtility.java:978)
at org.apache.hadoop.hbase.HBaseTestingUtility.startMiniCluster(HBaseTestingUtility.java:938)
at org.apache.hadoop.hbase.HBaseTestingUtility.startMiniCluster(HBaseTestingUtility.java:812)
at org.apache.hadoop.hbase.HBaseTestingUtility.startMiniCluster(HBaseTestingUtility.java:794)
at org.apache.hadoop.hbase.HBaseTestingUtility.startMiniCluster(HBaseTestingUtility.java:781)
at org.apache.phoenix.query.BaseTest.initMiniCluster(BaseTest.java:571)
at org.apache.phoenix.query.BaseTest.setUpTestCluster(BaseTest.java:501)
at org.apache.phoenix.query.BaseTest.checkClusterInitialized(BaseTest.java:488)
at org.apache.phoenix.query.BaseTest.setUpTestDriver(BaseTest.java:545)
at org.apache.phoenix.query.BaseTest.setUpTestDriver(BaseTest.java:541)
at org.apache.hadoop.yarn.server.timelineservice.storage.TestPhoenixTimelineWriterImpl.setupPhoenixClusterAndWriterForTest(TestPhoenixTimelineWriterImpl.java:126)
at org.apache.hadoop.yarn.server.timelineservice.storage.TestPhoenixTimelineWriterImpl.setup(TestPhoenixTimelineWriterImpl.java:53)
FAILED: org.apache.hadoop.yarn.server.timelineservice.storage.TestPhoenixTimelineWriterImpl.org.apache.hadoop.yarn.server.timelineservice.storage.TestPhoenixTimelineWriterImpl
Error Message:
null
Stack Trace:
java.lang.NullPointerException: null
at org.apache.hadoop.yarn.server.timelineservice.storage.TestPhoenixTimelineWriterImpl.cleanup(TestPhoenixTimelineWriterImpl.java:103)
Failed: YARN-3170 PreCommit Build #7931
Posted by Apache Jenkins Server <je...@builds.apache.org>.
Jira: https://issues.apache.org/jira/browse/YARN-3170
Build: https://builds.apache.org/job/PreCommit-YARN-Build/7931/
###################################################################################
########################## LAST 60 LINES OF THE CONSOLE ###########################
[...truncated 166 lines...]
+1 overall
| Vote | Subsystem | Runtime | Comment
============================================================================
| 0 | pre-patch | 2m 52s | Pre-patch trunk compilation is
| | | | healthy.
| +1 | @author | 0m 0s | The patch does not contain any
| | | | @author tags.
| +1 | release audit | 0m 20s | The applied patch does not increase
| | | | the total number of release audit
| | | | warnings.
| +1 | site | 3m 2s | Site still builds.
| +1 | whitespace | 0m 0s | The patch has no lines that end in
| | | | whitespace.
| | | 6m 17s |
|| Subsystem || Report/Notes ||
============================================================================
| Patch URL | http://issues.apache.org/jira/secure/attachment/12732784/YARN-3170-008.patch |
| Optional Tests | site |
| git revision | trunk / b2c85db |
| Java | 1.7.0_55 |
| uname | Linux asf903.gq1.ygridcore.net 3.13.0-36-lowlatency #63-Ubuntu SMP PREEMPT Wed Sep 3 21:56:12 UTC 2014 x86_64 x86_64 x86_64 GNU/Linux |
============================================================================
============================================================================
Adding comment to JIRA
============================================================================
============================================================================
Comment added.
538e513e229845f360c8961297d541568c376557 logged out
============================================================================
============================================================================
Finished build.
============================================================================
============================================================================
Archiving artifacts
Sending artifact delta relative to PreCommit-YARN-Build #7922
Archived 9 artifacts
Archive block size is 32768
Received 0 blocks and 2377235 bytes
Compression is 0.0%
Took 2.1 sec
Description set: YARN-3170
Recording test results
No test report files were found. Configuration error?
Build step 'Publish JUnit test result report' changed build result to FAILURE
Email was triggered for: Failure
Sending email for trigger: Failure
###################################################################################
############################## FAILED TESTS (if any) ##############################
No tests ran.
Failed: YARN-3609 PreCommit Build #7930
Posted by Apache Jenkins Server <je...@builds.apache.org>.
Jira: https://issues.apache.org/jira/browse/YARN-3609
Build: https://builds.apache.org/job/PreCommit-YARN-Build/7930/
###################################################################################
########################## LAST 60 LINES OF THE CONSOLE ###########################
[...truncated 278 lines...]
| | | | whitespace. Use git apply
| | | | --whitespace=fix.
| +1 | install | 1m 34s | mvn install still works.
| +1 | eclipse:eclipse | 0m 33s | The patch built with
| | | | eclipse:eclipse.
| +1 | findbugs | 1m 24s | The patch does not introduce any
| | | | new Findbugs (version 2.0.3)
| | | | warnings.
| -1 | yarn tests | 1m 55s | Tests failed in hadoop-yarn-common.
| | | 38m 39s |
Reason | Tests
Failed unit tests | hadoop.yarn.nodelabels.TestFileSystemNodeLabelsStore
|| Subsystem || Report/Notes ||
============================================================================
| Patch URL | http://issues.apache.org/jira/secure/attachment/12732729/YARN-3609.1.preliminary.patch |
| Optional Tests | javadoc javac unit findbugs checkstyle |
| git revision | trunk / 0e85044 |
| whitespace | /home/jenkins/jenkins-slave/workspace/PreCommit-YARN-Build/patchprocess/whitespace.txt |
| hadoop-yarn-common test log | /home/jenkins/jenkins-slave/workspace/PreCommit-YARN-Build/patchprocess/testrun_hadoop-yarn-common.txt |
| Test Results | https://builds.apache.org/job/PreCommit-YARN-Build/7930/testReport/ |
| Java | 1.7.0_55 |
| uname | Linux asf901.gq1.ygridcore.net 3.13.0-36-lowlatency #63-Ubuntu SMP PREEMPT Wed Sep 3 21:56:12 UTC 2014 x86_64 x86_64 x86_64 GNU/Linux |
============================================================================
============================================================================
Adding comment to JIRA
============================================================================
============================================================================
Comment added.
c6431f7e8b5fc5394aca3a37d47c16c9e01ea0ca logged out
============================================================================
============================================================================
Finished build.
============================================================================
============================================================================
Build step 'Execute shell' marked build as failure
Archiving artifacts
Sending artifact delta relative to PreCommit-YARN-Build #7922
Archived 24 artifacts
Archive block size is 32768
Received 28 blocks and 10829851 bytes
Compression is 7.8%
Took 3.1 sec
[description-setter] Could not determine description.
Recording test results
Publish JUnit test result report is waiting for a checkpoint on PreCommit-YARN-Build #7929
Email was triggered for: Failure
Sending email for trigger: Failure
###################################################################################
############################## FAILED TESTS (if any) ##############################
6 tests failed.
FAILED: org.apache.hadoop.yarn.nodelabels.TestFileSystemNodeLabelsStore.testRecoverWithDistributedNodeLabels
Error Message:
expected:<3> but was:<0>
Stack Trace:
java.lang.AssertionError: expected:<3> but was:<0>
at org.junit.Assert.fail(Assert.java:88)
at org.junit.Assert.failNotEquals(Assert.java:743)
at org.junit.Assert.assertEquals(Assert.java:118)
at org.junit.Assert.assertEquals(Assert.java:555)
at org.junit.Assert.assertEquals(Assert.java:542)
at org.apache.hadoop.yarn.nodelabels.TestFileSystemNodeLabelsStore.testRecoverWithDistributedNodeLabels(TestFileSystemNodeLabelsStore.java:170)
FAILED: org.apache.hadoop.yarn.nodelabels.TestFileSystemNodeLabelsStore.testRecoverWithDistributedNodeLabels
Error Message:
null
Stack Trace:
java.lang.NullPointerException: null
at org.apache.hadoop.yarn.nodelabels.TestFileSystemNodeLabelsStore.after(TestFileSystemNodeLabelsStore.java:80)
FAILED: org.apache.hadoop.yarn.nodelabels.TestFileSystemNodeLabelsStore.testRecoverWithMirror
Error Message:
expected:<3> but was:<0>
Stack Trace:
java.lang.AssertionError: expected:<3> but was:<0>
at org.junit.Assert.fail(Assert.java:88)
at org.junit.Assert.failNotEquals(Assert.java:743)
at org.junit.Assert.assertEquals(Assert.java:118)
at org.junit.Assert.assertEquals(Assert.java:555)
at org.junit.Assert.assertEquals(Assert.java:542)
at org.apache.hadoop.yarn.nodelabels.TestFileSystemNodeLabelsStore.testRecoverWithMirror(TestFileSystemNodeLabelsStore.java:113)
FAILED: org.apache.hadoop.yarn.nodelabels.TestFileSystemNodeLabelsStore.testRecoverWithMirror
Error Message:
null
Stack Trace:
java.lang.NullPointerException: null
at org.apache.hadoop.yarn.nodelabels.TestFileSystemNodeLabelsStore.after(TestFileSystemNodeLabelsStore.java:80)
FAILED: org.apache.hadoop.yarn.nodelabels.TestFileSystemNodeLabelsStore.testEditlogRecover
Error Message:
expected:<3> but was:<0>
Stack Trace:
java.lang.AssertionError: expected:<3> but was:<0>
at org.junit.Assert.fail(Assert.java:88)
at org.junit.Assert.failNotEquals(Assert.java:743)
at org.junit.Assert.assertEquals(Assert.java:118)
at org.junit.Assert.assertEquals(Assert.java:555)
at org.junit.Assert.assertEquals(Assert.java:542)
at org.apache.hadoop.yarn.nodelabels.TestFileSystemNodeLabelsStore.testEditlogRecover(TestFileSystemNodeLabelsStore.java:210)
FAILED: org.apache.hadoop.yarn.nodelabels.TestFileSystemNodeLabelsStore.testEditlogRecover
Error Message:
null
Stack Trace:
java.lang.NullPointerException: null
at org.apache.hadoop.yarn.nodelabels.TestFileSystemNodeLabelsStore.after(TestFileSystemNodeLabelsStore.java:80)
Failed: YARN-3635 PreCommit Build #7929
Posted by Apache Jenkins Server <je...@builds.apache.org>.
Jira: https://issues.apache.org/jira/browse/YARN-3635
Build: https://builds.apache.org/job/PreCommit-YARN-Build/7929/
###################################################################################
########################## LAST 60 LINES OF THE CONSOLE ###########################
[...truncated 305 lines...]
| | | | --whitespace=fix.
| +1 | install | 1m 34s | mvn install still works.
| +1 | eclipse:eclipse | 0m 33s | The patch built with
| | | | eclipse:eclipse.
| +1 | findbugs | 1m 14s | The patch does not introduce any
| | | | new Findbugs (version 2.0.3)
| | | | warnings.
| -1 | yarn tests | 49m 51s | Tests failed in
| | | | hadoop-yarn-server-resourcemanager.
| | | 86m 12s |
Reason | Tests
Failed unit tests | hadoop.yarn.server.resourcemanager.TestRMRestart
|| Subsystem || Report/Notes ||
============================================================================
| Patch URL | http://issues.apache.org/jira/secure/attachment/12732726/YARN-3635.2.patch |
| Optional Tests | javadoc javac unit findbugs checkstyle |
| git revision | trunk / 0e85044 |
| checkstyle | /home/jenkins/jenkins-slave/workspace/PreCommit-YARN-Build/patchprocess/diffcheckstylehadoop-yarn-server-resourcemanager.txt |
| whitespace | /home/jenkins/jenkins-slave/workspace/PreCommit-YARN-Build/patchprocess/whitespace.txt |
| hadoop-yarn-server-resourcemanager test log | /home/jenkins/jenkins-slave/workspace/PreCommit-YARN-Build/patchprocess/testrun_hadoop-yarn-server-resourcemanager.txt |
| Test Results | https://builds.apache.org/job/PreCommit-YARN-Build/7929/testReport/ |
| Java | 1.7.0_55 |
| uname | Linux asf909.gq1.ygridcore.net 3.13.0-36-lowlatency #63-Ubuntu SMP PREEMPT Wed Sep 3 21:56:12 UTC 2014 x86_64 x86_64 x86_64 GNU/Linux |
============================================================================
============================================================================
Adding comment to JIRA
============================================================================
============================================================================
Comment added.
243308cd69ba5496f43229335343117dd3765bc1 logged out
============================================================================
============================================================================
Finished build.
============================================================================
============================================================================
Build step 'Execute shell' marked build as failure
Archiving artifacts
Sending artifact delta relative to PreCommit-YARN-Build #7922
Archived 25 artifacts
Archive block size is 32768
Received 31 blocks and 11973706 bytes
Compression is 7.8%
Took 4.9 sec
[description-setter] Could not determine description.
Recording test results
Email was triggered for: Failure
Sending email for trigger: Failure
###################################################################################
############################## FAILED TESTS (if any) ##############################
1 tests failed.
FAILED: org.apache.hadoop.yarn.server.resourcemanager.TestRMRestart.testRMRestartGetApplicationList[1]
Error Message:
rMAppManager.logApplicationSummary(
isA(org.apache.hadoop.yarn.api.records.ApplicationId)
);
Wanted 3 times:
-> at org.apache.hadoop.yarn.server.resourcemanager.TestRMRestart.testRMRestartGetApplicationList(TestRMRestart.java:980)
But was 2 times:
-> at org.apache.hadoop.yarn.server.resourcemanager.RMAppManager.handle(RMAppManager.java:66)
Stack Trace:
org.mockito.exceptions.verification.TooLittleActualInvocations:
rMAppManager.logApplicationSummary(
isA(org.apache.hadoop.yarn.api.records.ApplicationId)
);
Wanted 3 times:
-> at org.apache.hadoop.yarn.server.resourcemanager.TestRMRestart.testRMRestartGetApplicationList(TestRMRestart.java:980)
But was 2 times:
-> at org.apache.hadoop.yarn.server.resourcemanager.RMAppManager.handle(RMAppManager.java:66)
at org.apache.hadoop.yarn.server.resourcemanager.TestRMRestart.testRMRestartGetApplicationList(TestRMRestart.java:980)
Failed: YARN-1519 PreCommit Build #7928
Posted by Apache Jenkins Server <je...@builds.apache.org>.
Jira: https://issues.apache.org/jira/browse/YARN-1519
Build: https://builds.apache.org/job/PreCommit-YARN-Build/7928/
###################################################################################
########################## LAST 60 LINES OF THE CONSOLE ###########################
[...truncated 216 lines...]
| | | | for this patch. Also please list
| | | | what manual steps were performed to
| | | | verify this patch.
| +1 | javac | 7m 29s | There were no new javac warning
| | | | messages.
| +1 | release audit | 0m 22s | The applied patch does not increase
| | | | the total number of release audit
| | | | warnings.
| +1 | whitespace | 0m 0s | The patch has no lines that end in
| | | | whitespace.
| +1 | install | 1m 34s | mvn install still works.
| +1 | eclipse:eclipse | 0m 32s | The patch built with
| | | | eclipse:eclipse.
| +1 | yarn tests | 6m 9s | Tests passed in
| | | | hadoop-yarn-server-nodemanager.
| | | 21m 23s |
|| Subsystem || Report/Notes ||
============================================================================
| Patch URL | http://issues.apache.org/jira/secure/attachment/12732710/YARN-1519.003.patch |
| Optional Tests | javac unit |
| git revision | trunk / 281d47a |
| hadoop-yarn-server-nodemanager test log | /home/jenkins/jenkins-slave/workspace/PreCommit-YARN-Build/patchprocess/testrun_hadoop-yarn-server-nodemanager.txt |
| Test Results | https://builds.apache.org/job/PreCommit-YARN-Build/7928/testReport/ |
| Java | 1.7.0_55 |
| uname | Linux asf906.gq1.ygridcore.net 3.13.0-36-lowlatency #63-Ubuntu SMP PREEMPT Wed Sep 3 21:56:12 UTC 2014 x86_64 x86_64 x86_64 GNU/Linux |
============================================================================
============================================================================
Adding comment to JIRA
============================================================================
============================================================================
Comment added.
b385bc9804e45ae5ce608c990a3677b13e7df37b logged out
============================================================================
============================================================================
Finished build.
============================================================================
============================================================================
Build step 'Execute shell' marked build as failure
Archiving artifacts
Sending artifact delta relative to PreCommit-YARN-Build #7922
Archived 14 artifacts
Archive block size is 32768
Received 23 blocks and 3422169 bytes
Compression is 18.0%
Took 1.7 sec
[description-setter] Could not determine description.
Recording test results
Email was triggered for: Failure
Sending email for trigger: Failure
###################################################################################
############################## FAILED TESTS (if any) ##############################
All tests passed