You are viewing a plain text version of this content. The canonical link for it is here.
Posted to builds@mesos.apache.org by Apache Jenkins Server <je...@builds.apache.org> on 2017/02/05 10:21:52 UTC

Build failed in Jenkins: Mesos-Buildbot » cmake,gcc,--verbose --enable-libevent --enable-ssl,GLOG_v=1 MESOS_VERBOSE=1,ubuntu:14.04,(docker||Hadoop)&&(!ubuntu-us1)&&(!ubuntu-eu2) #3227

See <https://builds.apache.org/job/Mesos-Buildbot/BUILDTOOL=cmake,COMPILER=gcc,CONFIGURATION=--verbose%20--enable-libevent%20--enable-ssl,ENVIRONMENT=GLOG_v=1%20MESOS_VERBOSE=1,OS=ubuntu%3A14.04,label_exp=(docker%7C%7CHadoop)&&(!ubuntu-us1)&&(!ubuntu-eu2)/3227/>

------------------------------------------
[...truncated 417 lines...]
hudson.plugins.git.GitException: Command "git -c core.askpass=true fetch --tags --progress https://git-wip-us.apache.org/repos/asf/mesos.git +refs/heads/*:refs/remotes/origin/*" returned status code 128:
stdout: 
stderr: remote: Counting objects: 111977, done.        
remote: Compressing objects:   0% (1/30820)           
remote: Compressing objects:   1% (309/30820)           
remote: Compressing objects:   2% (617/30820)           
remote: Compressing objects:   3% (925/30820)           
remote: Compressing objects:   4% (1233/30820)           
remote: Compressing objects:   5% (1541/30820)           
remote: Compressing objects:   6% (1850/30820)           
remote: Compressing objects:   7% (2158/30820)           
remote: Compressing objects:   8% (2466/30820)           
remote: Compressing objects:   9% (2774/30820)           
remote: Compressing objects:  10% (3082/30820)           
remote: Compressing objects:  11% (3391/30820)           
remote: Compressing objects:  12% (3699/30820)           
remote: Compressing objects:  13% (4007/30820)           
remote: Compressing objects:  14% (4315/30820)           
remote: Compressing objects:  15% (4623/30820)           
remote: Compressing objects:  16% (4932/30820)           
remote: Compressing objects:  17% (5240/30820)           
remote: Compressing objects:  18% (5548/30820)           
remote: Compressing objects:  19% (5856/30820)           
remote: Compressing objects:  20% (6164/30820)           
remote: Compressing objects:  21% (6473/30820)           
remote: Compressing objects:  22% (6781/30820)           
remote: Compressing objects:  23% (7089/30820)           
remote: Compressing objects:  24% (7397/30820)           
remote: Compressing objects:  25% (7705/30820)           
remote: Compressing objects:  26% (8014/30820)           
remote: Compressing objects:  27% (8322/30820)           
remote: Compressing objects:  28% (8630/30820)           
remote: Compressing objects:  29% (8938/30820)           
remote: Compressing objects:  30% (9246/30820)           
remote: Compressing objects:  31% (9555/30820)           
remote: Compressing objects:  32% (9863/30820)           
remote: Compressing objects:  33% (10171/30820)           
remote: Compressing objects:  34% (10479/30820)           
remote: Compressing objects:  35% (10787/30820)           
remote: Compressing objects:  36% (11096/30820)           
remote: Compressing objects:  37% (11404/30820)           
remote: Compressing objects:  38% (11712/30820)           
remote: Compressing objects:  39% (12020/30820)           
remote: Compressing objects:  40% (12328/30820)           
remote: Compressing objects:  41% (12637/30820)           
remote: Compressing objects:  42% (12945/30820)           
remote: Compressing objects:  43% (13253/30820)           
remote: Compressing objects:  44% (13561/30820)           
remote: Compressing objects:  45% (13869/30820)           
remote: Compressing objects:  46% (14178/30820)           
remote: Compressing objects:  47% (14486/30820)           
remote: Compressing objects:  48% (14794/30820)           
remote: Compressing objects:  49% (15102/30820)           
remote: Compressing objects:  50% (15410/30820)           
remote: Compressing objects:  51% (15719/30820)           
remote: Compressing objects:  52% (16027/30820)           
remote: Compressing objects:  53% (16335/30820)           
remote: Compressing objects:  54% (16643/30820)           
remote: Compressing objects:  55% (16951/30820)           
remote: Compressing objects:  56% (17260/30820)           
remote: Compressing objects:  57% (17568/30820)           
remote: Compressing objects:  58% (17876/30820)           
remote: Compressing objects:  59% (18184/30820)           
remote: Compressing objects:  60% (18492/30820)           
remote: Compressing objects:  61% (18801/30820)           
remote: Compressing objects:  62% (19109/30820)           
remote: Compressing objects:  63% (19417/30820)           
remote: Compressing objects:  64% (19725/30820)           
remote: Compressing objects:  65% (20033/30820)           
remote: Compressing objects:  66% (20342/30820)           
remote: Compressing objects:  67% (20650/30820)           
remote: Compressing objects:  68% (20958/30820)           
remote: Compressing objects:  69% (21266/30820)           
remote: Compressing objects:  70% (21574/30820)           
remote: Compressing objects:  71% (21883/30820)           
remote: Compressing objects:  72% (22191/30820)           
remote: Compressing objects:  73% (22499/30820)           
remote: Compressing objects:  74% (22807/30820)           
remote: Compressing objects:  75% (23115/30820)           
remote: Compressing objects:  76% (23424/30820)           
remote: Compressing objects:  77% (23732/30820)           
remote: Compressing objects:  78% (24040/30820)           
remote: Compressing objects:  79% (24348/30820)           
remote: Compressing objects:  80% (24656/30820)           
remote: Compressing objects:  81% (24965/30820)           
remote: Compressing objects:  82% (25273/30820)           
remote: Compressing objects:  83% (25581/30820)           
remote: Compressing objects:  84% (25889/30820)           
remote: Compressing objects:  85% (26197/30820)           
remote: Compressing objects:  86% (26506/30820)           
remote: Compressing objects:  87% (26814/30820)           
remote: Compressing objects:  88% (27122/30820)           
remote: Compressing objects:  89% (27430/30820)           
remote: Compressing objects:  90% (27738/30820)           
remote: Compressing objects:  91% (28047/30820)           
remote: Compressing objects:  92% (28355/30820)           
remote: Compressing objects:  93% (28663/30820)           
remote: Compressing objects:  94% (28971/30820)           
remote: Compressing objects:  95% (29279/30820)           
remote: Compressing objects:  96% (29588/30820)           
remote: Compressing objects:  97% (29896/30820)           
remote: Compressing objects:  98% (30204/30820)           
remote: Compressing objects:  99% (30512/30820)           
remote: Compressing objects: 100% (30820/30820)           
remote: Compressing objects: 100% (30820/30820), done.        
Receiving objects:   0% (1/111977)   
Receiving objects:   1% (1120/111977)   
Receiving objects:   2% (2240/111977)   
Receiving objects:   3% (3360/111977)   
Receiving objects:   4% (4480/111977)   
Receiving objects:   5% (5599/111977)   
Receiving objects:   6% (6719/111977)   
Receiving objects:   7% (7839/111977)   
Receiving objects:   8% (8959/111977)   
Receiving objects:   9% (10078/111977)   
Receiving objects:  10% (11198/111977)   
Receiving objects:  11% (12318/111977)   
Receiving objects:  12% (13438/111977)   
Receiving objects:  13% (14558/111977)   
Receiving objects:  14% (15677/111977)   
Receiving objects:  15% (16797/111977)   
Receiving objects:  16% (17917/111977)   
Receiving objects:  17% (19037/111977)   
Receiving objects:  18% (20156/111977)   
Receiving objects:  19% (21276/111977)   
Receiving objects:  20% (22396/111977)   
Receiving objects:  21% (23516/111977)   
Receiving objects:  22% (24635/111977), 8.50 MiB | 16.95 MiB/s   
Receiving objects:  23% (25755/111977), 8.50 MiB | 16.95 MiB/s   
Receiving objects:  24% (26875/111977), 8.50 MiB | 16.95 MiB/s   
Receiving objects:  25% (27995/111977), 8.50 MiB | 16.95 MiB/s   
Receiving objects:  26% (29115/111977), 8.50 MiB | 16.95 MiB/s   
Receiving objects:  26% (30001/111977), 26.15 MiB | 26.10 MiB/s   
Receiving objects:  27% (30234/111977), 26.15 MiB | 26.10 MiB/s   
Receiving objects:  28% (31354/111977), 43.38 MiB | 28.86 MiB/s   
Receiving objects:  29% (32474/111977), 43.38 MiB | 28.86 MiB/s   
Receiving objects:  30% (33594/111977), 43.38 MiB | 28.86 MiB/s   
Receiving objects:  31% (34713/111977), 43.38 MiB | 28.86 MiB/s   
Receiving objects:  32% (35833/111977), 43.38 MiB | 28.86 MiB/s   
Receiving objects:  33% (36953/111977), 43.38 MiB | 28.86 MiB/s   
Receiving objects:  34% (38073/111977), 43.38 MiB | 28.86 MiB/s   
Receiving objects:  35% (39192/111977), 43.38 MiB | 28.86 MiB/s   
Receiving objects:  36% (40312/111977), 43.38 MiB | 28.86 MiB/s   
Receiving objects:  37% (41432/111977), 43.38 MiB | 28.86 MiB/s   
Receiving objects:  38% (42552/111977), 43.38 MiB | 28.86 MiB/s   
Receiving objects:  39% (43672/111977), 43.38 MiB | 28.86 MiB/s   
Receiving objects:  40% (44791/111977), 43.38 MiB | 28.86 MiB/s   
Receiving objects:  40% (44880/111977), 43.38 MiB | 28.86 MiB/s   
Receiving objects:  41% (45911/111977), 51.30 MiB | 25.60 MiB/s   
Receiving objects:  42% (47031/111977), 51.30 MiB | 25.60 MiB/s   
Receiving objects:  43% (48151/111977), 51.30 MiB | 25.60 MiB/s   
Receiving objects:  44% (49270/111977), 51.30 MiB | 25.60 MiB/s   
Receiving objects:  45% (50390/111977), 51.30 MiB | 25.60 MiB/s   
Receiving objects:  46% (51510/111977), 51.30 MiB | 25.60 MiB/s   
Receiving objects:  47% (52630/111977), 51.30 MiB | 25.60 MiB/s   
Receiving objects:  48% (53749/111977), 51.30 MiB | 25.60 MiB/s   
Receiving objects:  49% (54869/111977), 51.30 MiB | 25.60 MiB/s   
Receiving objects:  50% (55989/111977), 51.30 MiB | 25.60 MiB/s   
Receiving objects:  51% (57109/111977), 51.30 MiB | 25.60 MiB/s   
Receiving objects:  52% (58229/111977), 51.30 MiB | 25.60 MiB/s   
Receiving objects:  53% (59348/111977), 58.05 MiB | 23.17 MiB/s   
Receiving objects:  53% (59595/111977), 75.36 MiB | 25.07 MiB/s   
Receiving objects:  54% (60468/111977), 75.36 MiB | 25.07 MiB/s   
Receiving objects:  55% (61588/111977), 75.36 MiB | 25.07 MiB/s   
Receiving objects:  56% (62708/111977), 75.36 MiB | 25.07 MiB/s   
Receiving objects:  57% (63827/111977), 75.36 MiB | 25.07 MiB/s   
Receiving objects:  58% (64947/111977), 75.36 MiB | 25.07 MiB/s   
Receiving objects:  59% (66067/111977), 75.36 MiB | 25.07 MiB/s   
Receiving objects:  60% (67187/111977), 75.36 MiB | 25.07 MiB/s   
Receiving objects:  61% (68306/111977), 75.36 MiB | 25.07 MiB/s   
Receiving objects:  62% (69426/111977), 75.36 MiB | 25.07 MiB/s   
Receiving objects:  63% (70546/111977), 75.36 MiB | 25.07 MiB/s   
Receiving objects:  64% (71666/111977), 75.36 MiB | 25.07 MiB/s   
Receiving objects:  65% (72786/111977), 75.36 MiB | 25.07 MiB/s   
Receiving objects:  66% (73905/111977), 75.36 MiB | 25.07 MiB/s   
Receiving objects:  67% (75025/111977), 75.36 MiB | 25.07 MiB/s   
Receiving objects:  68% (76145/111977), 75.36 MiB | 25.07 MiB/s   
Receiving objects:  69% (77265/111977), 75.36 MiB | 25.07 MiB/s   
Receiving objects:  70% (78384/111977), 75.36 MiB | 25.07 MiB/s   
Receiving objects:  71% (79504/111977), 75.36 MiB | 25.07 MiB/s   
Receiving objects:  72% (80624/111977), 75.36 MiB | 25.07 MiB/s   
Receiving objects:  73% (81744/111977), 75.36 MiB | 25.07 MiB/s   
Receiving objects:  74% (82863/111977), 75.36 MiB | 25.07 MiB/s   
Receiving objects:  75% (83983/111977), 75.36 MiB | 25.07 MiB/s   
Receiving objects:  76% (85103/111977), 75.36 MiB | 25.07 MiB/s   
Receiving objects:  77% (86223/111977), 75.36 MiB | 25.07 MiB/s   
Receiving objects:  78% (87343/111977), 75.36 MiB | 25.07 MiB/s   
Receiving objects:  79% (88462/111977), 75.36 MiB | 25.07 MiB/s   
Receiving objects:  80% (89582/111977), 75.36 MiB | 25.07 MiB/s   
Receiving objects:  81% (90702/111977), 75.36 MiB | 25.07 MiB/s   
Receiving objects:  82% (91822/111977), 75.36 MiB | 25.07 MiB/s   
Receiving objects:  83% (92941/111977), 75.36 MiB | 25.07 MiB/s   
Receiving objects:  84% (94061/111977), 92.24 MiB | 26.30 MiB/s   
Receiving objects:  85% (95181/111977), 92.24 MiB | 26.30 MiB/s   
Receiving objects:  85% (95616/111977), 109.67 MiB | 27.36 MiB/s   
Receiving objects:  86% (96301/111977), 109.67 MiB | 27.36 MiB/s   
Receiving objects:  87% (97420/111977), 109.67 MiB | 27.36 MiB/s   
Receiving objects:  88% (98540/111977), 109.67 MiB | 27.36 MiB/s   
Receiving objects:  89% (99660/111977), 109.67 MiB | 27.36 MiB/s   
Receiving objects:  89% (100075/111977), 144.59 MiB | 30.18 MiB/s   
Receiving objects:  89% (100075/111977), 180.11 MiB | 30.33 MiB/s   
Receiving objects:  89% (100075/111977), 215.75 MiB | 34.97 MiB/s   
Receiving objects:  90% (100780/111977), 215.75 MiB | 34.97 MiB/s   
Receiving objects:  91% (101900/111977), 215.75 MiB | 34.97 MiB/s   
Receiving objects:  92% (103019/111977), 230.27 MiB | 34.36 MiB/s   
Receiving objects:  93% (104139/111977), 230.27 MiB | 34.36 MiB/s   
error: RPC failed; result=56, HTTP code = 200
fatal: The remote end hung up unexpectedly
fatal: early EOF
fatal: index-pack failed

	at org.jenkinsci.plugins.gitclient.CliGitAPIImpl.launchCommandIn(CliGitAPIImpl.java:1723)
	at org.jenkinsci.plugins.gitclient.CliGitAPIImpl.launchCommandWithCredentials(CliGitAPIImpl.java:1459)
	at org.jenkinsci.plugins.gitclient.CliGitAPIImpl.access$300(CliGitAPIImpl.java:63)
	at org.jenkinsci.plugins.gitclient.CliGitAPIImpl$1.execute(CliGitAPIImpl.java:314)
	at org.jenkinsci.plugins.gitclient.CliGitAPIImpl$2.execute(CliGitAPIImpl.java:506)
	at org.jenkinsci.plugins.gitclient.RemoteGitImpl$CommandInvocationHandler$1.call(RemoteGitImpl.java:152)
	at org.jenkinsci.plugins.gitclient.RemoteGitImpl$CommandInvocationHandler$1.call(RemoteGitImpl.java:145)
	at hudson.remoting.UserRequest.perform(UserRequest.java:153)
	at hudson.remoting.UserRequest.perform(UserRequest.java:50)
	at hudson.remoting.Request$2.run(Request.java:332)
	at hudson.remoting.InterceptingExecutorService$1.call(InterceptingExecutorService.java:68)
	at java.util.concurrent.FutureTask.run(FutureTask.java:262)
	at java.util.concurrent.ThreadPoolExecutor.runWorker(ThreadPoolExecutor.java:1145)
	at java.util.concurrent.ThreadPoolExecutor$Worker.run(ThreadPoolExecutor.java:615)
	at java.lang.Thread.run(Thread.java:745)
	at ......remote call to H6(Native Method)
	at hudson.remoting.Channel.attachCallSiteStackTrace(Channel.java:1416)
	at hudson.remoting.UserResponse.retrieve(UserRequest.java:253)
	at hudson.remoting.Channel.call(Channel.java:781)
	at org.jenkinsci.plugins.gitclient.RemoteGitImpl$CommandInvocationHandler.execute(RemoteGitImpl.java:145)
	at sun.reflect.GeneratedMethodAccessor946.invoke(Unknown Source)
	at sun.reflect.DelegatingMethodAccessorImpl.invoke(DelegatingMethodAccessorImpl.java:43)
	at java.lang.reflect.Method.invoke(Method.java:498)
	at org.jenkinsci.plugins.gitclient.RemoteGitImpl$CommandInvocationHandler.invoke(RemoteGitImpl.java:131)
	at com.sun.proxy.$Proxy177.execute(Unknown Source)
	at hudson.plugins.git.GitSCM.retrieveChanges(GitSCM.java:1046)
	at hudson.plugins.git.GitSCM.checkout(GitSCM.java:1086)
	at hudson.scm.SCM.checkout(SCM.java:485)
	at hudson.model.AbstractProject.checkout(AbstractProject.java:1269)
	at hudson.model.AbstractBuild$AbstractBuildExecution.defaultCheckout(AbstractBuild.java:604)
	at jenkins.scm.SCMCheckoutStrategy.checkout(SCMCheckoutStrategy.java:86)
	at hudson.model.AbstractBuild$AbstractBuildExecution.run(AbstractBuild.java:529)
	at hudson.model.Run.execute(Run.java:1741)
	at hudson.matrix.MatrixRun.run(MatrixRun.java:146)
	at hudson.model.ResourceController.execute(ResourceController.java:98)
	at hudson.model.Executor.run(Executor.java:410)
ERROR: null


Jenkins build is back to normal : Mesos-Buildbot » cmake,gcc,--verbose --enable-libevent --enable-ssl,GLOG_v=1 MESOS_VERBOSE=1,ubuntu:14.04,(docker||Hadoop)&&(!ubuntu-us1)&&(!ubuntu-eu2) #3229

Posted by Apache Jenkins Server <je...@builds.apache.org>.
See <https://builds.apache.org/job/Mesos-Buildbot/BUILDTOOL=cmake,COMPILER=gcc,CONFIGURATION=--verbose%20--enable-libevent%20--enable-ssl,ENVIRONMENT=GLOG_v=1%20MESOS_VERBOSE=1,OS=ubuntu%3A14.04,label_exp=(docker%7C%7CHadoop)&&(!ubuntu-us1)&&(!ubuntu-eu2)/3229/changes>


Build failed in Jenkins: Mesos-Buildbot » cmake,gcc,--verbose --enable-libevent --enable-ssl,GLOG_v=1 MESOS_VERBOSE=1,ubuntu:14.04,(docker||Hadoop)&&(!ubuntu-us1)&&(!ubuntu-eu2) #3228

Posted by Apache Jenkins Server <je...@builds.apache.org>.
See <https://builds.apache.org/job/Mesos-Buildbot/BUILDTOOL=cmake,COMPILER=gcc,CONFIGURATION=--verbose%20--enable-libevent%20--enable-ssl,ENVIRONMENT=GLOG_v=1%20MESOS_VERBOSE=1,OS=ubuntu%3A14.04,label_exp=(docker%7C%7CHadoop)&&(!ubuntu-us1)&&(!ubuntu-eu2)/3228/changes>

Changes:

[mpark] Fixed non-Linux builds.

------------------------------------------
[...truncated 166785 lines...]
I0205 12:59:20.303367 27139 status_update_manager.cpp:177] Pausing sending status updates
I0205 12:59:20.303640 27140 state.cpp:60] Recovering state from '/tmp/Endpoint_SlaveEndpointTest_AuthorizedRequest_1_otHSkE/meta'
I0205 12:59:20.303845 27139 status_update_manager.cpp:203] Recovering status update manager
I0205 12:59:20.303969 27132 containerizer.cpp:599] Recovering containerizer
I0205 12:59:20.304623 27138 provisioner.cpp:410] Provisioner recovery complete
I0205 12:59:20.304934 27147 slave.cpp:5499] Finished recovery
I0205 12:59:20.305336 27147 slave.cpp:5673] Querying resource estimator for oversubscribable resources
I0205 12:59:20.305451 27140 slave.cpp:5687] Received oversubscribable resources {} from the resource estimator
I0205 12:59:20.306263 27139 process.cpp:3697] Handling HTTP event for process 'slave(691)' with path: '/slave(691)/monitor/statistics.json'
I0205 12:59:20.306746 27144 http.cpp:871] Authorizing principal 'test-principal' to GET the '/monitor/statistics.json' endpoint
I0205 12:59:20.308471 27134 slave.cpp:803] Agent terminating
[       OK ] Endpoint/SlaveEndpointTest.AuthorizedRequest/1 (12 ms)
[ RUN      ] Endpoint/SlaveEndpointTest.AuthorizedRequest/2
I0205 12:59:20.314234 27131 containerizer.cpp:220] Using isolation: posix/cpu,posix/mem,filesystem/posix,network/cni
W0205 12:59:20.314586 27131 backend.cpp:76] Failed to create 'aufs' backend: AufsBackend requires root privileges
W0205 12:59:20.314630 27131 backend.cpp:76] Failed to create 'bind' backend: BindBackend requires root privileges
I0205 12:59:20.314644 27131 provisioner.cpp:249] Using default backend 'copy'
I0205 12:59:20.315786 27140 slave.cpp:211] Mesos agent started on (692)@172.17.0.3:59268
I0205 12:59:20.315806 27140 slave.cpp:212] Flags at startup: --acls="" --appc_simple_discovery_uri_prefix="http://" --appc_store_dir="/tmp/mesos/store/appc" --authenticate_http_readonly="true" --authenticate_http_readwrite="true" --authenticatee="crammd5" --authentication_backoff_factor="1secs" --authorizer="local" --cgroups_cpu_enable_pids_and_tids_count="false" --cgroups_enable_cfs="false" --cgroups_hierarchy="/sys/fs/cgroup" --cgroups_limit_swap="false" --cgroups_root="mesos" --container_disk_watch_interval="15secs" --containerizers="mesos" --credential="/tmp/Endpoint_SlaveEndpointTest_AuthorizedRequest_2_t16v9x/credential" --default_role="*" --disk_watch_interval="1mins" --docker="docker" --docker_kill_orphans="true" --docker_registry="https://registry-1.docker.io" --docker_remove_delay="6hrs" --docker_socket="/var/run/docker.sock" --docker_stop_timeout="0ns" --docker_store_dir="/tmp/mesos/store/docker" --docker_volume_checkpoint_dir="/var/run/mesos/isolators/docker/volume" --enforce_container_disk_quota="false" --executor_registration_timeout="1mins" --executor_shutdown_grace_period="5secs" --fetcher_cache_dir="/tmp/Endpoint_SlaveEndpointTest_AuthorizedRequest_2_t16v9x/fetch" --fetcher_cache_size="2GB" --frameworks_home="" --gc_delay="1weeks" --gc_disk_headroom="0.1" --hadoop_home="" --help="false" --hostname_lookup="true" --http_authenticators="basic" --http_command_executor="false" --http_credentials="/tmp/Endpoint_SlaveEndpointTest_AuthorizedRequest_2_t16v9x/http_credentials" --http_heartbeat_interval="30secs" --initialize_driver_logging="true" --isolation="posix/cpu,posix/mem" --launcher="posix" --launcher_dir="/mesos/build/src" --logbufsecs="0" --logging_level="INFO" --max_completed_executors_per_framework="150" --oversubscribed_resources_interval="15secs" --perf_duration="10secs" --perf_interval="1mins" --qos_correction_interval_min="0ns" --quiet="false" --recover="reconnect" --recovery_timeout="15mins" --registration_backoff_factor="10ms" --resources="cpus:2;gpus:0;mem:1024;disk:1024;ports:[31000-32000]" --revocable_cpu_low_priority="true" --runtime_dir="/tmp/Endpoint_SlaveEndpointTest_AuthorizedRequest_2_t16v9x" --sandbox_directory="/mnt/mesos/sandbox" --strict="true" --switch_user="true" --systemd_enable_support="true" --systemd_runtime_directory="/run/systemd/system" --version="false" --work_dir="/tmp/Endpoint_SlaveEndpointTest_AuthorizedRequest_2_y0g5aY"
I0205 12:59:20.316241 27140 credentials.hpp:86] Loading credential for authentication from '/tmp/Endpoint_SlaveEndpointTest_AuthorizedRequest_2_t16v9x/credential'
I0205 12:59:20.316336 27140 slave.cpp:354] Agent using credential for: test-principal
I0205 12:59:20.316351 27140 credentials.hpp:37] Loading credentials for authentication from '/tmp/Endpoint_SlaveEndpointTest_AuthorizedRequest_2_t16v9x/http_credentials'
I0205 12:59:20.316459 27140 http.cpp:919] Using default 'basic' HTTP authenticator for realm 'mesos-agent-readonly'
I0205 12:59:20.316514 27140 http.cpp:919] Using default 'basic' HTTP authenticator for realm 'mesos-agent-readwrite'
I0205 12:59:20.317068 27140 slave.cpp:541] Agent resources: cpus(*):2; mem(*):1024; disk(*):1024; ports(*):[31000-32000]
I0205 12:59:20.317113 27140 slave.cpp:549] Agent attributes: [  ]
I0205 12:59:20.317121 27140 slave.cpp:554] Agent hostname: c5136f4a159b
I0205 12:59:20.317255 27141 status_update_manager.cpp:177] Pausing sending status updates
I0205 12:59:20.317487 27140 state.cpp:60] Recovering state from '/tmp/Endpoint_SlaveEndpointTest_AuthorizedRequest_2_y0g5aY/meta'
I0205 12:59:20.317677 27144 status_update_manager.cpp:203] Recovering status update manager
I0205 12:59:20.317859 27132 containerizer.cpp:599] Recovering containerizer
I0205 12:59:20.318531 27140 provisioner.cpp:410] Provisioner recovery complete
I0205 12:59:20.318763 27145 slave.cpp:5499] Finished recovery
I0205 12:59:20.319159 27145 slave.cpp:5673] Querying resource estimator for oversubscribable resources
I0205 12:59:20.319324 27136 slave.cpp:5687] Received oversubscribable resources {} from the resource estimator
I0205 12:59:20.320067 27134 process.cpp:3697] Handling HTTP event for process 'slave(692)' with path: '/slave(692)/containers'
I0205 12:59:20.320578 27138 http.cpp:871] Authorizing principal 'test-principal' to GET the '/containers' endpoint
I0205 12:59:20.322576 27142 slave.cpp:803] Agent terminating
[       OK ] Endpoint/SlaveEndpointTest.AuthorizedRequest/2 (14 ms)
[ RUN      ] Endpoint/SlaveEndpointTest.UnauthorizedRequest/0
I0205 12:59:20.328554 27131 containerizer.cpp:220] Using isolation: posix/cpu,posix/mem,filesystem/posix,network/cni
W0205 12:59:20.328912 27131 backend.cpp:76] Failed to create 'aufs' backend: AufsBackend requires root privileges
W0205 12:59:20.328955 27131 backend.cpp:76] Failed to create 'bind' backend: BindBackend requires root privileges
I0205 12:59:20.328969 27131 provisioner.cpp:249] Using default backend 'copy'
I0205 12:59:20.330294 27139 slave.cpp:211] Mesos agent started on (693)@172.17.0.3:59268
I0205 12:59:20.330312 27139 slave.cpp:212] Flags at startup: --acls="" --appc_simple_discovery_uri_prefix="http://" --appc_store_dir="/tmp/mesos/store/appc" --authenticate_http_readonly="true" --authenticate_http_readwrite="true" --authenticatee="crammd5" --authentication_backoff_factor="1secs" --authorizer="local" --cgroups_cpu_enable_pids_and_tids_count="false" --cgroups_enable_cfs="false" --cgroups_hierarchy="/sys/fs/cgroup" --cgroups_limit_swap="false" --cgroups_root="mesos" --container_disk_watch_interval="15secs" --containerizers="mesos" --credential="/tmp/Endpoint_SlaveEndpointTest_UnauthorizedRequest_0_3OpZaS/credential" --default_role="*" --disk_watch_interval="1mins" --docker="docker" --docker_kill_orphans="true" --docker_registry="https://registry-1.docker.io" --docker_remove_delay="6hrs" --docker_socket="/var/run/docker.sock" --docker_stop_timeout="0ns" --docker_store_dir="/tmp/mesos/store/docker" --docker_volume_checkpoint_dir="/var/run/mesos/isolators/docker/volume" --enforce_container_disk_quota="false" --executor_registration_timeout="1mins" --executor_shutdown_grace_period="5secs" --fetcher_cache_dir="/tmp/Endpoint_SlaveEndpointTest_UnauthorizedRequest_0_3OpZaS/fetch" --fetcher_cache_size="2GB" --frameworks_home="" --gc_delay="1weeks" --gc_disk_headroom="0.1" --hadoop_home="" --help="false" --hostname_lookup="true" --http_authenticators="basic" --http_command_executor="false" --http_credentials="/tmp/Endpoint_SlaveEndpointTest_UnauthorizedRequest_0_3OpZaS/http_credentials" --http_heartbeat_interval="30secs" --initialize_driver_logging="true" --isolation="posix/cpu,posix/mem" --launcher="posix" --launcher_dir="/mesos/build/src" --logbufsecs="0" --logging_level="INFO" --max_completed_executors_per_framework="150" --oversubscribed_resources_interval="15secs" --perf_duration="10secs" --perf_interval="1mins" --qos_correction_interval_min="0ns" --quiet="false" --recover="reconnect" --recovery_timeout="15mins" --registration_backoff_factor="10ms" --resources="cpus:2;gpus:0;mem:1024;disk:1024;ports:[31000-32000]" --revocable_cpu_low_priority="true" --runtime_dir="/tmp/Endpoint_SlaveEndpointTest_UnauthorizedRequest_0_3OpZaS" --sandbox_directory="/mnt/mesos/sandbox" --strict="true" --switch_user="true" --systemd_enable_support="true" --systemd_runtime_directory="/run/systemd/system" --version="false" --work_dir="/tmp/Endpoint_SlaveEndpointTest_UnauthorizedRequest_0_WAofai"
I0205 12:59:20.330771 27139 credentials.hpp:86] Loading credential for authentication from '/tmp/Endpoint_SlaveEndpointTest_UnauthorizedRequest_0_3OpZaS/credential'
I0205 12:59:20.330866 27139 slave.cpp:354] Agent using credential for: test-principal
I0205 12:59:20.330883 27139 credentials.hpp:37] Loading credentials for authentication from '/tmp/Endpoint_SlaveEndpointTest_UnauthorizedRequest_0_3OpZaS/http_credentials'
I0205 12:59:20.330993 27139 http.cpp:919] Using default 'basic' HTTP authenticator for realm 'mesos-agent-readonly'
I0205 12:59:20.331046 27139 http.cpp:919] Using default 'basic' HTTP authenticator for realm 'mesos-agent-readwrite'
I0205 12:59:20.331492 27139 slave.cpp:541] Agent resources: cpus(*):2; mem(*):1024; disk(*):1024; ports(*):[31000-32000]
I0205 12:59:20.331537 27139 slave.cpp:549] Agent attributes: [  ]
I0205 12:59:20.331547 27139 slave.cpp:554] Agent hostname: c5136f4a159b
I0205 12:59:20.331702 27134 status_update_manager.cpp:177] Pausing sending status updates
I0205 12:59:20.331943 27139 state.cpp:60] Recovering state from '/tmp/Endpoint_SlaveEndpointTest_UnauthorizedRequest_0_WAofai/meta'
I0205 12:59:20.332233 27135 status_update_manager.cpp:203] Recovering status update manager
I0205 12:59:20.332335 27139 containerizer.cpp:599] Recovering containerizer
I0205 12:59:20.333171 27135 provisioner.cpp:410] Provisioner recovery complete
I0205 12:59:20.333459 27135 slave.cpp:5499] Finished recovery
I0205 12:59:20.333837 27135 slave.cpp:5673] Querying resource estimator for oversubscribable resources
I0205 12:59:20.334007 27138 slave.cpp:5687] Received oversubscribable resources {} from the resource estimator
I0205 12:59:20.334769 27141 process.cpp:3697] Handling HTTP event for process 'slave(693)' with path: '/slave(693)/monitor/statistics'
I0205 12:59:20.335252 27144 http.cpp:871] Authorizing principal 'test-principal' to GET the '/monitor/statistics' endpoint
I0205 12:59:20.336781 27147 slave.cpp:803] Agent terminating
[       OK ] Endpoint/SlaveEndpointTest.UnauthorizedRequest/0 (13 ms)
[ RUN      ] Endpoint/SlaveEndpointTest.UnauthorizedRequest/1
I0205 12:59:20.342489 27131 containerizer.cpp:220] Using isolation: posix/cpu,posix/mem,filesystem/posix,network/cni
W0205 12:59:20.342845 27131 backend.cpp:76] Failed to create 'aufs' backend: AufsBackend requires root privileges
W0205 12:59:20.342888 27131 backend.cpp:76] Failed to create 'bind' backend: BindBackend requires root privileges
I0205 12:59:20.342905 27131 provisioner.cpp:249] Using default backend 'copy'
I0205 12:59:20.344038 27136 slave.cpp:211] Mesos agent started on (694)@172.17.0.3:59268
I0205 12:59:20.344063 27136 slave.cpp:212] Flags at startup: --acls="" --appc_simple_discovery_uri_prefix="http://" --appc_store_dir="/tmp/mesos/store/appc" --authenticate_http_readonly="true" --authenticate_http_readwrite="true" --authenticatee="crammd5" --authentication_backoff_factor="1secs" --authorizer="local" --cgroups_cpu_enable_pids_and_tids_count="false" --cgroups_enable_cfs="false" --cgroups_hierarchy="/sys/fs/cgroup" --cgroups_limit_swap="false" --cgroups_root="mesos" --container_disk_watch_interval="15secs" --containerizers="mesos" --credential="/tmp/Endpoint_SlaveEndpointTest_UnauthorizedRequest_1_FjTElc/credential" --default_role="*" --disk_watch_interval="1mins" --docker="docker" --docker_kill_orphans="true" --docker_registry="https://registry-1.docker.io" --docker_remove_delay="6hrs" --docker_socket="/var/run/docker.sock" --docker_stop_timeout="0ns" --docker_store_dir="/tmp/mesos/store/docker" --docker_volume_checkpoint_dir="/var/run/mesos/isolators/docker/volume" --enforce_container_disk_quota="false" --executor_registration_timeout="1mins" --executor_shutdown_grace_period="5secs" --fetcher_cache_dir="/tmp/Endpoint_SlaveEndpointTest_UnauthorizedRequest_1_FjTElc/fetch" --fetcher_cache_size="2GB" --frameworks_home="" --gc_delay="1weeks" --gc_disk_headroom="0.1" --hadoop_home="" --help="false" --hostname_lookup="true" --http_authenticators="basic" --http_command_executor="false" --http_credentials="/tmp/Endpoint_SlaveEndpointTest_UnauthorizedRequest_1_FjTElc/http_credentials" --http_heartbeat_interval="30secs" --initialize_driver_logging="true" --isolation="posix/cpu,posix/mem" --launcher="posix" --launcher_dir="/mesos/build/src" --logbufsecs="0" --logging_level="INFO" --max_completed_executors_per_framework="150" --oversubscribed_resources_interval="15secs" --perf_duration="10secs" --perf_interval="1mins" --qos_correction_interval_min="0ns" --quiet="false" --recover="reconnect" --recovery_timeout="15mins" --registration_backoff_factor="10ms" --resources="cpus:2;gpus:0;mem:1024;disk:1024;ports:[31000-32000]" --revocable_cpu_low_priority="true" --runtime_dir="/tmp/Endpoint_SlaveEndpointTest_UnauthorizedRequest_1_FjTElc" --sandbox_directory="/mnt/mesos/sandbox" --strict="true" --switch_user="true" --systemd_enable_support="true" --systemd_runtime_directory="/run/systemd/system" --version="false" --work_dir="/tmp/Endpoint_SlaveEndpointTest_UnauthorizedRequest_1_gKTDiC"
I0205 12:59:20.344534 27136 credentials.hpp:86] Loading credential for authentication from '/tmp/Endpoint_SlaveEndpointTest_UnauthorizedRequest_1_FjTElc/credential'
I0205 12:59:20.344635 27136 slave.cpp:354] Agent using credential for: test-principal
I0205 12:59:20.344678 27136 credentials.hpp:37] Loading credentials for authentication from '/tmp/Endpoint_SlaveEndpointTest_UnauthorizedRequest_1_FjTElc/http_credentials'
I0205 12:59:20.344835 27136 http.cpp:919] Using default 'basic' HTTP authenticator for realm 'mesos-agent-readonly'
I0205 12:59:20.344894 27136 http.cpp:919] Using default 'basic' HTTP authenticator for realm 'mesos-agent-readwrite'
I0205 12:59:20.345412 27136 slave.cpp:541] Agent resources: cpus(*):2; mem(*):1024; disk(*):1024; ports(*):[31000-32000]
I0205 12:59:20.345458 27136 slave.cpp:549] Agent attributes: [  ]
I0205 12:59:20.345471 27136 slave.cpp:554] Agent hostname: c5136f4a159b
I0205 12:59:20.345590 27133 status_update_manager.cpp:177] Pausing sending status updates
I0205 12:59:20.345919 27142 state.cpp:60] Recovering state from '/tmp/Endpoint_SlaveEndpointTest_UnauthorizedRequest_1_gKTDiC/meta'
I0205 12:59:20.346117 27147 status_update_manager.cpp:203] Recovering status update manager
I0205 12:59:20.346277 27137 containerizer.cpp:599] Recovering containerizer
I0205 12:59:20.346855 27133 provisioner.cpp:410] Provisioner recovery complete
I0205 12:59:20.347210 27138 slave.cpp:5499] Finished recovery
I0205 12:59:20.347653 27138 slave.cpp:5673] Querying resource estimator for oversubscribable resources
I0205 12:59:20.347770 27146 slave.cpp:5687] Received oversubscribable resources {} from the resource estimator
I0205 12:59:20.348534 27134 process.cpp:3697] Handling HTTP event for process 'slave(694)' with path: '/slave(694)/monitor/statistics.json'
I0205 12:59:20.349097 27134 http.cpp:871] Authorizing principal 'test-principal' to GET the '/monitor/statistics.json' endpoint
I0205 12:59:20.350417 27145 slave.cpp:803] Agent terminating
[       OK ] Endpoint/SlaveEndpointTest.UnauthorizedRequest/1 (13 ms)
[ RUN      ] Endpoint/SlaveEndpointTest.UnauthorizedRequest/2
I0205 12:59:20.356046 27131 containerizer.cpp:220] Using isolation: posix/cpu,posix/mem,filesystem/posix,network/cni
W0205 12:59:20.356381 27131 backend.cpp:76] Failed to create 'aufs' backend: AufsBackend requires root privileges
W0205 12:59:20.356432 27131 backend.cpp:76] Failed to create 'bind' backend: BindBackend requires root privileges
I0205 12:59:20.356454 27131 provisioner.cpp:249] Using default backend 'copy'
I0205 12:59:20.357939 27143 slave.cpp:211] Mesos agent started on (695)@172.17.0.3:59268
I0205 12:59:20.357964 27143 slave.cpp:212] Flags at startup: --acls="" --appc_simple_discovery_uri_prefix="http://" --appc_store_dir="/tmp/mesos/store/appc" --authenticate_http_readonly="true" --authenticate_http_readwrite="true" --authenticatee="crammd5" --authentication_backoff_factor="1secs" --authorizer="local" --cgroups_cpu_enable_pids_and_tids_count="false" --cgroups_enable_cfs="false" --cgroups_hierarchy="/sys/fs/cgroup" --cgroups_limit_swap="false" --cgroups_root="mesos" --container_disk_watch_interval="15secs" --containerizers="mesos" --credential="/tmp/Endpoint_SlaveEndpointTest_UnauthorizedRequest_2_ny9cFw/credential" --default_role="*" --disk_watch_interval="1mins" --docker="docker" --docker_kill_orphans="true" --docker_registry="https://registry-1.docker.io" --docker_remove_delay="6hrs" --docker_socket="/var/run/docker.sock" --docker_stop_timeout="0ns" --docker_store_dir="/tmp/mesos/store/docker" --docker_volume_checkpoint_dir="/var/run/mesos/isolators/docker/volume" --enforce_container_disk_quota="false" --executor_registration_timeout="1mins" --executor_shutdown_grace_period="5secs" --fetcher_cache_dir="/tmp/Endpoint_SlaveEndpointTest_UnauthorizedRequest_2_ny9cFw/fetch" --fetcher_cache_size="2GB" --frameworks_home="" --gc_delay="1weeks" --gc_disk_headroom="0.1" --hadoop_home="" --help="false" --hostname_lookup="true" --http_authenticators="basic" --http_command_executor="false" --http_credentials="/tmp/Endpoint_SlaveEndpointTest_UnauthorizedRequest_2_ny9cFw/http_credentials" --http_heartbeat_interval="30secs" --initialize_driver_logging="true" --isolation="posix/cpu,posix/mem" --launcher="posix" --launcher_dir="/mesos/build/src" --logbufsecs="0" --logging_level="INFO" --max_completed_executors_per_framework="150" --oversubscribed_resources_interval="15secs" --perf_duration="10secs" --perf_interval="1mins" --qos_correction_interval_min="0ns" --quiet="false" --recover="reconnect" --recovery_timeout="15mins" --registration_backoff_factor="10ms" --resources="cpus:2;gpus:0;mem:1024;disk:1024;ports:[31000-32000]" --revocable_cpu_low_priority="true" --runtime_dir="/tmp/Endpoint_SlaveEndpointTest_UnauthorizedRequest_2_ny9cFw" --sandbox_directory="/mnt/mesos/sandbox" --strict="true" --switch_user="true" --systemd_enable_support="true" --systemd_runtime_directory="/run/systemd/system" --version="false" --work_dir="/tmp/Endpoint_SlaveEndpointTest_UnauthorizedRequest_2_Yb4YzW"
I0205 12:59:20.358484 27143 credentials.hpp:86] Loading credential for authentication from '/tmp/Endpoint_SlaveEndpointTest_UnauthorizedRequest_2_ny9cFw/credential'
I0205 12:59:20.358602 27143 slave.cpp:354] Agent using credential for: test-principal
I0205 12:59:20.358624 27143 credentials.hpp:37] Loading credentials for authentication from '/tmp/Endpoint_SlaveEndpointTest_UnauthorizedRequest_2_ny9cFw/http_credentials'
I0205 12:59:20.358747 27143 http.cpp:919] Using default 'basic' HTTP authenticator for realm 'mesos-agent-readonly'
I0205 12:59:20.358795 27143 http.cpp:919] Using default 'basic' HTTP authenticator for realm 'mesos-agent-readwrite'
I0205 12:59:20.359267 27143 slave.cpp:541] Agent resources: cpus(*):2; mem(*):1024; disk(*):1024; ports(*):[31000-32000]
I0205 12:59:20.359310 27143 slave.cpp:549] Agent attributes: [  ]
I0205 12:59:20.359318 27143 slave.cpp:554] Agent hostname: c5136f4a159b
I0205 12:59:20.359462 27133 status_update_manager.cpp:177] Pausing sending status updates
I0205 12:59:20.359685 27143 state.cpp:60] Recovering state from '/tmp/Endpoint_SlaveEndpointTest_UnauthorizedRequest_2_Yb4YzW/meta'
I0205 12:59:20.360019 27136 status_update_manager.cpp:203] Recovering status update manager
I0205 12:59:20.360152 27147 containerizer.cpp:599] Recovering containerizer
I0205 12:59:20.360684 27143 provisioner.cpp:410] Provisioner recovery complete
I0205 12:59:20.360836 27141 slave.cpp:5499] Finished recovery
I0205 12:59:20.361284 27141 slave.cpp:5673] Querying resource estimator for oversubscribable resources
I0205 12:59:20.361414 27145 slave.cpp:5687] Received oversubscribable resources {} from the resource estimator
I0205 12:59:20.362145 27144 process.cpp:3697] Handling HTTP event for process 'slave(695)' with path: '/slave(695)/containers'
I0205 12:59:20.362633 27133 http.cpp:871] Authorizing principal 'test-principal' to GET the '/containers' endpoint
I0205 12:59:20.363803 27137 slave.cpp:803] Agent terminating
[       OK ] Endpoint/SlaveEndpointTest.UnauthorizedRequest/2 (13 ms)
[ RUN      ] Endpoint/SlaveEndpointTest.NoAuthorizer/0
I0205 12:59:20.369351 27131 containerizer.cpp:220] Using isolation: posix/cpu,posix/mem,filesystem/posix,network/cni
W0205 12:59:20.369716 27131 backend.cpp:76] Failed to create 'aufs' backend: AufsBackend requires root privileges
W0205 12:59:20.369760 27131 backend.cpp:76] Failed to create 'bind' backend: BindBackend requires root privileges
I0205 12:59:20.369783 27131 provisioner.cpp:249] Using default backend 'copy'
I0205 12:59:20.370415 27131 cluster.cpp:446] Creating default 'local' authorizer
I0205 12:59:20.371031 27147 slave.cpp:211] Mesos agent started on (696)@172.17.0.3:59268
I0205 12:59:20.371052 27147 slave.cpp:212] Flags at startup: --acls="" --appc_simple_discovery_uri_prefix="http://" --appc_store_dir="/tmp/mesos/store/appc" --authenticate_http_readonly="true" --authenticate_http_readwrite="true" --authenticatee="crammd5" --authentication_backoff_factor="1secs" --authorizer="local" --cgroups_cpu_enable_pids_and_tids_count="false" --cgroups_enable_cfs="false" --cgroups_hierarchy="/sys/fs/cgroup" --cgroups_limit_swap="false" --cgroups_root="mesos" --container_disk_watch_interval="15secs" --containerizers="mesos" --credential="/tmp/Endpoint_SlaveEndpointTest_NoAuthorizer_0_jdnn7Q/credential" --default_role="*" --disk_watch_interval="1mins" --docker="docker" --docker_kill_orphans="true" --docker_registry="https://registry-1.docker.io" --docker_remove_delay="6hrs" --docker_socket="/var/run/docker.sock" --docker_stop_timeout="0ns" --docker_store_dir="/tmp/mesos/store/docker" --docker_volume_checkpoint_dir="/var/run/mesos/isolators/docker/volume" --enforce_container_disk_quota="false" --executor_registration_timeout="1mins" --executor_shutdown_grace_period="5secs" --fetcher_cache_dir="/tmp/Endpoint_SlaveEndpointTest_NoAuthorizer_0_jdnn7Q/fetch" --fetcher_cache_size="2GB" --frameworks_home="" --gc_delay="1weeks" --gc_disk_headroom="0.1" --hadoop_home="" --help="false" --hostname_lookup="true" --http_authenticators="basic" --http_command_executor="false" --http_credentials="/tmp/Endpoint_SlaveEndpointTest_NoAuthorizer_0_jdnn7Q/http_credentials" --http_heartbeat_interval="30secs" --initialize_driver_logging="true" --isolation="posix/cpu,posix/mem" --launcher="posix" --launcher_dir="/mesos/build/src" --logbufsecs="0" --logging_level="INFO" --max_completed_executors_per_framework="150" --oversubscribed_resources_interval="15secs" --perf_duration="10secs" --perf_interval="1mins" --qos_correction_interval_min="0ns" --quiet="false" --recover="reconnect" --recovery_timeout="15mins" --registration_backoff_factor="10ms" --resources="cpus:2;gpus:0;mem:1024;disk:1024;ports:[31000-32000]" --revocable_cpu_low_priority="true" --runtime_dir="/tmp/Endpoint_SlaveEndpointTest_NoAuthorizer_0_jdnn7Q" --sandbox_directory="/mnt/mesos/sandbox" --strict="true" --switch_user="true" --systemd_enable_support="true" --systemd_runtime_directory="/run/systemd/system" --version="false" --work_dir="/tmp/Endpoint_SlaveEndpointTest_NoAuthorizer_0_8Lc1Zg"
I0205 12:59:20.371472 27147 credentials.hpp:86] Loading credential for authentication from '/tmp/Endpoint_SlaveEndpointTest_NoAuthorizer_0_jdnn7Q/credential'
I0205 12:59:20.371567 27147 slave.cpp:354] Agent using credential for: test-principal
I0205 12:59:20.371584 27147 credentials.hpp:37] Loading credentials for authentication from '/tmp/Endpoint_SlaveEndpointTest_NoAuthorizer_0_jdnn7Q/http_credentials'
I0205 12:59:20.371695 27147 http.cpp:919] Using default 'basic' HTTP authenticator for realm 'mesos-agent-readonly'
I0205 12:59:20.371744 27147 http.cpp:919] Using default 'basic' HTTP authenticator for realm 'mesos-agent-readwrite'
I0205 12:59:20.372287 27147 slave.cpp:541] Agent resources: cpus(*):2; mem(*):1024; disk(*):1024; ports(*):[31000-32000]
I0205 12:59:20.372334 27147 slave.cpp:549] Agent attributes: [  ]
I0205 12:59:20.372344 27147 slave.cpp:554] Agent hostname: c5136f4a159b
I0205 12:59:20.372447 27141 status_update_manager.cpp:177] Pausing sending status updates
I0205 12:59:20.372786 27143 state.cpp:60] Recovering state from '/tmp/Endpoint_SlaveEndpointTest_NoAuthorizer_0_8Lc1Zg/meta'
I0205 12:59:20.372957 27141 status_update_manager.cpp:203] Recovering status update manager
I0205 12:59:20.373105 27138 containerizer.cpp:599] Recovering containerizer
I0205 12:59:20.373695 27140 provisioner.cpp:410] Provisioner recovery complete
I0205 12:59:20.373868 27141 slave.cpp:5499] Finished recovery
I0205 12:59:20.374297 27141 slave.cpp:5673] Querying resource estimator for oversubscribable resources
I0205 12:59:20.374411 27133 slave.cpp:5687] Received oversubscribable resources {} from the resource estimator
I0205 12:59:20.375072 27134 process.cpp:3697] Handling HTTP event for process 'slave(696)' with path: '/slave(696)/monitor/statistics'
I0205 12:59:20.375509 27143 http.cpp:871] Authorizing principal 'test-principal' to GET the '/monitor/statistics' endpoint
I0205 12:59:20.377095 27133 slave.cpp:803] Agent terminating
[       OK ] Endpoint/SlaveEndpointTest.NoAuthorizer/0 (14 ms)
[ RUN      ] Endpoint/SlaveEndpointTest.NoAuthorizer/1
I0205 12:59:20.383013 27131 containerizer.cpp:220] Using isolation: posix/cpu,posix/mem,filesystem/posix,network/cni
W0205 12:59:20.383338 27131 backend.cpp:76] Failed to create 'aufs' backend: AufsBackend requires root privileges
W0205 12:59:20.383381 27131 backend.cpp:76] Failed to create 'bind' backend: BindBackend requires root privileges
I0205 12:59:20.383394 27131 provisioner.cpp:249] Using default backend 'copy'
I0205 12:59:20.383865 27131 cluster.cpp:446] Creating default 'local' authorizer
I0205 12:59:20.384361 27143 slave.cpp:211] Mesos agent started on (697)@172.17.0.3:59268
I0205 12:59:20.384380 27143 slave.cpp:212] Flags at startup: --acls="" --appc_simple_discovery_uri_prefix="http://" --appc_store_dir="/tmp/mesos/store/appc" --authenticate_http_readonly="true" --authenticate_http_readwrite="true" --authenticatee="crammd5" --authentication_backoff_factor="1secs" --authorizer="local" --cgroups_cpu_enable_pids_and_tids_count="false" --cgroups_enable_cfs="false" --cgroups_hierarchy="/sys/fs/cgroup" --cgroups_limit_swap="false" --cgroups_root="mesos" --container_disk_watch_interval="15secs" --containerizers="mesos" --credential="/tmp/Endpoint_SlaveEndpointTest_NoAuthorizer_1_z8BkIb/credential" --default_role="*" --disk_watch_interval="1mins" --docker="docker" --docker_kill_orphans="true" --docker_registry="https://registry-1.docker.io" --docker_remove_delay="6hrs" --docker_socket="/var/run/docker.sock" --docker_stop_timeout="0ns" --docker_store_dir="/tmp/mesos/store/docker" --docker_volume_checkpoint_dir="/var/run/mesos/isolators/docker/volume" --enforce_container_disk_quota="false" --executor_registration_timeout="1mins" --executor_shutdown_grace_period="5secs" --fetcher_cache_dir="/tmp/Endpoint_SlaveEndpointTest_NoAuthorizer_1_z8BkIb/fetch" --fetcher_cache_size="2GB" --frameworks_home="" --gc_delay="1weeks" --gc_disk_headroom="0.1" --hadoop_home="" --help="false" --hostname_lookup="true" --http_authenticators="basic" --http_command_executor="false" --http_credentials="/tmp/Endpoint_SlaveEndpointTest_NoAuthorizer_1_z8BkIb/http_credentials" --http_heartbeat_interval="30secs" --initialize_driver_logging="true" --isolation="posix/cpu,posix/mem" --launcher="posix" --launcher_dir="/mesos/build/src" --logbufsecs="0" --logging_level="INFO" --max_completed_executors_per_framework="150" --oversubscribed_resources_interval="15secs" --perf_duration="10secs" --perf_interval="1mins" --qos_correction_interval_min="0ns" --quiet="false" --recover="reconnect" --recovery_timeout="15mins" --registration_backoff_factor="10ms" --resources="cpus:2;gpus:0;mem:1024;disk:1024;ports:[31000-32000]" --revocable_cpu_low_priority="true" --runtime_dir="/tmp/Endpoint_SlaveEndpointTest_NoAuthorizer_1_z8BkIb" --sandbox_directory="/mnt/mesos/sandbox" --strict="true" --switch_user="true" --systemd_enable_support="true" --systemd_runtime_directory="/run/systemd/system" --version="false" --work_dir="/tmp/Endpoint_SlaveEndpointTest_NoAuthorizer_1_6ymKyB"
I0205 12:59:20.384809 27143 credentials.hpp:86] Loading credential for authentication from '/tmp/Endpoint_SlaveEndpointTest_NoAuthorizer_1_z8BkIb/credential'
I0205 12:59:20.384904 27143 slave.cpp:354] Agent using credential for: test-principal
I0205 12:59:20.384920 27143 credentials.hpp:37] Loading credentials for authentication from '/tmp/Endpoint_SlaveEndpointTest_NoAuthorizer_1_z8BkIb/http_credentials'
I0205 12:59:20.385031 27143 http.cpp:919] Using default 'basic' HTTP authenticator for realm 'mesos-agent-readonly'
I0205 12:59:20.385094 27143 http.cpp:919] Using default 'basic' HTTP authenticator for realm 'mesos-agent-readwrite'
I0205 12:59:20.385510 27143 slave.cpp:541] Agent resources: cpus(*):2; mem(*):1024; disk(*):1024; ports(*):[31000-32000]
I0205 12:59:20.385555 27143 slave.cpp:549] Agent attributes: [  ]
I0205 12:59:20.385567 27143 slave.cpp:554] Agent hostname: c5136f4a159b
I0205 12:59:20.385675 27146 status_update_manager.cpp:177] Pausing sending status updates
I0205 12:59:20.386060 27145 state.cpp:60] Recovering state from '/tmp/Endpoint_SlaveEndpointTest_NoAuthorizer_1_6ymKyB/meta'
I0205 12:59:20.386234 27139 status_update_manager.cpp:203] Recovering status update manager
I0205 12:59:20.386387 27138 containerizer.cpp:599] Recovering containerizer
I0205 12:59:20.386991 27145 provisioner.cpp:410] Provisioner recovery complete
I0205 12:59:20.387245 27145 slave.cpp:5499] Finished recovery
I0205 12:59:20.387645 27145 slave.cpp:5673] Querying resource estimator for oversubscribable resources
I0205 12:59:20.387787 27137 slave.cpp:5687] Received oversubscribable resources {} from the resource estimator
I0205 12:59:20.388485 27138 process.cpp:3697] Handling HTTP event for process 'slave(697)' with path: '/slave(697)/monitor/statistics.json'
I0205 12:59:20.388968 27137 http.cpp:871] Authorizing principal 'test-principal' to GET the '/monitor/statistics.json' endpoint
I0205 12:59:20.390287 27136 slave.cpp:803] Agent terminating
[       OK ] Endpoint/SlaveEndpointTest.NoAuthorizer/1 (12 ms)
[ RUN      ] Endpoint/SlaveEndpointTest.NoAuthorizer/2
I0205 12:59:20.395747 27131 containerizer.cpp:220] Using isolation: posix/cpu,posix/mem,filesystem/posix,network/cni
W0205 12:59:20.396082 27131 backend.cpp:76] Failed to create 'aufs' backend: AufsBackend requires root privileges
W0205 12:59:20.396126 27131 backend.cpp:76] Failed to create 'bind' backend: BindBackend requires root privileges
I0205 12:59:20.396139 27131 provisioner.cpp:249] Using default backend 'copy'
I0205 12:59:20.396775 27131 cluster.cpp:446] Creating default 'local' authorizer
I0205 12:59:20.397315 27147 slave.cpp:211] Mesos agent started on (698)@172.17.0.3:59268
I0205 12:59:20.397361 27147 slave.cpp:212] Flags at startup: --acls="" --appc_simple_discovery_uri_prefix="http://" --appc_store_dir="/tmp/mesos/store/appc" --authenticate_http_readonly="true" --authenticate_http_readwrite="true" --authenticatee="crammd5" --authentication_backoff_factor="1secs" --authorizer="local" --cgroups_cpu_enable_pids_and_tids_count="false" --cgroups_enable_cfs="false" --cgroups_hierarchy="/sys/fs/cgroup" --cgroups_limit_swap="false" --cgroups_root="mesos" --container_disk_watch_interval="15secs" --containerizers="mesos" --credential="/tmp/Endpoint_SlaveEndpointTest_NoAuthorizer_2_hSpErw/credential" --default_role="*" --disk_watch_interval="1mins" --docker="docker" --docker_kill_orphans="true" --docker_registry="https://registry-1.docker.io" --docker_remove_delay="6hrs" --docker_socket="/var/run/docker.sock" --docker_stop_timeout="0ns" --docker_store_dir="/tmp/mesos/store/docker" --docker_volume_checkpoint_dir="/var/run/mesos/isolators/docker/volume" --enforce_container_disk_quota="false" --executor_registration_timeout="1mins" --executor_shutdown_grace_period="5secs" --fetcher_cache_dir="/tmp/Endpoint_SlaveEndpointTest_NoAuthorizer_2_hSpErw/fetch" --fetcher_cache_size="2GB" --frameworks_home="" --gc_delay="1weeks" --gc_disk_headroom="0.1" --hadoop_home="" --help="false" --hostname_lookup="true" --http_authenticators="basic" --http_command_executor="false" --http_credentials="/tmp/Endpoint_SlaveEndpointTest_NoAuthorizer_2_hSpErw/http_credentials" --http_heartbeat_interval="30secs" --initialize_driver_logging="true" --isolation="posix/cpu,posix/mem" --launcher="posix" --launcher_dir="/mesos/build/src" --logbufsecs="0" --logging_level="INFO" --max_completed_executors_per_framework="150" --oversubscribed_resources_interval="15secs" --perf_duration="10secs" --perf_interval="1mins" --qos_correction_interval_min="0ns" --quiet="false" --recover="reconnect" --recovery_timeout="15mins" --registration_backoff_factor="10ms" --resources="cpus:2;gpus:0;mem:1024;disk:1024;ports:[31000-32000]" --revocable_cpu_low_priority="true" --runtime_dir="/tmp/Endpoint_SlaveEndpointTest_NoAuthorizer_2_hSpErw" --sandbox_directory="/mnt/mesos/sandbox" --strict="true" --switch_user="true" --systemd_enable_support="true" --systemd_runtime_directory="/run/systemd/system" --version="false" --work_dir="/tmp/Endpoint_SlaveEndpointTest_NoAuthorizer_2_Ky9ZfW"
I0205 12:59:20.397891 27147 credentials.hpp:86] Loading credential for authentication from '/tmp/Endpoint_SlaveEndpointTest_NoAuthorizer_2_hSpErw/credential'
I0205 12:59:20.398005 27147 slave.cpp:354] Agent using credential for: test-principal
I0205 12:59:20.398021 27147 credentials.hpp:37] Loading credentials for authentication from '/tmp/Endpoint_SlaveEndpointTest_NoAuthorizer_2_hSpErw/http_credentials'
I0205 12:59:20.398133 27147 http.cpp:919] Using default 'basic' HTTP authenticator for realm 'mesos-agent-readonly'
I0205 12:59:20.398183 27147 http.cpp:919] Using default 'basic' HTTP authenticator for realm 'mesos-agent-readwrite'
I0205 12:59:20.398663 27147 slave.cpp:541] Agent resources: cpus(*):2; mem(*):1024; disk(*):1024; ports(*):[31000-32000]
I0205 12:59:20.398710 27147 slave.cpp:549] Agent attributes: [  ]
I0205 12:59:20.398722 27147 slave.cpp:554] Agent hostname: c5136f4a159b
I0205 12:59:20.398809 27144 status_update_manager.cpp:177] Pausing sending status updates
I0205 12:59:20.399091 27147 state.cpp:60] Recovering state from '/tmp/Endpoint_SlaveEndpointTest_NoAuthorizer_2_Ky9ZfW/meta'
I0205 12:59:20.399245 27134 status_update_manager.cpp:203] Recovering status update manager
I0205 12:59:20.399519 27133 containerizer.cpp:599] Recovering containerizer
I0205 12:59:20.400346 27134 provisioner.cpp:410] Provisioner recovery complete
I0205 12:59:20.400535 27132 slave.cpp:5499] Finished recovery
I0205 12:59:20.401015 27132 slave.cpp:5673] Querying resource estimator for oversubscribable resources
I0205 12:59:20.401129 27132 slave.cpp:5687] Received oversubscribable resources {} from the resource estimator
I0205 12:59:20.401866 27143 process.cpp:3697] Handling HTTP event for process 'slave(698)' with path: '/slave(698)/containers'
I0205 12:59:20.402403 27132 http.cpp:871] Authorizing principal 'test-principal' to GET the '/containers' endpoint
I0205 12:59:20.404011 27142 slave.cpp:803] Agent terminating
[       OK ] Endpoint/SlaveEndpointTest.NoAuthorizer/2 (14 ms)
[----------] 9 tests from Endpoint/SlaveEndpointTest (118 ms total)

[----------] Global test environment tear-down
[==========] 1434 tests from 160 test cases ran. (249897 ms total)
[  PASSED  ] 1433 tests.
[  FAILED  ] 1 test, listed below:
[  FAILED  ] MasterTest.KillUnknownTask

 1 FAILED TEST
  YOU HAVE 11 DISABLED TESTS

make[3]: *** [CMakeFiles/check] Error 1
make[3]: Leaving directory `/mesos/build'
make[2]: Leaving directory `/mesos/build'
make[2]: *** [CMakeFiles/check.dir/all] Error 2
make[1]: *** [CMakeFiles/check.dir/rule] Error 2
make[1]: Leaving directory `/mesos/build'
make: *** [check] Error 2
+ docker rmi mesos-1486296574-27492
Untagged: mesos-1486296574-27492:latest
Deleted: sha256:588c6c88c29b55896885b90f70152b087cb24f983ecca1a084ac589e41b5768e
Deleted: sha256:579913b8102ce76fc440e6f162b2d31b19a62ab69c73f19fe10ee7c90c4ef6d4
Deleted: sha256:c3e193cede99189cc1d2f62c78b9f5880ae5c8b694a5ab83c000468e52fa1406
Deleted: sha256:f4a3b65e6547bdd1f4eea7cccb49dd0a70ed7f4920a445e1222f51726dddbaf8
Deleted: sha256:acc35a7749d7acbff92c9b490c8541ca14064dc8aca0f93f20c9e382ae325c18
Deleted: sha256:62f40969f9adfbd44e34d00122215876085d7bb82c6cc42a6081caa0746110ee
Deleted: sha256:42dc937c1d4d8e0e83b9d99435cd57f67db4863d24ec477b7441f44af719a639
Deleted: sha256:3645af798eab40c7abcd0ebd44b452907b502586a844ffb2e1783a60eb795aa2
Deleted: sha256:f551bc560d59225bcfd31c753081f1953751588a7583446f62ba05aa346c4d14
Deleted: sha256:d409d83e1932b00039a59574b8800e4d66e906b8c2aa54a0ac07fb3878a55c76
Deleted: sha256:3d1b72a2b434de190d1f4629e41f8405af8c289cc3c7beea33b9b25b5dc18ae3
Deleted: sha256:a2581a9bc34b17072c04e24716dfc44bea0225d3ee5707749a33fafd2bea5ee3
Deleted: sha256:4c09dfe8e94f470b02db71d5757d792c671ab9d24c6a43700b6cd8c8d126016c
Deleted: sha256:067c9fb03c1e6ada4175e950bde657dd8d6b4a46340cfc9b1db8bffbc5464a4b
Deleted: sha256:d193fb243f082ec4ee7cfa1586b4a7aa60ded5827ef48857d8cf2059230689b5
Deleted: sha256:2bd5db997d34276d650e6353993e6cb5776242ab8b3fd8bb15a2bec5b0461a70
Deleted: sha256:692ed9102c6421c7e6fece9aae81db6e00a4bb9da313e5a44b9afa18fb80a94e
Deleted: sha256:694b6a02b27ed12ae3620b75a7a5d23ca088012fa8be15e6ff3322e7fde7b96c
Deleted: sha256:b3447ce133b66fe9982d83a164d36b45ef29433f43d01e80f2fe9d7858a19f7b
Deleted: sha256:378e1d9e87143d9928f9a03f7444347d174f7bceed9d856eb9ec74f2f6474b7f
Deleted: sha256:d55373abe9243335d3c4132328ca7fe4f1d43f91090b5e0c0d97feb4b7159794
Deleted: sha256:fb7fe656ddb70a10f8aa2eba7d949ac200c90f93b50d2426e89201c129185991
Deleted: sha256:05244aec338a046f1ee46b97900ce23ecbebdc597d8cf6423bc82b75674a54fa
Deleted: sha256:ba44c863fc6c1c6396f647a4e67e1b3c84e9ec80b120b10c0fb9f0145c9426f1
Build step 'Execute shell' marked build as failure