You are viewing a plain text version of this content. The canonical link for it is here.
Posted to dev@lucene.apache.org by Policeman Jenkins Server <je...@thetaphi.de> on 2019/06/05 02:48:29 UTC

[JENKINS-EA] Lucene-Solr-8.x-Linux (64bit/jdk-13-ea+18) - Build # 663 - Still Failing!

Build: https://jenkins.thetaphi.de/job/Lucene-Solr-8.x-Linux/663/
Java: 64bit/jdk-13-ea+18 -XX:+UseCompressedOops -XX:+UseParallelGC

All tests passed

Build Log:
[...truncated 12070 lines...]
    [javac] Compiling 1277 source files to /home/jenkins/workspace/Lucene-Solr-8.x-Linux/solr/build/solr-core/classes/java
    [javac] /home/jenkins/workspace/Lucene-Solr-8.x-Linux/solr/core/src/java/org/apache/solr/util/tracing/HttpServletCarrier.java:35: error: cannot infer type arguments for Iterator<E>
    [javac]     this.it = new Iterator<>() {
    [javac]                           ^
    [javac]   reason: '<>' with anonymous inner classes is not supported in -source 8
    [javac]     (use -source 9 or higher to enable '<>' with anonymous inner classes)
    [javac]   where E is a type-variable:
    [javac]     E extends Object declared in interface Iterator
    [javac] Note: Some input files use or override a deprecated API.
    [javac] Note: Recompile with -Xlint:deprecation for details.
    [javac] Note: Some input files use unchecked or unsafe operations.
    [javac] Note: Recompile with -Xlint:unchecked for details.
    [javac] 1 error

BUILD FAILED
/home/jenkins/workspace/Lucene-Solr-8.x-Linux/build.xml:634: The following error occurred while executing this line:
/home/jenkins/workspace/Lucene-Solr-8.x-Linux/build.xml:578: The following error occurred while executing this line:
/home/jenkins/workspace/Lucene-Solr-8.x-Linux/build.xml:59: The following error occurred while executing this line:
/home/jenkins/workspace/Lucene-Solr-8.x-Linux/solr/build.xml:231: The following error occurred while executing this line:
/home/jenkins/workspace/Lucene-Solr-8.x-Linux/solr/common-build.xml:558: The following error occurred while executing this line:
/home/jenkins/workspace/Lucene-Solr-8.x-Linux/solr/common-build.xml:506: The following error occurred while executing this line:
/home/jenkins/workspace/Lucene-Solr-8.x-Linux/solr/common-build.xml:401: The following error occurred while executing this line:
/home/jenkins/workspace/Lucene-Solr-8.x-Linux/lucene/common-build.xml:558: The following error occurred while executing this line:
/home/jenkins/workspace/Lucene-Solr-8.x-Linux/lucene/common-build.xml:2056: Compile failed; see the compiler error output for details.

Total time: 33 minutes 10 seconds
Build step 'Invoke Ant' marked build as failure
Archiving artifacts
Setting ANT_1_8_2_HOME=/home/jenkins/tools/hudson.tasks.Ant_AntInstallation/ANT_1.8.2
[WARNINGS] Skipping publisher since build result is FAILURE
Recording test results
Setting ANT_1_8_2_HOME=/home/jenkins/tools/hudson.tasks.Ant_AntInstallation/ANT_1.8.2
Email was triggered for: Failure - Any
Sending email for trigger: Failure - Any
Setting ANT_1_8_2_HOME=/home/jenkins/tools/hudson.tasks.Ant_AntInstallation/ANT_1.8.2
Setting ANT_1_8_2_HOME=/home/jenkins/tools/hudson.tasks.Ant_AntInstallation/ANT_1.8.2
Setting ANT_1_8_2_HOME=/home/jenkins/tools/hudson.tasks.Ant_AntInstallation/ANT_1.8.2
Setting ANT_1_8_2_HOME=/home/jenkins/tools/hudson.tasks.Ant_AntInstallation/ANT_1.8.2
Setting ANT_1_8_2_HOME=/home/jenkins/tools/hudson.tasks.Ant_AntInstallation/ANT_1.8.2
Setting ANT_1_8_2_HOME=/home/jenkins/tools/hudson.tasks.Ant_AntInstallation/ANT_1.8.2

[JENKINS-EA] Lucene-Solr-8.x-Linux (64bit/jdk-13-ea+18) - Build # 665 - Still Failing!

Posted by Policeman Jenkins Server <je...@thetaphi.de>.
Build: https://jenkins.thetaphi.de/job/Lucene-Solr-8.x-Linux/665/
Java: 64bit/jdk-13-ea+18 -XX:+UseCompressedOops -XX:+UseSerialGC

All tests passed

Build Log:
[...truncated 12066 lines...]
    [javac] Compiling 1277 source files to /home/jenkins/workspace/Lucene-Solr-8.x-Linux/solr/build/solr-core/classes/java
    [javac] /home/jenkins/workspace/Lucene-Solr-8.x-Linux/solr/core/src/java/org/apache/solr/util/tracing/HttpServletCarrier.java:35: error: cannot infer type arguments for Iterator<E>
    [javac]     this.it = new Iterator<>() {
    [javac]                           ^
    [javac]   reason: '<>' with anonymous inner classes is not supported in -source 8
    [javac]     (use -source 9 or higher to enable '<>' with anonymous inner classes)
    [javac]   where E is a type-variable:
    [javac]     E extends Object declared in interface Iterator
    [javac] Note: Some input files use or override a deprecated API.
    [javac] Note: Recompile with -Xlint:deprecation for details.
    [javac] Note: Some input files use unchecked or unsafe operations.
    [javac] Note: Recompile with -Xlint:unchecked for details.
    [javac] 1 error

BUILD FAILED
/home/jenkins/workspace/Lucene-Solr-8.x-Linux/build.xml:634: The following error occurred while executing this line:
/home/jenkins/workspace/Lucene-Solr-8.x-Linux/build.xml:578: The following error occurred while executing this line:
/home/jenkins/workspace/Lucene-Solr-8.x-Linux/build.xml:59: The following error occurred while executing this line:
/home/jenkins/workspace/Lucene-Solr-8.x-Linux/solr/build.xml:231: The following error occurred while executing this line:
/home/jenkins/workspace/Lucene-Solr-8.x-Linux/solr/common-build.xml:558: The following error occurred while executing this line:
/home/jenkins/workspace/Lucene-Solr-8.x-Linux/solr/common-build.xml:506: The following error occurred while executing this line:
/home/jenkins/workspace/Lucene-Solr-8.x-Linux/solr/common-build.xml:401: The following error occurred while executing this line:
/home/jenkins/workspace/Lucene-Solr-8.x-Linux/lucene/common-build.xml:558: The following error occurred while executing this line:
/home/jenkins/workspace/Lucene-Solr-8.x-Linux/lucene/common-build.xml:2056: Compile failed; see the compiler error output for details.

Total time: 32 minutes 41 seconds
Build step 'Invoke Ant' marked build as failure
Archiving artifacts
Setting ANT_1_8_2_HOME=/home/jenkins/tools/hudson.tasks.Ant_AntInstallation/ANT_1.8.2
[WARNINGS] Skipping publisher since build result is FAILURE
Recording test results
Setting ANT_1_8_2_HOME=/home/jenkins/tools/hudson.tasks.Ant_AntInstallation/ANT_1.8.2
Email was triggered for: Failure - Any
Sending email for trigger: Failure - Any
Setting ANT_1_8_2_HOME=/home/jenkins/tools/hudson.tasks.Ant_AntInstallation/ANT_1.8.2
Setting ANT_1_8_2_HOME=/home/jenkins/tools/hudson.tasks.Ant_AntInstallation/ANT_1.8.2
Setting ANT_1_8_2_HOME=/home/jenkins/tools/hudson.tasks.Ant_AntInstallation/ANT_1.8.2
Setting ANT_1_8_2_HOME=/home/jenkins/tools/hudson.tasks.Ant_AntInstallation/ANT_1.8.2
Setting ANT_1_8_2_HOME=/home/jenkins/tools/hudson.tasks.Ant_AntInstallation/ANT_1.8.2
Setting ANT_1_8_2_HOME=/home/jenkins/tools/hudson.tasks.Ant_AntInstallation/ANT_1.8.2

[JENKINS] Lucene-Solr-8.x-Linux (64bit/jdk-11.0.2) - Build # 664 - Still Failing!

Posted by Policeman Jenkins Server <je...@thetaphi.de>.
Build: https://jenkins.thetaphi.de/job/Lucene-Solr-8.x-Linux/664/
Java: 64bit/jdk-11.0.2 -XX:-UseCompressedOops -XX:+UseParallelGC

All tests passed

Build Log:
[...truncated 12060 lines...]
    [javac] Compiling 1277 source files to /home/jenkins/workspace/Lucene-Solr-8.x-Linux/solr/build/solr-core/classes/java
    [javac] /home/jenkins/workspace/Lucene-Solr-8.x-Linux/solr/core/src/java/org/apache/solr/util/tracing/HttpServletCarrier.java:35: error: cannot infer type arguments for Iterator<E>
    [javac]     this.it = new Iterator<>() {
    [javac]                           ^
    [javac]   reason: '<>' with anonymous inner classes is not supported in -source 8
    [javac]     (use -source 9 or higher to enable '<>' with anonymous inner classes)
    [javac]   where E is a type-variable:
    [javac]     E extends Object declared in interface Iterator
    [javac] Note: Some input files use or override a deprecated API.
    [javac] Note: Recompile with -Xlint:deprecation for details.
    [javac] Note: Some input files use unchecked or unsafe operations.
    [javac] Note: Recompile with -Xlint:unchecked for details.
    [javac] 1 error

BUILD FAILED
/home/jenkins/workspace/Lucene-Solr-8.x-Linux/build.xml:634: The following error occurred while executing this line:
/home/jenkins/workspace/Lucene-Solr-8.x-Linux/build.xml:578: The following error occurred while executing this line:
/home/jenkins/workspace/Lucene-Solr-8.x-Linux/build.xml:59: The following error occurred while executing this line:
/home/jenkins/workspace/Lucene-Solr-8.x-Linux/solr/build.xml:231: The following error occurred while executing this line:
/home/jenkins/workspace/Lucene-Solr-8.x-Linux/solr/common-build.xml:558: The following error occurred while executing this line:
/home/jenkins/workspace/Lucene-Solr-8.x-Linux/solr/common-build.xml:506: The following error occurred while executing this line:
/home/jenkins/workspace/Lucene-Solr-8.x-Linux/solr/common-build.xml:401: The following error occurred while executing this line:
/home/jenkins/workspace/Lucene-Solr-8.x-Linux/lucene/common-build.xml:558: The following error occurred while executing this line:
/home/jenkins/workspace/Lucene-Solr-8.x-Linux/lucene/common-build.xml:2056: Compile failed; see the compiler error output for details.

Total time: 31 minutes 14 seconds
Build step 'Invoke Ant' marked build as failure
Archiving artifacts
Setting ANT_1_8_2_HOME=/home/jenkins/tools/hudson.tasks.Ant_AntInstallation/ANT_1.8.2
[WARNINGS] Skipping publisher since build result is FAILURE
Recording test results
Setting ANT_1_8_2_HOME=/home/jenkins/tools/hudson.tasks.Ant_AntInstallation/ANT_1.8.2
Email was triggered for: Failure - Any
Sending email for trigger: Failure - Any
Setting ANT_1_8_2_HOME=/home/jenkins/tools/hudson.tasks.Ant_AntInstallation/ANT_1.8.2
Setting ANT_1_8_2_HOME=/home/jenkins/tools/hudson.tasks.Ant_AntInstallation/ANT_1.8.2
Setting ANT_1_8_2_HOME=/home/jenkins/tools/hudson.tasks.Ant_AntInstallation/ANT_1.8.2
Setting ANT_1_8_2_HOME=/home/jenkins/tools/hudson.tasks.Ant_AntInstallation/ANT_1.8.2
Setting ANT_1_8_2_HOME=/home/jenkins/tools/hudson.tasks.Ant_AntInstallation/ANT_1.8.2
Setting ANT_1_8_2_HOME=/home/jenkins/tools/hudson.tasks.Ant_AntInstallation/ANT_1.8.2