You are viewing a plain text version of this content. The canonical link for it is here.
Posted to builds@solr.apache.org by Apache Jenkins Server <je...@builds.apache.org> on 2025/12/28 13:30:54 UTC

[JENKINS] Solr » Solr-Test-main - Build # 13072 - Still unstable!

Build: https://ci-builds.apache.org/job/Solr/job/Solr-Test-main/13072/

9 tests failed.
FAILED:  org.apache.solr.search.vector.KnnQParserChildTest.classMethod

Error Message:
java.lang.AssertionError: Nodes are added in the incorrect order! Comparing NaN to [NaN]

Stack Trace:
java.lang.AssertionError: Nodes are added in the incorrect order! Comparing NaN to [NaN]
	at org.apache.lucene.util.hnsw.NeighborArray.addInOrder(NeighborArray.java:80)
	at org.apache.lucene.util.hnsw.HnswGraphBuilder.popToScratch(HnswGraphBuilder.java:420)
	at org.apache.lucene.util.hnsw.HnswGraphBuilder.addGraphNodeInternal(HnswGraphBuilder.java:273)
	at org.apache.lucene.util.hnsw.HnswGraphBuilder.addGraphNodeWithEps(HnswGraphBuilder.java:331)
	at org.apache.lucene.util.hnsw.MergingHnswGraphBuilder.updateGraph(MergingHnswGraphBuilder.java:177)
	at org.apache.lucene.util.hnsw.MergingHnswGraphBuilder.build(MergingHnswGraphBuilder.java:128)
	at org.apache.lucene.util.hnsw.IncrementalHnswGraphMerger.merge(IncrementalHnswGraphMerger.java:197)
	at org.apache.lucene.codecs.lucene99.Lucene99HnswVectorsWriter.mergeOneField(Lucene99HnswVectorsWriter.java:414)
	at org.apache.lucene.codecs.perfield.PerFieldKnnVectorsFormat$FieldsWriter.mergeOneField(PerFieldKnnVectorsFormat.java:126)
	at org.apache.lucene.codecs.KnnVectorsWriter.merge(KnnVectorsWriter.java:105)
	at org.apache.lucene.index.SegmentMerger.mergeVectorValues(SegmentMerger.java:271)
	at org.apache.lucene.index.SegmentMerger.mergeWithLogging(SegmentMerger.java:314)
	at org.apache.lucene.index.SegmentMerger.merge(SegmentMerger.java:158)
	at org.apache.lucene.index.IndexWriter.mergeMiddle(IndexWriter.java:5317)
	at org.apache.lucene.index.IndexWriter.merge(IndexWriter.java:4778)
	at org.apache.solr.update.SolrIndexWriter.merge(SolrIndexWriter.java:219)
	at org.apache.lucene.index.IndexWriter$IndexWriterMergeSource.merge(IndexWriter.java:6601)
	at org.apache.lucene.index.ConcurrentMergeScheduler.doMerge(ConcurrentMergeScheduler.java:668)
	at org.apache.lucene.index.ConcurrentMergeScheduler$MergeThread.run(ConcurrentMergeScheduler.java:729)


FAILED:  org.apache.solr.search.vector.KnnQParserChildTest.classMethod

Error Message:
java.lang.AssertionError

Stack Trace:
java.lang.AssertionError
	at org.apache.solr.util.RTimer.stop(RTimer.java:84)
	at org.apache.solr.metrics.otel.instruments.AttributedLongTimer$MetricTimer.stop(AttributedLongTimer.java:64)
	at org.apache.solr.update.SolrIndexWriter.updateMergeMetrics(SolrIndexWriter.java:315)
	at org.apache.solr.update.SolrIndexWriter.merge(SolrIndexWriter.java:225)
	at org.apache.lucene.index.IndexWriter$IndexWriterMergeSource.merge(IndexWriter.java:6601)
	at org.apache.lucene.index.ConcurrentMergeScheduler.doMerge(ConcurrentMergeScheduler.java:668)
	at org.apache.lucene.index.ConcurrentMergeScheduler$MergeThread.run(ConcurrentMergeScheduler.java:729)


FAILED:  org.apache.solr.search.vector.KnnQParserChildTest.classMethod

Error Message:
java.lang.AssertionError: Nodes are added in the incorrect order! Comparing NaN to [NaN]

Stack Trace:
java.lang.AssertionError: Nodes are added in the incorrect order! Comparing NaN to [NaN]
	at org.apache.lucene.util.hnsw.NeighborArray.addInOrder(NeighborArray.java:80)
	at org.apache.lucene.util.hnsw.HnswGraphBuilder.popToScratch(HnswGraphBuilder.java:420)
	at org.apache.lucene.util.hnsw.HnswGraphBuilder.addGraphNodeInternal(HnswGraphBuilder.java:273)
	at org.apache.lucene.util.hnsw.HnswGraphBuilder.addGraphNodeWithEps(HnswGraphBuilder.java:331)
	at org.apache.lucene.util.hnsw.MergingHnswGraphBuilder.updateGraph(MergingHnswGraphBuilder.java:177)
	at org.apache.lucene.util.hnsw.MergingHnswGraphBuilder.build(MergingHnswGraphBuilder.java:128)
	at org.apache.lucene.util.hnsw.IncrementalHnswGraphMerger.merge(IncrementalHnswGraphMerger.java:197)
	at org.apache.lucene.codecs.lucene99.Lucene99HnswVectorsWriter.mergeOneField(Lucene99HnswVectorsWriter.java:414)
	at org.apache.lucene.codecs.perfield.PerFieldKnnVectorsFormat$FieldsWriter.mergeOneField(PerFieldKnnVectorsFormat.java:126)
	at org.apache.lucene.codecs.KnnVectorsWriter.merge(KnnVectorsWriter.java:105)
	at org.apache.lucene.index.SegmentMerger.mergeVectorValues(SegmentMerger.java:271)
	at org.apache.lucene.index.SegmentMerger.mergeWithLogging(SegmentMerger.java:314)
	at org.apache.lucene.index.SegmentMerger.merge(SegmentMerger.java:158)
	at org.apache.lucene.index.IndexWriter.mergeMiddle(IndexWriter.java:5317)
	at org.apache.lucene.index.IndexWriter.merge(IndexWriter.java:4778)
	at org.apache.solr.update.SolrIndexWriter.merge(SolrIndexWriter.java:219)
	at org.apache.lucene.index.IndexWriter$IndexWriterMergeSource.merge(IndexWriter.java:6601)
	at org.apache.lucene.index.ConcurrentMergeScheduler.doMerge(ConcurrentMergeScheduler.java:668)
	at org.apache.lucene.index.ConcurrentMergeScheduler$MergeThread.run(ConcurrentMergeScheduler.java:729)


FAILED:  org.apache.solr.search.vector.KnnQParserChildTest.classMethod

Error Message:
java.lang.AssertionError: Nodes are added in the incorrect order! Comparing NaN to [NaN]

Stack Trace:
java.lang.AssertionError: Nodes are added in the incorrect order! Comparing NaN to [NaN]
	at org.apache.lucene.util.hnsw.NeighborArray.addInOrder(NeighborArray.java:80)
	at org.apache.lucene.util.hnsw.HnswGraphBuilder.popToScratch(HnswGraphBuilder.java:420)
	at org.apache.lucene.util.hnsw.HnswGraphBuilder.addGraphNodeInternal(HnswGraphBuilder.java:273)
	at org.apache.lucene.util.hnsw.HnswGraphBuilder.addGraphNodeWithEps(HnswGraphBuilder.java:331)
	at org.apache.lucene.util.hnsw.MergingHnswGraphBuilder.updateGraph(MergingHnswGraphBuilder.java:177)
	at org.apache.lucene.util.hnsw.MergingHnswGraphBuilder.build(MergingHnswGraphBuilder.java:128)
	at org.apache.lucene.util.hnsw.IncrementalHnswGraphMerger.merge(IncrementalHnswGraphMerger.java:197)
	at org.apache.lucene.codecs.lucene99.Lucene99HnswVectorsWriter.mergeOneField(Lucene99HnswVectorsWriter.java:414)
	at org.apache.lucene.codecs.perfield.PerFieldKnnVectorsFormat$FieldsWriter.mergeOneField(PerFieldKnnVectorsFormat.java:126)
	at org.apache.lucene.codecs.KnnVectorsWriter.merge(KnnVectorsWriter.java:105)
	at org.apache.lucene.index.SegmentMerger.mergeVectorValues(SegmentMerger.java:271)
	at org.apache.lucene.index.SegmentMerger.mergeWithLogging(SegmentMerger.java:314)
	at org.apache.lucene.index.SegmentMerger.merge(SegmentMerger.java:158)
	at org.apache.lucene.index.IndexWriter.mergeMiddle(IndexWriter.java:5317)
	at org.apache.lucene.index.IndexWriter.merge(IndexWriter.java:4778)
	at org.apache.solr.update.SolrIndexWriter.merge(SolrIndexWriter.java:219)
	at org.apache.lucene.index.IndexWriter$IndexWriterMergeSource.merge(IndexWriter.java:6601)
	at org.apache.lucene.index.ConcurrentMergeScheduler.doMerge(ConcurrentMergeScheduler.java:668)
	at org.apache.lucene.index.ConcurrentMergeScheduler$MergeThread.run(ConcurrentMergeScheduler.java:729)


FAILED:  org.apache.solr.search.vector.KnnQParserChildTest.classMethod

Error Message:
java.lang.AssertionError

Stack Trace:
java.lang.AssertionError
	at org.apache.solr.util.RTimer.stop(RTimer.java:84)
	at org.apache.solr.metrics.otel.instruments.AttributedLongTimer$MetricTimer.stop(AttributedLongTimer.java:64)
	at org.apache.solr.update.SolrIndexWriter.updateMergeMetrics(SolrIndexWriter.java:315)
	at org.apache.solr.update.SolrIndexWriter.merge(SolrIndexWriter.java:225)
	at org.apache.lucene.index.IndexWriter$IndexWriterMergeSource.merge(IndexWriter.java:6601)
	at org.apache.lucene.index.ConcurrentMergeScheduler.doMerge(ConcurrentMergeScheduler.java:668)
	at org.apache.lucene.index.ConcurrentMergeScheduler$MergeThread.run(ConcurrentMergeScheduler.java:729)


FAILED:  org.apache.solr.search.vector.KnnQParserChildTest.classMethod

Error Message:
java.lang.AssertionError: Nodes are added in the incorrect order! Comparing NaN to [NaN]

Stack Trace:
java.lang.AssertionError: Nodes are added in the incorrect order! Comparing NaN to [NaN]
	at org.apache.lucene.util.hnsw.NeighborArray.addInOrder(NeighborArray.java:80)
	at org.apache.lucene.util.hnsw.HnswGraphBuilder.popToScratch(HnswGraphBuilder.java:420)
	at org.apache.lucene.util.hnsw.HnswGraphBuilder.addGraphNodeInternal(HnswGraphBuilder.java:273)
	at org.apache.lucene.util.hnsw.HnswGraphBuilder.addGraphNodeWithEps(HnswGraphBuilder.java:331)
	at org.apache.lucene.util.hnsw.MergingHnswGraphBuilder.updateGraph(MergingHnswGraphBuilder.java:177)
	at org.apache.lucene.util.hnsw.MergingHnswGraphBuilder.build(MergingHnswGraphBuilder.java:128)
	at org.apache.lucene.util.hnsw.IncrementalHnswGraphMerger.merge(IncrementalHnswGraphMerger.java:197)
	at org.apache.lucene.codecs.lucene99.Lucene99HnswVectorsWriter.mergeOneField(Lucene99HnswVectorsWriter.java:414)
	at org.apache.lucene.codecs.perfield.PerFieldKnnVectorsFormat$FieldsWriter.mergeOneField(PerFieldKnnVectorsFormat.java:126)
	at org.apache.lucene.codecs.KnnVectorsWriter.merge(KnnVectorsWriter.java:105)
	at org.apache.lucene.index.SegmentMerger.mergeVectorValues(SegmentMerger.java:271)
	at org.apache.lucene.index.SegmentMerger.mergeWithLogging(SegmentMerger.java:314)
	at org.apache.lucene.index.SegmentMerger.merge(SegmentMerger.java:158)
	at org.apache.lucene.index.IndexWriter.mergeMiddle(IndexWriter.java:5317)
	at org.apache.lucene.index.IndexWriter.merge(IndexWriter.java:4778)
	at org.apache.solr.update.SolrIndexWriter.merge(SolrIndexWriter.java:219)
	at org.apache.lucene.index.IndexWriter$IndexWriterMergeSource.merge(IndexWriter.java:6601)
	at org.apache.lucene.index.ConcurrentMergeScheduler.doMerge(ConcurrentMergeScheduler.java:668)
	at org.apache.lucene.index.ConcurrentMergeScheduler$MergeThread.run(ConcurrentMergeScheduler.java:729)


FAILED:  org.apache.solr.search.vector.KnnQParserChildTest.classMethod

Error Message:
java.lang.AssertionError

Stack Trace:
java.lang.AssertionError
	at org.apache.solr.util.RTimer.stop(RTimer.java:84)
	at org.apache.solr.metrics.otel.instruments.AttributedLongTimer$MetricTimer.stop(AttributedLongTimer.java:64)
	at org.apache.solr.update.SolrIndexWriter.updateMergeMetrics(SolrIndexWriter.java:315)
	at org.apache.solr.update.SolrIndexWriter.merge(SolrIndexWriter.java:225)
	at org.apache.lucene.index.IndexWriter$IndexWriterMergeSource.merge(IndexWriter.java:6601)
	at org.apache.lucene.index.ConcurrentMergeScheduler.doMerge(ConcurrentMergeScheduler.java:668)
	at org.apache.lucene.index.ConcurrentMergeScheduler$MergeThread.run(ConcurrentMergeScheduler.java:729)


FAILED:  org.apache.solr.search.vector.KnnQParserChildTest.classMethod

Error Message:
java.lang.AssertionError: Nodes are added in the incorrect order! Comparing NaN to [NaN]

Stack Trace:
java.lang.AssertionError: Nodes are added in the incorrect order! Comparing NaN to [NaN]
	at org.apache.lucene.util.hnsw.NeighborArray.addInOrder(NeighborArray.java:80)
	at org.apache.lucene.util.hnsw.HnswGraphBuilder.popToScratch(HnswGraphBuilder.java:420)
	at org.apache.lucene.util.hnsw.HnswGraphBuilder.addGraphNodeInternal(HnswGraphBuilder.java:273)
	at org.apache.lucene.util.hnsw.HnswGraphBuilder.addGraphNodeWithEps(HnswGraphBuilder.java:331)
	at org.apache.lucene.util.hnsw.MergingHnswGraphBuilder.updateGraph(MergingHnswGraphBuilder.java:177)
	at org.apache.lucene.util.hnsw.MergingHnswGraphBuilder.build(MergingHnswGraphBuilder.java:128)
	at org.apache.lucene.util.hnsw.IncrementalHnswGraphMerger.merge(IncrementalHnswGraphMerger.java:197)
	at org.apache.lucene.codecs.lucene99.Lucene99HnswVectorsWriter.mergeOneField(Lucene99HnswVectorsWriter.java:414)
	at org.apache.lucene.codecs.perfield.PerFieldKnnVectorsFormat$FieldsWriter.mergeOneField(PerFieldKnnVectorsFormat.java:126)
	at org.apache.lucene.codecs.KnnVectorsWriter.merge(KnnVectorsWriter.java:105)
	at org.apache.lucene.index.SegmentMerger.mergeVectorValues(SegmentMerger.java:271)
	at org.apache.lucene.index.SegmentMerger.mergeWithLogging(SegmentMerger.java:314)
	at org.apache.lucene.index.SegmentMerger.merge(SegmentMerger.java:158)
	at org.apache.lucene.index.IndexWriter.mergeMiddle(IndexWriter.java:5317)
	at org.apache.lucene.index.IndexWriter.merge(IndexWriter.java:4778)
	at org.apache.solr.update.SolrIndexWriter.merge(SolrIndexWriter.java:219)
	at org.apache.lucene.index.IndexWriter$IndexWriterMergeSource.merge(IndexWriter.java:6601)
	at org.apache.lucene.index.ConcurrentMergeScheduler.doMerge(ConcurrentMergeScheduler.java:668)
	at org.apache.lucene.index.ConcurrentMergeScheduler$MergeThread.run(ConcurrentMergeScheduler.java:729)


FAILED:  org.apache.solr.search.vector.KnnQParserChildTest.classMethod

Error Message:
java.lang.AssertionError

Stack Trace:
java.lang.AssertionError
	at org.apache.solr.util.RTimer.stop(RTimer.java:84)
	at org.apache.solr.metrics.otel.instruments.AttributedLongTimer$MetricTimer.stop(AttributedLongTimer.java:64)
	at org.apache.solr.update.SolrIndexWriter.updateMergeMetrics(SolrIndexWriter.java:315)
	at org.apache.solr.update.SolrIndexWriter.merge(SolrIndexWriter.java:225)
	at org.apache.lucene.index.IndexWriter$IndexWriterMergeSource.merge(IndexWriter.java:6601)
	at org.apache.lucene.index.ConcurrentMergeScheduler.doMerge(ConcurrentMergeScheduler.java:668)
	at org.apache.lucene.index.ConcurrentMergeScheduler$MergeThread.run(ConcurrentMergeScheduler.java:729)




Build Log:
[...truncated 8039 lines...]
ERROR: The following test(s) have failed:
  - org.apache.solr.search.vector.KnnQParserChildTest (:solr:core)
    Test history: https://develocity.apache.org/scans/tests?search.rootProjectNames=solr-root&tests.container=org.apache.solr.search.vector.KnnQParserChildTest
    Test output: /home/jenkins/jenkins-agent/workspace/Solr/Solr-Test-main/solr/core/build/test-results/test/outputs/OUTPUT-org.apache.solr.search.vector.KnnQParserChildTest.txt
    Reproduce with: ./gradlew :solr:core:test --tests "org.apache.solr.search.vector.KnnQParserChildTest" -Ptests.haltonfailure=false "-Ptests.jvmargs=-XX:TieredStopAtLevel=1 -XX:+UseParallelGC -XX:ActiveProcessorCount=1 -XX:ReservedCodeCacheSize=120m" -Ptests.seed=CCE29286747C01AE -Ptests.multiplier=2 -Ptests.useSecurityManager=true -Ptests.badapples=false -Ptests.file.encoding=UTF-8


Deprecated Gradle features were used in this build, making it incompatible with Gradle 9.0.

You can use '--warning-mode all' to show the individual deprecation warnings and determine if they come from your own scripts or plugins.

For more on this, please refer to https://docs.gradle.org/8.10/userguide/command_line_interface.html#sec:command_line_warnings in the Gradle documentation.

BUILD SUCCESSFUL in 41m 26s
146 actionable tasks: 146 executed

Publishing build scan...
https://develocity.apache.org/s/tuse26zrauez4

Build step 'Invoke Gradle script' changed build result to SUCCESS
Archiving artifacts
‘**/*.events’ doesn’t match anything: ‘**’ exists but not ‘**/*.events’
No artifacts found that match the file pattern "**/*.events,heapdumps/**,**/hs_err_pid*". Configuration error?
Recording test results
[Checks API] No suitable checks publisher found.
Build step 'Publish JUnit test result report' changed build result to UNSTABLE
Email was triggered for: Unstable (Test Failures)
Sending email for trigger: Unstable (Test Failures)