You are viewing a plain text version of this content. The canonical link for it is here.
Posted to dev@kafka.apache.org by Apache Jenkins Server <je...@builds.apache.org> on 2016/04/05 09:12:27 UTC
Build failed in Jenkins: kafka-trunk-jdk8 #506
See <https://builds.apache.org/job/kafka-trunk-jdk8/506/changes>
Changes:
[wangguoz] KAFKA-2998: log warnings when client is disconnected from bootstrap
[me] KAFKA-3384: Conform to POSIX kill usage
------------------------------------------
[...truncated 2640 lines...]
kafka.api.PlaintextConsumerTest > testPatternUnsubscription PASSED
kafka.api.PlaintextConsumerTest > testGroupConsumption PASSED
kafka.api.PlaintextConsumerTest > testPartitionsFor PASSED
kafka.api.PlaintextConsumerTest > testInterceptorsWithWrongKeyValue PASSED
kafka.api.PlaintextConsumerTest > testMultiConsumerRoundRobinAssignment PASSED
kafka.api.PlaintextConsumerTest > testPartitionPauseAndResume PASSED
kafka.api.PlaintextConsumerTest > testConsumeMessagesWithLogAppendTime PASSED
kafka.api.PlaintextConsumerTest > testAutoCommitOnCloseAfterWakeup PASSED
kafka.api.PlaintextConsumerTest > testMaxPollRecords PASSED
kafka.api.PlaintextConsumerTest > testAutoOffsetReset PASSED
kafka.api.PlaintextConsumerTest > testFetchInvalidOffset PASSED
kafka.api.PlaintextConsumerTest > testAutoCommitIntercept FAILED
java.lang.AssertionError: Expected partitions [topic-0, topic-1, topic2-0, topic2-1] but actually got [topic-0, topic-1]
at org.junit.Assert.fail(Assert.java:88)
at kafka.utils.TestUtils$.waitUntilTrue(TestUtils.scala:765)
at kafka.api.PlaintextConsumerTest.changeConsumerSubscriptionAndValidateAssignment(PlaintextConsumerTest.scala:938)
at kafka.api.PlaintextConsumerTest.testAutoCommitIntercept(PlaintextConsumerTest.scala:662)
kafka.api.PlaintextConsumerTest > testCommitMetadata PASSED
kafka.api.PlaintextConsumerTest > testRoundRobinAssignment PASSED
kafka.api.PlaintextConsumerTest > testPatternSubscription PASSED
kafka.api.PlaintextConsumerTest > testPauseStateNotPreservedByRebalance PASSED
kafka.api.PlaintextConsumerTest > testUnsubscribeTopic PASSED
kafka.api.PlaintextConsumerTest > testListTopics PASSED
kafka.api.PlaintextConsumerTest > testAutoCommitOnRebalance PASSED
kafka.api.PlaintextConsumerTest > testSimpleConsumption PASSED
kafka.api.PlaintextConsumerTest > testPartitionReassignmentCallback PASSED
kafka.api.PlaintextConsumerTest > testCommitSpecifiedOffsets PASSED
kafka.api.ApiUtilsTest > testShortStringNonASCII PASSED
kafka.api.ApiUtilsTest > testShortStringASCII PASSED
kafka.api.ConsumerBounceTest > testSeekAndCommitWithBrokerFailures PASSED
kafka.api.ConsumerBounceTest > testConsumptionWithBrokerFailures PASSED
kafka.api.QuotasTest > testProducerConsumerOverrideUnthrottled PASSED
kafka.api.QuotasTest > testThrottledProducerConsumer PASSED
kafka.consumer.ZookeeperConsumerConnectorTest > testBasic PASSED
kafka.consumer.ZookeeperConsumerConnectorTest > testCompressionSetConsumption PASSED
kafka.consumer.ZookeeperConsumerConnectorTest > testLeaderSelectionForPartition PASSED
kafka.consumer.ZookeeperConsumerConnectorTest > testConsumerDecoder PASSED
kafka.consumer.ZookeeperConsumerConnectorTest > testConsumerRebalanceListener PASSED
kafka.consumer.ZookeeperConsumerConnectorTest > testCompression PASSED
kafka.consumer.TopicFilterTest > testWhitelists PASSED
kafka.consumer.TopicFilterTest > testWildcardTopicCountGetTopicCountMapEscapeJson PASSED
kafka.consumer.TopicFilterTest > testBlacklists PASSED
kafka.consumer.ConsumerIteratorTest > testConsumerIteratorDeduplicationDeepIterator PASSED
kafka.consumer.ConsumerIteratorTest > testConsumerIteratorDecodingFailure PASSED
kafka.consumer.MetricsTest > testMetricsReporterAfterDeletingTopic PASSED
kafka.consumer.MetricsTest > testMetricsLeak PASSED
kafka.consumer.PartitionAssignorTest > testRoundRobinPartitionAssignor PASSED
kafka.consumer.PartitionAssignorTest > testRangePartitionAssignor PASSED
kafka.network.SocketServerTest > testMaxConnectionsPerIp PASSED
kafka.network.SocketServerTest > simpleRequest PASSED
kafka.network.SocketServerTest > testSessionPrincipal PASSED
kafka.network.SocketServerTest > testSocketsCloseOnShutdown PASSED
kafka.network.SocketServerTest > testMaxConnectionsPerIPOverrides PASSED
kafka.network.SocketServerTest > testSslSocketServer PASSED
kafka.network.SocketServerTest > tooBigRequestIsRejected PASSED
kafka.security.auth.PermissionTypeTest > testFromString PASSED
kafka.security.auth.AclTest > testAclJsonConversion PASSED
kafka.security.auth.ResourceTypeTest > testFromString PASSED
kafka.security.auth.OperationTest > testFromString PASSED
kafka.security.auth.ZkAuthorizationTest > testIsZkSecurityEnabled PASSED
kafka.security.auth.ZkAuthorizationTest > testZkUtils PASSED
kafka.security.auth.ZkAuthorizationTest > testZkAntiMigration PASSED
kafka.security.auth.ZkAuthorizationTest > testZkMigration PASSED
kafka.security.auth.ZkAuthorizationTest > testChroot PASSED
kafka.security.auth.ZkAuthorizationTest > testDelete PASSED
kafka.security.auth.ZkAuthorizationTest > testDeleteRecursive PASSED
kafka.security.auth.SimpleAclAuthorizerTest > testAllowAllAccess PASSED
kafka.security.auth.SimpleAclAuthorizerTest > testLocalConcurrentModificationOfResourceAcls PASSED
kafka.security.auth.SimpleAclAuthorizerTest > testNoAclFound PASSED
kafka.security.auth.SimpleAclAuthorizerTest > testDistributedConcurrentModificationOfResourceAcls PASSED
kafka.security.auth.SimpleAclAuthorizerTest > testAclManagementAPIs PASSED
kafka.security.auth.SimpleAclAuthorizerTest > testWildCardAcls PASSED
kafka.security.auth.SimpleAclAuthorizerTest > testTopicAcl PASSED
kafka.security.auth.SimpleAclAuthorizerTest > testSuperUserHasAccess PASSED
kafka.security.auth.SimpleAclAuthorizerTest > testDenyTakesPrecedence PASSED
kafka.security.auth.SimpleAclAuthorizerTest > testNoAclFoundOverride PASSED
kafka.security.auth.SimpleAclAuthorizerTest > testHighConcurrencyModificationOfResourceAcls PASSED
kafka.security.auth.SimpleAclAuthorizerTest > testLoadCache PASSED
kafka.integration.PrimitiveApiTest > testMultiProduce PASSED
kafka.integration.PrimitiveApiTest > testDefaultEncoderProducerAndFetch PASSED
kafka.integration.PrimitiveApiTest > testFetchRequestCanProperlySerialize PASSED
kafka.integration.PrimitiveApiTest > testPipelinedProduceRequests PASSED
kafka.integration.PrimitiveApiTest > testProduceAndMultiFetch PASSED
kafka.integration.PrimitiveApiTest > testDefaultEncoderProducerAndFetchWithCompression PASSED
kafka.integration.PrimitiveApiTest > testConsumerEmptyTopic PASSED
kafka.integration.PrimitiveApiTest > testEmptyFetchRequest PASSED
kafka.integration.SaslPlaintextTopicMetadataTest > testIsrAfterBrokerShutDownAndJoinsBack PASSED
kafka.integration.SaslPlaintextTopicMetadataTest > testAutoCreateTopicWithCollision PASSED
kafka.integration.SaslPlaintextTopicMetadataTest > testAliveBrokerListWithNoTopics PASSED
kafka.integration.SaslPlaintextTopicMetadataTest > testAutoCreateTopic PASSED
kafka.integration.SaslPlaintextTopicMetadataTest > testGetAllTopicMetadata PASSED
kafka.integration.SaslPlaintextTopicMetadataTest > testAliveBrokersListWithNoTopicsAfterNewBrokerStartup PASSED
kafka.integration.SaslPlaintextTopicMetadataTest > testBasicTopicMetadata PASSED
kafka.integration.SaslPlaintextTopicMetadataTest > testAliveBrokersListWithNoTopicsAfterABrokerShutdown PASSED
kafka.integration.PlaintextTopicMetadataTest > testIsrAfterBrokerShutDownAndJoinsBack PASSED
kafka.integration.PlaintextTopicMetadataTest > testAutoCreateTopicWithCollision PASSED
kafka.integration.PlaintextTopicMetadataTest > testAliveBrokerListWithNoTopics PASSED
kafka.integration.PlaintextTopicMetadataTest > testAutoCreateTopic PASSED
kafka.integration.PlaintextTopicMetadataTest > testGetAllTopicMetadata PASSED
kafka.integration.PlaintextTopicMetadataTest > testAliveBrokersListWithNoTopicsAfterNewBrokerStartup PASSED
kafka.integration.PlaintextTopicMetadataTest > testBasicTopicMetadata PASSED
kafka.integration.PlaintextTopicMetadataTest > testAliveBrokersListWithNoTopicsAfterABrokerShutdown PASSED
kafka.integration.SaslSslTopicMetadataTest > testIsrAfterBrokerShutDownAndJoinsBack PASSED
kafka.integration.SaslSslTopicMetadataTest > testAutoCreateTopicWithCollision PASSED
ERROR: Could not install JDK1_8_0_45_HOME
java.lang.NullPointerException
at hudson.plugins.toolenv.ToolEnvBuildWrapper$1.buildEnvVars(ToolEnvBuildWrapper.java:46)
at hudson.model.AbstractBuild.getEnvironment(AbstractBuild.java:947)
at hudson.plugins.git.GitSCM.getParamExpandedRepos(GitSCM.java:390)
at hudson.plugins.git.GitSCM.compareRemoteRevisionWithImpl(GitSCM.java:577)
at hudson.plugins.git.GitSCM.compareRemoteRevisionWith(GitSCM.java:527)
at hudson.scm.SCM.compareRemoteRevisionWith(SCM.java:381)
at hudson.scm.SCM.poll(SCM.java:398)
at hudson.model.AbstractProject._poll(AbstractProject.java:1453)
at hudson.model.AbstractProject.poll(AbstractProject.java:1356)
at hudson.triggers.SCMTrigger$Runner.runPolling(SCMTrigger.java:526)
at hudson.triggers.SCMTrigger$Runner.run(SCMTrigger.java:555)
at hudson.util.SequentialExecutionQueue$QueueEntry.run(SequentialExecutionQueue.java:119)
at java.util.concurrent.Executors$RunnableAdapter.call(Executors.java:471)
at java.util.concurrent.FutureTask.run(FutureTask.java:262)
at java.util.concurrent.ThreadPoolExecutor.runWorker(ThreadPoolExecutor.java:1145)
at java.util.concurrent.ThreadPoolExecutor$Worker.run(ThreadPoolExecutor.java:615)
at java.lang.Thread.run(Thread.java:745)
ERROR: Could not install GRADLE_2_4_RC_2_HOME
java.lang.NullPointerException
at hudson.plugins.toolenv.ToolEnvBuildWrapper$1.buildEnvVars(ToolEnvBuildWrapper.java:46)
at hudson.model.AbstractBuild.getEnvironment(AbstractBuild.java:947)
at hudson.plugins.git.GitSCM.getParamExpandedRepos(GitSCM.java:390)
at hudson.plugins.git.GitSCM.compareRemoteRevisionWithImpl(GitSCM.java:577)
at hudson.plugins.git.GitSCM.compareRemoteRevisionWith(GitSCM.java:527)
at hudson.scm.SCM.compareRemoteRevisionWith(SCM.java:381)
at hudson.scm.SCM.poll(SCM.java:398)
at hudson.model.AbstractProject._poll(AbstractProject.java:1453)
at hudson.model.AbstractProject.poll(AbstractProject.java:1356)
at hudson.triggers.SCMTrigger$Runner.runPolling(SCMTrigger.java:526)
at hudson.triggers.SCMTrigger$Runner.run(SCMTrigger.java:555)
at hudson.util.SequentialExecutionQueue$QueueEntry.run(SequentialExecutionQueue.java:119)
at java.util.concurrent.Executors$RunnableAdapter.call(Executors.java:471)
at java.util.concurrent.FutureTask.run(FutureTask.java:262)
at java.util.concurrent.ThreadPoolExecutor.runWorker(ThreadPoolExecutor.java:1145)
at java.util.concurrent.ThreadPoolExecutor$Worker.run(ThreadPoolExecutor.java:615)
at java.lang.Thread.run(Thread.java:745)
kafka.integration.SaslSslTopicMetadataTest > testAliveBrokerListWithNoTopics PASSED
Build timed out (after 120 minutes). Marking the build as failed.
Build was aborted
Recording test results
Setting JDK1_8_0_45_HOME=/home/jenkins/jenkins-slave/tools/hudson.model.JDK/jdk1.8.0_45
Setting GRADLE_2_4_RC_2_HOME=/home/jenkins/jenkins-slave/tools/hudson.plugins.gradle.GradleInstallation/Gradle_2.4-rc-2
Setting JDK1_8_0_45_HOME=/home/jenkins/jenkins-slave/tools/hudson.model.JDK/jdk1.8.0_45
Setting GRADLE_2_4_RC_2_HOME=/home/jenkins/jenkins-slave/tools/hudson.plugins.gradle.GradleInstallation/Gradle_2.4-rc-2
Jenkins build is back to normal : kafka-trunk-jdk8 #511
Posted by Apache Jenkins Server <je...@builds.apache.org>.
See <https://builds.apache.org/job/kafka-trunk-jdk8/511/changes>
Build failed in Jenkins: kafka-trunk-jdk8 #510
Posted by Apache Jenkins Server <je...@builds.apache.org>.
See <https://builds.apache.org/job/kafka-trunk-jdk8/510/changes>
Changes:
[me] KAFKA-3488; Avoid failing of unsent requests in consumer where possible
------------------------------------------
[...truncated 7082 lines...]
org.apache.kafka.streams.kstream.internals.KStreamTransformValuesTest > testTransform PASSED
org.apache.kafka.streams.kstream.internals.KTableMapValuesTest > testSendingOldValue PASSED
org.apache.kafka.streams.kstream.internals.KTableMapValuesTest > testNotSendingOldValue PASSED
org.apache.kafka.streams.kstream.internals.KTableMapValuesTest > testKTable PASSED
org.apache.kafka.streams.kstream.internals.KTableMapValuesTest > testValueGetter PASSED
org.apache.kafka.streams.kstream.internals.KStreamKStreamJoinTest > testOuterJoin PASSED
org.apache.kafka.streams.kstream.internals.KStreamKStreamJoinTest > testJoin PASSED
org.apache.kafka.streams.kstream.internals.KStreamKStreamJoinTest > testWindowing PASSED
org.apache.kafka.streams.kstream.internals.KStreamImplTest > testNumProcesses PASSED
org.apache.kafka.streams.kstream.internals.KTableSourceTest > testNotSedingOldValue PASSED
org.apache.kafka.streams.kstream.internals.KTableSourceTest > testSedingOldValue PASSED
org.apache.kafka.streams.kstream.internals.KTableSourceTest > testKTable PASSED
org.apache.kafka.streams.kstream.internals.KTableSourceTest > testValueGetter PASSED
org.apache.kafka.streams.kstream.internals.KStreamBranchTest > testKStreamBranch PASSED
org.apache.kafka.streams.kstream.internals.KStreamFlatMapValuesTest > testFlatMapValues PASSED
org.apache.kafka.streams.kstream.internals.KStreamWindowAggregateTest > testAggBasic PASSED
org.apache.kafka.streams.kstream.internals.KStreamWindowAggregateTest > testJoin PASSED
org.apache.kafka.streams.kstream.internals.KTableImplTest > testStateStore PASSED
org.apache.kafka.streams.kstream.internals.KTableImplTest > testKTable PASSED
org.apache.kafka.streams.kstream.internals.KTableImplTest > testValueGetter PASSED
org.apache.kafka.streams.kstream.internals.KStreamFlatMapTest > testFlatMap PASSED
org.apache.kafka.streams.kstream.KStreamBuilderTest > testMerge PASSED
org.apache.kafka.streams.kstream.KStreamBuilderTest > testFrom PASSED
org.apache.kafka.streams.kstream.KStreamBuilderTest > testNewName PASSED
org.apache.kafka.streams.KeyValueTest > testHashcode PASSED
org.apache.kafka.streams.KeyValueTest > testEquals PASSED
org.apache.kafka.streams.state.internals.OffsetCheckpointTest > testReadWrite PASSED
org.apache.kafka.streams.state.internals.InMemoryLRUCacheStoreTest > testEvict PASSED
org.apache.kafka.streams.state.internals.InMemoryLRUCacheStoreTest > testPutIfAbsent PASSED
org.apache.kafka.streams.state.internals.InMemoryLRUCacheStoreTest > testRestoreWithDefaultSerdes PASSED
org.apache.kafka.streams.state.internals.InMemoryLRUCacheStoreTest > testRestore PASSED
org.apache.kafka.streams.state.internals.InMemoryLRUCacheStoreTest > testPutGetRange PASSED
org.apache.kafka.streams.state.internals.InMemoryLRUCacheStoreTest > testPutGetRangeWithDefaultSerdes PASSED
org.apache.kafka.streams.state.internals.InMemoryKeyValueStoreTest > testPutIfAbsent PASSED
org.apache.kafka.streams.state.internals.InMemoryKeyValueStoreTest > testRestoreWithDefaultSerdes PASSED
org.apache.kafka.streams.state.internals.InMemoryKeyValueStoreTest > testRestore PASSED
org.apache.kafka.streams.state.internals.InMemoryKeyValueStoreTest > testPutGetRange PASSED
org.apache.kafka.streams.state.internals.InMemoryKeyValueStoreTest > testPutGetRangeWithDefaultSerdes PASSED
org.apache.kafka.streams.state.internals.RocksDBKeyValueStoreTest > testPutIfAbsent PASSED
org.apache.kafka.streams.state.internals.RocksDBKeyValueStoreTest > testRestoreWithDefaultSerdes PASSED
org.apache.kafka.streams.state.internals.RocksDBKeyValueStoreTest > testRestore PASSED
org.apache.kafka.streams.state.internals.RocksDBKeyValueStoreTest > testPutGetRange PASSED
org.apache.kafka.streams.state.internals.RocksDBKeyValueStoreTest > testPutGetRangeWithDefaultSerdes PASSED
org.apache.kafka.streams.state.internals.RocksDBWindowStoreTest > testPutAndFetch PASSED
org.apache.kafka.streams.state.internals.RocksDBWindowStoreTest > testPutAndFetchBefore PASSED
org.apache.kafka.streams.state.internals.RocksDBWindowStoreTest > testInitialLoading PASSED
org.apache.kafka.streams.state.internals.RocksDBWindowStoreTest > testRestore PASSED
org.apache.kafka.streams.state.internals.RocksDBWindowStoreTest > testRolling PASSED
org.apache.kafka.streams.state.internals.RocksDBWindowStoreTest > testSegmentMaintenance PASSED
org.apache.kafka.streams.state.internals.RocksDBWindowStoreTest > testPutSameKeyTimestamp PASSED
org.apache.kafka.streams.state.internals.RocksDBWindowStoreTest > testPutAndFetchAfter PASSED
org.apache.kafka.streams.state.internals.StoreChangeLoggerTest > testRaw PASSED
org.apache.kafka.streams.state.internals.StoreChangeLoggerTest > testAddRemove PASSED
org.apache.kafka.streams.processor.DefaultPartitionGrouperTest > testGrouping PASSED
org.apache.kafka.streams.processor.internals.ProcessorTopologyTest > testDrivingMultiplexingTopology PASSED
org.apache.kafka.streams.processor.internals.ProcessorTopologyTest > testDrivingStatefulTopology PASSED
org.apache.kafka.streams.processor.internals.ProcessorTopologyTest > testDrivingSimpleTopology PASSED
org.apache.kafka.streams.processor.internals.ProcessorTopologyTest > testTopologyMetadata PASSED
org.apache.kafka.streams.processor.internals.ProcessorTopologyTest > testDrivingMultiplexByNameTopology PASSED
org.apache.kafka.streams.processor.internals.RecordCollectorTest > testSpecificPartition PASSED
org.apache.kafka.streams.processor.internals.RecordCollectorTest > testStreamPartitioner PASSED
org.apache.kafka.streams.processor.internals.StandbyTaskTest > testStorePartitions PASSED
org.apache.kafka.streams.processor.internals.StandbyTaskTest > testUpdateKTable PASSED
org.apache.kafka.streams.processor.internals.StandbyTaskTest > testUpdateNonPersistentStore PASSED
org.apache.kafka.streams.processor.internals.StandbyTaskTest > testUpdate PASSED
org.apache.kafka.streams.processor.internals.PartitionGroupTest > testTimeTracking PASSED
org.apache.kafka.streams.processor.internals.assignment.AssginmentInfoTest > testEncodeDecode PASSED
org.apache.kafka.streams.processor.internals.assignment.SubscriptionInfoTest > testEncodeDecode PASSED
org.apache.kafka.streams.processor.internals.assignment.TaskAssignorTest > testStickiness PASSED
org.apache.kafka.streams.processor.internals.assignment.TaskAssignorTest > testAssignWithStandby PASSED
org.apache.kafka.streams.processor.internals.assignment.TaskAssignorTest > testAssignWithoutStandby PASSED
org.apache.kafka.streams.processor.internals.PunctuationQueueTest > testPunctuationInterval PASSED
org.apache.kafka.streams.processor.internals.QuickUnionTest > testUnite PASSED
org.apache.kafka.streams.processor.internals.QuickUnionTest > testUniteMany PASSED
org.apache.kafka.streams.processor.internals.ProcessorStateManagerTest > testRegisterNonPersistentStore PASSED
org.apache.kafka.streams.processor.internals.ProcessorStateManagerTest > testLockStateDirectory PASSED
org.apache.kafka.streams.processor.internals.ProcessorStateManagerTest > testGetStore PASSED
org.apache.kafka.streams.processor.internals.ProcessorStateManagerTest > testClose PASSED
org.apache.kafka.streams.processor.internals.ProcessorStateManagerTest > testChangeLogOffsets PASSED
org.apache.kafka.streams.processor.internals.ProcessorStateManagerTest > testRegisterPersistentStore PASSED
org.apache.kafka.streams.processor.internals.ProcessorStateManagerTest > testNoTopic PASSED
org.apache.kafka.streams.processor.internals.RecordQueueTest > testTimeTracking PASSED
org.apache.kafka.streams.processor.internals.StreamTaskTest > testProcessOrder PASSED
org.apache.kafka.streams.processor.internals.StreamTaskTest > testPauseResume PASSED
org.apache.kafka.streams.processor.internals.StreamThreadTest > testMaybeCommit PASSED
org.apache.kafka.streams.processor.internals.StreamThreadTest > testPartitionAssignmentChange PASSED
org.apache.kafka.streams.processor.internals.StreamThreadTest > testMaybeClean PASSED
org.apache.kafka.streams.processor.internals.MinTimestampTrackerTest > testTracking PASSED
org.apache.kafka.streams.processor.internals.StreamPartitionAssignorTest > testAssignWithStandbyReplicas PASSED
org.apache.kafka.streams.processor.internals.StreamPartitionAssignorTest > testAssignWithNewTasks PASSED
org.apache.kafka.streams.processor.internals.StreamPartitionAssignorTest > testAssignWithStates PASSED
org.apache.kafka.streams.processor.internals.StreamPartitionAssignorTest > testAssignBasic PASSED
org.apache.kafka.streams.processor.internals.StreamPartitionAssignorTest > testOnAssignment PASSED
org.apache.kafka.streams.processor.internals.StreamPartitionAssignorTest > testSubscription PASSED
org.apache.kafka.streams.processor.internals.StreamPartitionAssignorTest > testAssignWithInternalTopics PASSED
org.apache.kafka.streams.processor.TopologyBuilderTest > testSourceTopics PASSED
org.apache.kafka.streams.processor.TopologyBuilderTest > testAddSinkWithSameName PASSED
org.apache.kafka.streams.processor.TopologyBuilderTest > testAddSinkWithSelfParent PASSED
org.apache.kafka.streams.processor.TopologyBuilderTest > testAddProcessorWithSelfParent PASSED
org.apache.kafka.streams.processor.TopologyBuilderTest > testAddStateStoreWithSink PASSED
org.apache.kafka.streams.processor.TopologyBuilderTest > testTopicGroups PASSED
org.apache.kafka.streams.processor.TopologyBuilderTest > testBuild PASSED
org.apache.kafka.streams.processor.TopologyBuilderTest > testAddStateStoreWithSource PASSED
org.apache.kafka.streams.processor.TopologyBuilderTest > testAddSourceWithSameName PASSED
org.apache.kafka.streams.processor.TopologyBuilderTest > testAddProcessorWithSameName PASSED
org.apache.kafka.streams.processor.TopologyBuilderTest > testAddSourceWithSameTopic PASSED
org.apache.kafka.streams.processor.TopologyBuilderTest > testTopicGroupsByStateStore PASSED
org.apache.kafka.streams.processor.TopologyBuilderTest > testAddStateStoreWithDuplicates PASSED
org.apache.kafka.streams.processor.TopologyBuilderTest > testAddSinkWithWrongParent PASSED
org.apache.kafka.streams.processor.TopologyBuilderTest > testAddSinkConnectedWithMultipleParent PASSED
org.apache.kafka.streams.processor.TopologyBuilderTest > testAddProcessorWithWrongParent PASSED
org.apache.kafka.streams.processor.TopologyBuilderTest > testAddStateStore PASSED
org.apache.kafka.streams.processor.TopologyBuilderTest > testAddSinkConnectedWithParent PASSED
org.apache.kafka.streams.processor.TopologyBuilderTest > testAddStateStoreWithNonExistingProcessor PASSED
pure virtual method called
terminate called without an active exception
:streams:test FAILED
FAILURE: Build failed with an exception.
* What went wrong:
Execution failed for task ':streams:test'.
> Process 'Gradle Test Executor 4' finished with non-zero exit value 134
* Try:
Run with --stacktrace option to get the stack trace. Run with --info or --debug option to get more log output.
BUILD FAILED
Total time: 54 mins 38.165 secs
Build step 'Execute shell' marked build as failure
Recording test results
Setting JDK1_8_0_45_HOME=/home/jenkins/jenkins-slave/tools/hudson.model.JDK/jdk1.8.0_45
Setting GRADLE_2_4_RC_2_HOME=/home/jenkins/jenkins-slave/tools/hudson.plugins.gradle.GradleInstallation/Gradle_2.4-rc-2
Setting JDK1_8_0_45_HOME=/home/jenkins/jenkins-slave/tools/hudson.model.JDK/jdk1.8.0_45
Setting GRADLE_2_4_RC_2_HOME=/home/jenkins/jenkins-slave/tools/hudson.plugins.gradle.GradleInstallation/Gradle_2.4-rc-2
Build failed in Jenkins: kafka-trunk-jdk8 #509
Posted by Apache Jenkins Server <je...@builds.apache.org>.
See <https://builds.apache.org/job/kafka-trunk-jdk8/509/changes>
Changes:
[wangguoz] KAFKA-3497: Streams ProcessorContext should support forward() based on
------------------------------------------
[...truncated 1589 lines...]
kafka.consumer.ZookeeperConsumerConnectorTest > testConsumerDecoder PASSED
kafka.consumer.ZookeeperConsumerConnectorTest > testConsumerRebalanceListener PASSED
kafka.consumer.ZookeeperConsumerConnectorTest > testCompression PASSED
kafka.controller.ControllerFailoverTest > testMetadataUpdate PASSED
kafka.producer.ProducerTest > testSendToNewTopic PASSED
kafka.producer.ProducerTest > testAsyncSendCanCorrectlyFailWithTimeout PASSED
kafka.producer.ProducerTest > testSendNullMessage PASSED
kafka.producer.ProducerTest > testUpdateBrokerPartitionInfo PASSED
kafka.producer.ProducerTest > testSendWithDeadBroker PASSED
kafka.producer.AsyncProducerTest > testFailedSendRetryLogic PASSED
kafka.producer.AsyncProducerTest > testQueueTimeExpired PASSED
kafka.producer.AsyncProducerTest > testPartitionAndCollateEvents PASSED
kafka.producer.AsyncProducerTest > testBatchSize PASSED
kafka.producer.AsyncProducerTest > testSerializeEvents PASSED
kafka.producer.AsyncProducerTest > testProducerQueueSize PASSED
kafka.producer.AsyncProducerTest > testRandomPartitioner PASSED
kafka.producer.AsyncProducerTest > testInvalidConfiguration PASSED
kafka.producer.AsyncProducerTest > testInvalidPartition PASSED
kafka.producer.AsyncProducerTest > testNoBroker PASSED
kafka.producer.AsyncProducerTest > testProduceAfterClosed PASSED
kafka.producer.AsyncProducerTest > testJavaProducer PASSED
kafka.producer.AsyncProducerTest > testIncompatibleEncoder PASSED
kafka.producer.SyncProducerTest > testReachableServer PASSED
kafka.producer.SyncProducerTest > testMessageSizeTooLarge PASSED
kafka.producer.SyncProducerTest > testNotEnoughReplicas PASSED
kafka.producer.SyncProducerTest > testMessageSizeTooLargeWithAckZero PASSED
kafka.producer.SyncProducerTest > testProducerCanTimeout PASSED
kafka.producer.SyncProducerTest > testProduceRequestWithNoResponse PASSED
kafka.producer.SyncProducerTest > testEmptyProduceRequest PASSED
kafka.producer.SyncProducerTest > testProduceCorrectlyReceivesResponse PASSED
kafka.tools.ConsoleProducerTest > testParseKeyProp PASSED
kafka.tools.ConsoleProducerTest > testValidConfigsOldProducer PASSED
kafka.tools.ConsoleProducerTest > testInvalidConfigs PASSED
kafka.tools.ConsoleProducerTest > testValidConfigsNewProducer PASSED
kafka.tools.ConsoleConsumerTest > shouldLimitReadsToMaxMessageLimit PASSED
kafka.tools.ConsoleConsumerTest > shouldParseValidNewConsumerValidConfig PASSED
kafka.tools.ConsoleConsumerTest > shouldParseConfigsFromFile PASSED
kafka.tools.ConsoleConsumerTest > shouldParseValidOldConsumerValidConfig PASSED
kafka.security.auth.PermissionTypeTest > testFromString PASSED
kafka.security.auth.ResourceTypeTest > testFromString PASSED
kafka.security.auth.OperationTest > testFromString PASSED
kafka.security.auth.AclTest > testAclJsonConversion PASSED
kafka.security.auth.ZkAuthorizationTest > testIsZkSecurityEnabled PASSED
kafka.security.auth.ZkAuthorizationTest > testZkUtils PASSED
kafka.security.auth.ZkAuthorizationTest > testZkAntiMigration PASSED
kafka.security.auth.ZkAuthorizationTest > testZkMigration PASSED
kafka.security.auth.ZkAuthorizationTest > testChroot PASSED
kafka.security.auth.ZkAuthorizationTest > testDelete PASSED
kafka.security.auth.ZkAuthorizationTest > testDeleteRecursive PASSED
kafka.security.auth.SimpleAclAuthorizerTest > testAllowAllAccess PASSED
kafka.security.auth.SimpleAclAuthorizerTest > testLocalConcurrentModificationOfResourceAcls PASSED
kafka.security.auth.SimpleAclAuthorizerTest > testNoAclFound PASSED
kafka.security.auth.SimpleAclAuthorizerTest > testDistributedConcurrentModificationOfResourceAcls PASSED
kafka.security.auth.SimpleAclAuthorizerTest > testAclManagementAPIs PASSED
kafka.security.auth.SimpleAclAuthorizerTest > testWildCardAcls PASSED
kafka.security.auth.SimpleAclAuthorizerTest > testTopicAcl PASSED
kafka.security.auth.SimpleAclAuthorizerTest > testSuperUserHasAccess PASSED
kafka.security.auth.SimpleAclAuthorizerTest > testDenyTakesPrecedence PASSED
kafka.security.auth.SimpleAclAuthorizerTest > testNoAclFoundOverride PASSED
kafka.security.auth.SimpleAclAuthorizerTest > testHighConcurrencyModificationOfResourceAcls PASSED
kafka.security.auth.SimpleAclAuthorizerTest > testLoadCache PASSED
kafka.integration.SaslPlaintextTopicMetadataTest > testIsrAfterBrokerShutDownAndJoinsBack PASSED
kafka.integration.SaslPlaintextTopicMetadataTest > testAutoCreateTopicWithCollision PASSED
kafka.integration.SaslPlaintextTopicMetadataTest > testAliveBrokerListWithNoTopics PASSED
kafka.integration.SaslPlaintextTopicMetadataTest > testAutoCreateTopic PASSED
kafka.integration.SaslPlaintextTopicMetadataTest > testGetAllTopicMetadata PASSED
kafka.integration.SaslPlaintextTopicMetadataTest > testAliveBrokersListWithNoTopicsAfterNewBrokerStartup PASSED
kafka.integration.SaslPlaintextTopicMetadataTest > testBasicTopicMetadata PASSED
kafka.integration.SaslPlaintextTopicMetadataTest > testAliveBrokersListWithNoTopicsAfterABrokerShutdown PASSED
kafka.integration.PrimitiveApiTest > testMultiProduce PASSED
kafka.integration.PrimitiveApiTest > testDefaultEncoderProducerAndFetch PASSED
kafka.integration.PrimitiveApiTest > testFetchRequestCanProperlySerialize PASSED
kafka.integration.PrimitiveApiTest > testPipelinedProduceRequests PASSED
kafka.integration.PrimitiveApiTest > testProduceAndMultiFetch PASSED
kafka.integration.PrimitiveApiTest > testDefaultEncoderProducerAndFetchWithCompression PASSED
kafka.integration.PrimitiveApiTest > testConsumerEmptyTopic PASSED
kafka.integration.PrimitiveApiTest > testEmptyFetchRequest PASSED
kafka.integration.PlaintextTopicMetadataTest > testIsrAfterBrokerShutDownAndJoinsBack PASSED
kafka.integration.PlaintextTopicMetadataTest > testAutoCreateTopicWithCollision PASSED
kafka.integration.PlaintextTopicMetadataTest > testAliveBrokerListWithNoTopics PASSED
kafka.integration.PlaintextTopicMetadataTest > testAutoCreateTopic PASSED
kafka.integration.PlaintextTopicMetadataTest > testGetAllTopicMetadata PASSED
kafka.integration.PlaintextTopicMetadataTest > testAliveBrokersListWithNoTopicsAfterNewBrokerStartup PASSED
kafka.integration.PlaintextTopicMetadataTest > testBasicTopicMetadata PASSED
kafka.integration.PlaintextTopicMetadataTest > testAliveBrokersListWithNoTopicsAfterABrokerShutdown PASSED
kafka.integration.AutoOffsetResetTest > testResetToLatestWhenOffsetTooLow PASSED
kafka.integration.AutoOffsetResetTest > testResetToEarliestWhenOffsetTooLow PASSED
kafka.integration.AutoOffsetResetTest > testResetToEarliestWhenOffsetTooHigh PASSED
kafka.integration.AutoOffsetResetTest > testResetToLatestWhenOffsetTooHigh PASSED
kafka.integration.RollingBounceTest > testRollingBounce PASSED
kafka.integration.SslTopicMetadataTest > testIsrAfterBrokerShutDownAndJoinsBack PASSED
kafka.integration.SslTopicMetadataTest > testAutoCreateTopicWithCollision PASSED
kafka.integration.SslTopicMetadataTest > testAliveBrokerListWithNoTopics PASSED
kafka.integration.SslTopicMetadataTest > testAutoCreateTopic PASSED
kafka.integration.SslTopicMetadataTest > testGetAllTopicMetadata PASSED
kafka.integration.SslTopicMetadataTest > testAliveBrokersListWithNoTopicsAfterNewBrokerStartup PASSED
kafka.integration.SslTopicMetadataTest > testBasicTopicMetadata PASSED
kafka.integration.SslTopicMetadataTest > testAliveBrokersListWithNoTopicsAfterABrokerShutdown PASSED
kafka.integration.SaslSslTopicMetadataTest > testIsrAfterBrokerShutDownAndJoinsBack PASSED
kafka.integration.SaslSslTopicMetadataTest > testAutoCreateTopicWithCollision PASSED
kafka.integration.SaslSslTopicMetadataTest > testAliveBrokerListWithNoTopics PASSED
kafka.integration.SaslSslTopicMetadataTest > testAutoCreateTopic PASSED
kafka.integration.SaslSslTopicMetadataTest > testGetAllTopicMetadata PASSED
kafka.integration.SaslSslTopicMetadataTest > testAliveBrokersListWithNoTopicsAfterNewBrokerStartup PASSED
kafka.integration.SaslSslTopicMetadataTest > testBasicTopicMetadata PASSED
kafka.integration.SaslSslTopicMetadataTest > testAliveBrokersListWithNoTopicsAfterABrokerShutdown PASSED
kafka.integration.FetcherTest > testFetcher PASSED
kafka.integration.UncleanLeaderElectionTest > testUncleanLeaderElectionEnabled PASSED
kafka.integration.UncleanLeaderElectionTest > testCleanLeaderElectionDisabledByTopicOverride PASSED
kafka.integration.UncleanLeaderElectionTest > testUncleanLeaderElectionDisabled PASSED
kafka.integration.UncleanLeaderElectionTest > testUncleanLeaderElectionInvalidTopicOverride PASSED
kafka.integration.UncleanLeaderElectionTest > testUncleanLeaderElectionEnabledByTopicOverride PASSED
kafka.integration.MinIsrConfigTest > testDefaultKafkaConfig PASSED
724 tests completed, 1 failed
:kafka-trunk-jdk8:core:test FAILED
:test_core_2_10 FAILED
FAILURE: Build failed with an exception.
* What went wrong:
Execution failed for task ':core:test'.
> There were failing tests. See the report at: file://<https://builds.apache.org/job/kafka-trunk-jdk8/ws/core/build/reports/tests/index.html>
* Try:
Run with --stacktrace option to get the stack trace. Run with --info or --debug option to get more log output.
BUILD FAILED
Total time: 34 mins 57.537 secs
Build step 'Execute shell' marked build as failure
Recording test results
Setting JDK1_8_0_45_HOME=/home/jenkins/jenkins-slave/tools/hudson.model.JDK/jdk1.8.0_45
Setting GRADLE_2_4_RC_2_HOME=/home/jenkins/jenkins-slave/tools/hudson.plugins.gradle.GradleInstallation/Gradle_2.4-rc-2
Setting JDK1_8_0_45_HOME=/home/jenkins/jenkins-slave/tools/hudson.model.JDK/jdk1.8.0_45
Setting GRADLE_2_4_RC_2_HOME=/home/jenkins/jenkins-slave/tools/hudson.plugins.gradle.GradleInstallation/Gradle_2.4-rc-2
Build failed in Jenkins: kafka-trunk-jdk8 #508
Posted by Apache Jenkins Server <je...@builds.apache.org>.
See <https://builds.apache.org/job/kafka-trunk-jdk8/508/changes>
Changes:
[junrao] KAFKA-3489; Update request metrics if a client closes a connection while
[me] KAFKA-3508: Fix transient SimpleACLAuthorizerTest failures
[wangguoz] KAFKA-3477: extended KStream/KTable API to specify custom partitioner
------------------------------------------
[...truncated 1591 lines...]
kafka.log.BrokerCompressionTest > testBrokerSideCompression[17] PASSED
kafka.log.BrokerCompressionTest > testBrokerSideCompression[18] PASSED
kafka.log.BrokerCompressionTest > testBrokerSideCompression[19] PASSED
kafka.log.LogSegmentTest > testRecoveryWithCorruptMessage PASSED
kafka.log.LogSegmentTest > testRecoveryFixesCorruptIndex PASSED
kafka.log.LogSegmentTest > testReadFromGap PASSED
kafka.log.LogSegmentTest > testTruncate PASSED
kafka.log.LogSegmentTest > testReadBeforeFirstOffset PASSED
kafka.log.LogSegmentTest > testCreateWithInitFileSizeAppendMessage PASSED
kafka.log.LogSegmentTest > testChangeFileSuffixes PASSED
kafka.log.LogSegmentTest > testMaxOffset PASSED
kafka.log.LogSegmentTest > testNextOffsetCalculation PASSED
kafka.log.LogSegmentTest > testReadOnEmptySegment PASSED
kafka.log.LogSegmentTest > testReadAfterLast PASSED
kafka.log.LogSegmentTest > testCreateWithInitFileSizeClearShutdown PASSED
kafka.log.LogSegmentTest > testTruncateFull PASSED
kafka.log.LogConfigTest > testFromPropsEmpty PASSED
kafka.log.LogConfigTest > testKafkaConfigToProps PASSED
kafka.log.LogConfigTest > testFromPropsInvalid PASSED
kafka.log.LogCleanerIntegrationTest > cleanerTest[0] PASSED
kafka.log.LogCleanerIntegrationTest > cleanerTest[1] PASSED
kafka.log.LogCleanerIntegrationTest > cleanerTest[2] PASSED
kafka.log.LogCleanerIntegrationTest > cleanerTest[3] PASSED
kafka.log.LogManagerTest > testCleanupSegmentsToMaintainSize PASSED
kafka.log.LogManagerTest > testRecoveryDirectoryMappingWithRelativeDirectory PASSED
kafka.log.LogManagerTest > testGetNonExistentLog PASSED
kafka.log.LogManagerTest > testTwoLogManagersUsingSameDirFails PASSED
kafka.log.LogManagerTest > testLeastLoadedAssignment PASSED
kafka.log.LogManagerTest > testCleanupExpiredSegments PASSED
kafka.log.LogManagerTest > testCheckpointRecoveryPoints PASSED
kafka.log.LogManagerTest > testTimeBasedFlush PASSED
kafka.log.LogManagerTest > testCreateLog PASSED
kafka.log.LogManagerTest > testRecoveryDirectoryMappingWithTrailingSlash PASSED
kafka.coordinator.MemberMetadataTest > testMatchesSupportedProtocols PASSED
kafka.coordinator.MemberMetadataTest > testMetadata PASSED
kafka.coordinator.MemberMetadataTest > testMetadataRaisesOnUnsupportedProtocol PASSED
kafka.coordinator.MemberMetadataTest > testVoteForPreferredProtocol PASSED
kafka.coordinator.MemberMetadataTest > testVoteRaisesOnNoSupportedProtocols PASSED
kafka.coordinator.GroupCoordinatorResponseTest > testHeartbeatWrongCoordinator PASSED
kafka.coordinator.GroupCoordinatorResponseTest > testDescribeGroupStable PASSED
kafka.coordinator.GroupCoordinatorResponseTest > testHeartbeatIllegalGeneration PASSED
kafka.coordinator.GroupCoordinatorResponseTest > testDescribeGroupWrongCoordinator PASSED
kafka.coordinator.GroupCoordinatorResponseTest > testDescribeGroupRebalancing PASSED
kafka.coordinator.GroupCoordinatorResponseTest > testLeaderFailureInSyncGroup PASSED
kafka.coordinator.GroupCoordinatorResponseTest > testGenerationIdIncrementsOnRebalance PASSED
kafka.coordinator.GroupCoordinatorResponseTest > testSyncGroupFromIllegalGeneration PASSED
kafka.coordinator.GroupCoordinatorResponseTest > testInvalidGroupId PASSED
kafka.coordinator.GroupCoordinatorResponseTest > testHeartbeatUnknownGroup PASSED
kafka.coordinator.GroupCoordinatorResponseTest > testListGroupsIncludesStableGroups PASSED
kafka.coordinator.GroupCoordinatorResponseTest > testHeartbeatDuringRebalanceCausesRebalanceInProgress PASSED
kafka.coordinator.GroupCoordinatorResponseTest > testJoinGroupInconsistentGroupProtocol PASSED
kafka.coordinator.GroupCoordinatorResponseTest > testJoinGroupSessionTimeoutTooLarge PASSED
kafka.coordinator.GroupCoordinatorResponseTest > testJoinGroupSessionTimeoutTooSmall PASSED
kafka.coordinator.GroupCoordinatorResponseTest > testSyncGroupEmptyAssignment PASSED
kafka.coordinator.GroupCoordinatorResponseTest > testCommitOffsetWithDefaultGeneration PASSED
kafka.coordinator.GroupCoordinatorResponseTest > testJoinGroupFromUnchangedLeaderShouldRebalance PASSED
kafka.coordinator.GroupCoordinatorResponseTest > testHeartbeatRebalanceInProgress PASSED
kafka.coordinator.GroupCoordinatorResponseTest > testLeaveGroupUnknownGroup PASSED
kafka.coordinator.GroupCoordinatorResponseTest > testListGroupsIncludesRebalancingGroups PASSED
kafka.coordinator.GroupCoordinatorResponseTest > testSyncGroupFollowerAfterLeader PASSED
kafka.coordinator.GroupCoordinatorResponseTest > testCommitOffsetInAwaitingSync PASSED
kafka.coordinator.GroupCoordinatorResponseTest > testJoinGroupWrongCoordinator PASSED
kafka.coordinator.GroupCoordinatorResponseTest > testJoinGroupUnknownConsumerExistingGroup PASSED
kafka.coordinator.GroupCoordinatorResponseTest > testSyncGroupFromUnknownGroup PASSED
kafka.coordinator.GroupCoordinatorResponseTest > testJoinGroupInconsistentProtocolType PASSED
kafka.coordinator.GroupCoordinatorResponseTest > testCommitOffsetFromUnknownGroup PASSED
kafka.coordinator.GroupCoordinatorResponseTest > testLeaveGroupWrongCoordinator PASSED
kafka.coordinator.GroupCoordinatorResponseTest > testLeaveGroupUnknownConsumerExistingGroup PASSED
kafka.coordinator.GroupCoordinatorResponseTest > testJoinGroupUnknownConsumerNewGroup PASSED
kafka.coordinator.GroupCoordinatorResponseTest > testJoinGroupFromUnchangedFollowerDoesNotRebalance PASSED
kafka.coordinator.GroupCoordinatorResponseTest > testValidJoinGroup PASSED
kafka.coordinator.GroupCoordinatorResponseTest > testSyncGroupLeaderAfterFollower PASSED
kafka.coordinator.GroupCoordinatorResponseTest > testSyncGroupFromUnknownMember PASSED
kafka.coordinator.GroupCoordinatorResponseTest > testValidLeaveGroup PASSED
kafka.coordinator.GroupCoordinatorResponseTest > testDescribeGroupInactiveGroup PASSED
kafka.coordinator.GroupCoordinatorResponseTest > testSyncGroupNotCoordinator PASSED
kafka.coordinator.GroupCoordinatorResponseTest > testHeartbeatUnknownConsumerExistingGroup PASSED
kafka.coordinator.GroupCoordinatorResponseTest > testValidHeartbeat PASSED
kafka.coordinator.GroupMetadataTest > testDeadToAwaitingSyncIllegalTransition PASSED
kafka.coordinator.GroupMetadataTest > testPreparingRebalanceToStableIllegalTransition PASSED
kafka.coordinator.GroupMetadataTest > testCannotRebalanceWhenDead PASSED
kafka.coordinator.GroupMetadataTest > testSelectProtocol PASSED
kafka.coordinator.GroupMetadataTest > testCannotRebalanceWhenPreparingRebalance PASSED
kafka.coordinator.GroupMetadataTest > testDeadToPreparingRebalanceIllegalTransition PASSED
kafka.coordinator.GroupMetadataTest > testCanRebalanceWhenAwaitingSync PASSED
kafka.coordinator.GroupMetadataTest > testAwaitingSyncToPreparingRebalanceTransition PASSED
kafka.coordinator.GroupMetadataTest > testStableToAwaitingSyncIllegalTransition PASSED
kafka.coordinator.GroupMetadataTest > testDeadToDeadIllegalTransition PASSED
kafka.coordinator.GroupMetadataTest > testSelectProtocolRaisesIfNoMembers PASSED
kafka.coordinator.GroupMetadataTest > testStableToPreparingRebalanceTransition PASSED
kafka.coordinator.GroupMetadataTest > testPreparingRebalanceToDeadTransition PASSED
kafka.coordinator.GroupMetadataTest > testStableToStableIllegalTransition PASSED
kafka.coordinator.GroupMetadataTest > testAwaitingSyncToStableTransition PASSED
kafka.coordinator.GroupMetadataTest > testDeadToStableIllegalTransition PASSED
kafka.coordinator.GroupMetadataTest > testAwaitingSyncToAwaitingSyncIllegalTransition PASSED
kafka.coordinator.GroupMetadataTest > testSupportsProtocols PASSED
kafka.coordinator.GroupMetadataTest > testCanRebalanceWhenStable PASSED
kafka.coordinator.GroupMetadataTest > testPreparingRebalanceToPreparingRebalanceIllegalTransition PASSED
kafka.coordinator.GroupMetadataTest > testSelectProtocolChoosesCompatibleProtocol PASSED
kafka.KafkaTest > testGetKafkaConfigFromArgsWrongSetValue PASSED
kafka.KafkaTest > testKafkaSslPasswords PASSED
kafka.KafkaTest > testGetKafkaConfigFromArgs PASSED
kafka.KafkaTest > testGetKafkaConfigFromArgsNonArgsAtTheEnd PASSED
kafka.KafkaTest > testGetKafkaConfigFromArgsNonArgsOnly PASSED
kafka.KafkaTest > testGetKafkaConfigFromArgsNonArgsAtTheBegging PASSED
kafka.tools.ConsoleProducerTest > testParseKeyProp PASSED
kafka.tools.ConsoleProducerTest > testValidConfigsOldProducer PASSED
kafka.tools.ConsoleProducerTest > testInvalidConfigs PASSED
kafka.tools.ConsoleProducerTest > testValidConfigsNewProducer PASSED
kafka.tools.ConsoleConsumerTest > shouldLimitReadsToMaxMessageLimit PASSED
kafka.tools.ConsoleConsumerTest > shouldParseValidNewConsumerValidConfig PASSED
kafka.tools.ConsoleConsumerTest > shouldParseConfigsFromFile PASSED
kafka.tools.ConsoleConsumerTest > shouldParseValidOldConsumerValidConfig PASSED
724 tests completed, 2 failed
:kafka-trunk-jdk8:core:test FAILED
:test_core_2_10 FAILED
FAILURE: Build failed with an exception.
* What went wrong:
Execution failed for task ':core:test'.
> There were failing tests. See the report at: file://<https://builds.apache.org/job/kafka-trunk-jdk8/ws/core/build/reports/tests/index.html>
* Try:
Run with --stacktrace option to get the stack trace. Run with --info or --debug option to get more log output.
BUILD FAILED
Total time: 51 mins 9.254 secs
Build step 'Execute shell' marked build as failure
Recording test results
Setting JDK1_8_0_45_HOME=/home/jenkins/jenkins-slave/tools/hudson.model.JDK/jdk1.8.0_45
Setting GRADLE_2_4_RC_2_HOME=/home/jenkins/jenkins-slave/tools/hudson.plugins.gradle.GradleInstallation/Gradle_2.4-rc-2
Setting JDK1_8_0_45_HOME=/home/jenkins/jenkins-slave/tools/hudson.model.JDK/jdk1.8.0_45
Setting GRADLE_2_4_RC_2_HOME=/home/jenkins/jenkins-slave/tools/hudson.plugins.gradle.GradleInstallation/Gradle_2.4-rc-2
Build failed in Jenkins: kafka-trunk-jdk8 #507
Posted by Apache Jenkins Server <je...@builds.apache.org>.
See <https://builds.apache.org/job/kafka-trunk-jdk8/507/changes>
Changes:
[wangguoz] KAFKA-3510; OffsetIndex thread safety
------------------------------------------
[...truncated 5403 lines...]
kafka.log.BrokerCompressionTest > testBrokerSideCompression[3] PASSED
kafka.log.BrokerCompressionTest > testBrokerSideCompression[4] PASSED
kafka.log.BrokerCompressionTest > testBrokerSideCompression[5] PASSED
kafka.log.BrokerCompressionTest > testBrokerSideCompression[6] PASSED
kafka.log.BrokerCompressionTest > testBrokerSideCompression[7] PASSED
kafka.log.BrokerCompressionTest > testBrokerSideCompression[8] PASSED
kafka.log.BrokerCompressionTest > testBrokerSideCompression[9] PASSED
kafka.log.BrokerCompressionTest > testBrokerSideCompression[10] PASSED
kafka.log.BrokerCompressionTest > testBrokerSideCompression[11] PASSED
kafka.log.BrokerCompressionTest > testBrokerSideCompression[12] PASSED
kafka.log.BrokerCompressionTest > testBrokerSideCompression[13] PASSED
kafka.log.BrokerCompressionTest > testBrokerSideCompression[14] PASSED
kafka.log.BrokerCompressionTest > testBrokerSideCompression[15] PASSED
kafka.log.BrokerCompressionTest > testBrokerSideCompression[16] PASSED
kafka.log.BrokerCompressionTest > testBrokerSideCompression[17] PASSED
kafka.log.BrokerCompressionTest > testBrokerSideCompression[18] PASSED
kafka.log.BrokerCompressionTest > testBrokerSideCompression[19] PASSED
kafka.log.OffsetMapTest > testClear PASSED
kafka.log.OffsetMapTest > testBasicValidation PASSED
kafka.log.LogManagerTest > testCleanupSegmentsToMaintainSize PASSED
kafka.log.LogManagerTest > testRecoveryDirectoryMappingWithRelativeDirectory PASSED
kafka.log.LogManagerTest > testGetNonExistentLog PASSED
kafka.log.LogManagerTest > testTwoLogManagersUsingSameDirFails PASSED
kafka.log.LogManagerTest > testLeastLoadedAssignment PASSED
kafka.log.LogManagerTest > testCleanupExpiredSegments PASSED
kafka.log.LogManagerTest > testCheckpointRecoveryPoints PASSED
kafka.log.LogManagerTest > testTimeBasedFlush PASSED
kafka.log.LogManagerTest > testCreateLog PASSED
kafka.log.LogManagerTest > testRecoveryDirectoryMappingWithTrailingSlash PASSED
kafka.log.LogSegmentTest > testRecoveryWithCorruptMessage PASSED
kafka.log.LogSegmentTest > testRecoveryFixesCorruptIndex PASSED
kafka.log.LogSegmentTest > testReadFromGap PASSED
kafka.log.LogSegmentTest > testTruncate PASSED
kafka.log.LogSegmentTest > testReadBeforeFirstOffset PASSED
kafka.log.LogSegmentTest > testCreateWithInitFileSizeAppendMessage PASSED
kafka.log.LogSegmentTest > testChangeFileSuffixes PASSED
kafka.log.LogSegmentTest > testMaxOffset PASSED
kafka.log.LogSegmentTest > testNextOffsetCalculation PASSED
kafka.log.LogSegmentTest > testReadOnEmptySegment PASSED
kafka.log.LogSegmentTest > testReadAfterLast PASSED
kafka.log.LogSegmentTest > testCreateWithInitFileSizeClearShutdown PASSED
kafka.log.LogSegmentTest > testTruncateFull PASSED
kafka.log.FileMessageSetTest > testTruncate PASSED
kafka.log.FileMessageSetTest > testIterationOverPartialAndTruncation PASSED
kafka.log.FileMessageSetTest > testRead PASSED
kafka.log.FileMessageSetTest > testFileSize PASSED
kafka.log.FileMessageSetTest > testIteratorWithLimits PASSED
kafka.log.FileMessageSetTest > testPreallocateTrue PASSED
kafka.log.FileMessageSetTest > testIteratorIsConsistent PASSED
kafka.log.FileMessageSetTest > testFormatConversionWithPartialMessage PASSED
kafka.log.FileMessageSetTest > testIterationDoesntChangePosition PASSED
kafka.log.FileMessageSetTest > testWrittenEqualsRead PASSED
kafka.log.FileMessageSetTest > testWriteTo PASSED
kafka.log.FileMessageSetTest > testPreallocateFalse PASSED
kafka.log.FileMessageSetTest > testPreallocateClearShutdown PASSED
kafka.log.FileMessageSetTest > testMessageFormatConversion PASSED
kafka.log.FileMessageSetTest > testSearch PASSED
kafka.log.FileMessageSetTest > testSizeInBytes PASSED
kafka.log.LogCleanerIntegrationTest > cleanerTest[0] PASSED
kafka.log.LogCleanerIntegrationTest > cleanerTest[1] PASSED
kafka.log.LogCleanerIntegrationTest > cleanerTest[2] PASSED
kafka.log.LogCleanerIntegrationTest > cleanerTest[3] PASSED
kafka.log.LogTest > testParseTopicPartitionNameForMissingTopic PASSED
kafka.log.LogTest > testIndexRebuild PASSED
kafka.log.LogTest > testLogRolls PASSED
kafka.log.LogTest > testMessageSizeCheck PASSED
kafka.log.LogTest > testAsyncDelete PASSED
kafka.log.LogTest > testReadOutOfRange PASSED
kafka.log.LogTest > testAppendWithOutOfOrderOffsetsThrowsException PASSED
kafka.log.LogTest > testReadAtLogGap PASSED
kafka.log.LogTest > testTimeBasedLogRoll PASSED
kafka.log.LogTest > testLoadEmptyLog PASSED
kafka.log.LogTest > testMessageSetSizeCheck PASSED
kafka.log.LogTest > testIndexResizingAtTruncation PASSED
kafka.log.LogTest > testCompactedTopicConstraints PASSED
kafka.log.LogTest > testThatGarbageCollectingSegmentsDoesntChangeOffset PASSED
kafka.log.LogTest > testAppendAndReadWithSequentialOffsets PASSED
kafka.log.LogTest > testParseTopicPartitionNameForNull PASSED
kafka.log.LogTest > testAppendAndReadWithNonSequentialOffsets PASSED
kafka.log.LogTest > testParseTopicPartitionNameForMissingSeparator PASSED
kafka.log.LogTest > testCorruptIndexRebuild PASSED
kafka.log.LogTest > testBogusIndexSegmentsAreRemoved PASSED
kafka.log.LogTest > testCompressedMessages PASSED
kafka.log.LogTest > testAppendMessageWithNullPayload PASSED
kafka.log.LogTest > testCorruptLog PASSED
kafka.log.LogTest > testLogRecoversToCorrectOffset PASSED
kafka.log.LogTest > testReopenThenTruncate PASSED
kafka.log.LogTest > testParseTopicPartitionNameForMissingPartition PASSED
kafka.log.LogTest > testParseTopicPartitionNameForEmptyName PASSED
kafka.log.LogTest > testOpenDeletesObsoleteFiles PASSED
kafka.log.LogTest > testSizeBasedLogRoll PASSED
kafka.log.LogTest > testTimeBasedLogRollJitter PASSED
kafka.log.LogTest > testParseTopicPartitionName PASSED
kafka.log.LogTest > testTruncateTo PASSED
kafka.log.LogTest > testCleanShutdownFile PASSED
kafka.log.LogConfigTest > testFromPropsEmpty PASSED
kafka.log.LogConfigTest > testKafkaConfigToProps PASSED
kafka.log.LogConfigTest > testFromPropsInvalid PASSED
kafka.log.CleanerTest > testBuildOffsetMap PASSED
kafka.log.CleanerTest > testSegmentGrouping PASSED
kafka.log.CleanerTest > testCleanSegmentsWithAbort PASSED
kafka.log.CleanerTest > testSegmentGroupingWithSparseOffsets PASSED
kafka.log.CleanerTest > testRecoveryAfterCrash PASSED
kafka.log.CleanerTest > testLogToClean PASSED
kafka.log.CleanerTest > testCleaningWithDeletes PASSED
kafka.log.CleanerTest > testCleanSegments PASSED
kafka.log.CleanerTest > testCleaningWithUnkeyedMessages PASSED
kafka.log.OffsetIndexTest > lookupExtremeCases PASSED
kafka.log.OffsetIndexTest > appendTooMany PASSED
kafka.log.OffsetIndexTest > randomLookupTest PASSED
kafka.log.OffsetIndexTest > testReopen PASSED
kafka.log.OffsetIndexTest > appendOutOfOrder PASSED
kafka.log.OffsetIndexTest > truncate PASSED
722 tests completed, 1 failed
:kafka-trunk-jdk8:core:test FAILED
:test_core_2_11 FAILED
FAILURE: Build failed with an exception.
* What went wrong:
Execution failed for task ':core:test'.
> There were failing tests. See the report at: file://<https://builds.apache.org/job/kafka-trunk-jdk8/ws/core/build/reports/tests/index.html>
* Try:
Run with --stacktrace option to get the stack trace. Run with --info or --debug option to get more log output.
BUILD FAILED
Total time: 55 mins 53.283 secs
Build step 'Execute shell' marked build as failure
Recording test results
Setting JDK1_8_0_45_HOME=/home/jenkins/jenkins-slave/tools/hudson.model.JDK/jdk1.8.0_45
Setting GRADLE_2_4_RC_2_HOME=/home/jenkins/jenkins-slave/tools/hudson.plugins.gradle.GradleInstallation/Gradle_2.4-rc-2
Setting JDK1_8_0_45_HOME=/home/jenkins/jenkins-slave/tools/hudson.model.JDK/jdk1.8.0_45
Setting GRADLE_2_4_RC_2_HOME=/home/jenkins/jenkins-slave/tools/hudson.plugins.gradle.GradleInstallation/Gradle_2.4-rc-2